FailedConsole Output

Skipping 87 KB.. Full Log
f type 'sqInt' (aka 'long') [-Wint-conversion]
[osx]                 genEnsureOopInRegNotForwardedscratchRegifForwarderifNotForwarder(rcvrRegOrNone, TempReg, label, 0);
[osx]                                                                                                          ^~~~~
[osx] /builds/workspace/pharo-vm_headless/generated/vm/src/cogitX64SysV.c:15210:98: note: passing argument to parameter 'fwdJumpTarget' here
[osx] genEnsureOopInRegNotForwardedscratchRegifForwarderifNotForwarder(sqInt reg, sqInt scratch, sqInt fwdJumpTarget, sqInt nonFwdJumpTargetOrZero)
[osx]                                                                                                  ^
[osx] /builds/workspace/pharo-vm_headless/generated/vm/src/cogitX64SysV.c:30914:45: warning: incompatible integer to pointer conversion assigning to 'AbstractInstruction *' (aka 'struct _AbstractInstruction *') from 'unsigned char' [-Wint-conversion]
[osx]                 (self_in_reinitialize->targetInstruction) = ((self_in_reinitialize->simStackPtr) = 0);
[osx]                                                           ^ ~~~~~~~~~~~~~~~~~~~~~~~~~~~~~~~~~~~~~~~~~
[osx] 49 warnings generated.
[osx] [  8%] Building C object CMakeFiles/PharoVMCore.dir/generated/vm/src/gcc3x-cointerp.c.o
[osx] /builds/workspace/pharo-vm_headless/generated/vm/src/gcc3x-cointerp.c:4953:36: warning: expression result unused [-Wunused-value]
[osx]                                                 thePage1 = stackPageAtpages((assert((((((char *) theFP)) >= (GIV(stackBasePlus1) - 1)) && ((((char *) theFP)) <= (((char *) GIV(pages)))))),
[osx]                                                                              ^~~~~~~~~~~~~~~~~~~~~~~~~~~~~~~~~~~~~~~~~~~~~~~~~~~~~~~~~~~~~~~~~~~~~~~~~~~~~~~~~~~~~~~~~~~~~~~~~~~~~~~~~~~~~~
[osx] /builds/workspace/pharo-vm_headless/extracted/vm/include/common/sqAssert.h:19:23: note: expanded from macro 'assert'
[osx] # define assert(expr) 0 /* hack disabling of asserts.  Better in makefile? */
[osx]                       ^
[osx] /builds/workspace/pharo-vm_headless/generated/vm/src/gcc3x-cointerp.c:2602:51: note: expanded from macro 'stackPageAtpages'
[osx] #define stackPageAtpages(index,pages) ((pages) + (index))
[osx]                                                   ^
[osx] /builds/workspace/pharo-vm_headless/generated/vm/src/gcc3x-cointerp.c:5007:33: warning: expression result unused [-Wunused-value]
[osx]                                 newPage = stackPageAtpages((assert((((((char *) frameToReturnTo)) >= (GIV(stackBasePlus1) - 1)) && ((((char *) frameToReturnTo)) <= (((char *) GIV(pages)))))),
[osx]                                                             ^~~~~~~~~~~~~~~~~~~~~~~~~~~~~~~~~~~~~~~~~~~~~~~~~~~~~~~~~~~~~~~~~~~~~~~~~~~~~~~~~~~~~~~~~~~~~~~~~~~~~~~~~~~~~~~~~~~~~~~~~~~~~~~~~~
[osx] /builds/workspace/pharo-vm_headless/extracted/vm/include/common/sqAssert.h:19:23: note: expanded from macro 'assert'
[osx] # define assert(expr) 0 /* hack disabling of asserts.  Better in makefile? */
[osx]                       ^
[osx] /builds/workspace/pharo-vm_headless/generated/vm/src/gcc3x-cointerp.c:2602:51: note: expanded from macro 'stackPageAtpages'
[osx] #define stackPageAtpages(index,pages) ((pages) + (index))
[osx]                                                   ^
[osx] /builds/workspace/pharo-vm_headless/generated/vm/src/gcc3x-cointerp.c:5014:35: warning: expression result unused [-Wunused-value]
[osx]                                         thePage3 = stackPageAtpages((assert((((((char *) theFP2)) >= (GIV(stackBasePlus1) - 1)) && ((((char *) theFP2)) <= (((char *) GIV(pages)))))),
[osx]                                                                      ^~~~~~~~~~~~~~~~~~~~~~~~~~~~~~~~~~~~~~~~~~~~~~~~~~~~~~~~~~~~~~~~~~~~~~~~~~~~~~~~~~~~~~~~~~~~~~~~~~~~~~~~~~~~~~~~
[osx] /builds/workspace/pharo-vm_headless/extracted/vm/include/common/sqAssert.h:19:23: note: expanded from macro 'assert'
[osx] # define assert(expr) 0 /* hack disabling of asserts.  Better in makefile? */
[osx]                       ^
[osx] /builds/workspace/pharo-vm_headless/generated/vm/src/gcc3x-cointerp.c:2602:51: note: expanded from macro 'stackPageAtpages'
[osx] #define stackPageAtpages(index,pages) ((pages) + (index))
[osx]                                                   ^
[osx] /builds/workspace/pharo-vm_headless/generated/vm/src/gcc3x-cointerp.c:5028:36: warning: expression result unused [-Wunused-value]
[osx]                                                         thePage = stackPageAtpages((assert((((((char *) theFP)) >= (GIV(stackBasePlus1) - 1)) && ((((char *) theFP)) <= (((char *) GIV(pages)))))),
[osx]                                                                                     ^~~~~~~~~~~~~~~~~~~~~~~~~~~~~~~~~~~~~~~~~~~~~~~~~~~~~~~~~~~~~~~~~~~~~~~~~~~~~~~~~~~~~~~~~~~~~~~~~~~~~~~~~~~~~~
[osx] /builds/workspace/pharo-vm_headless/extracted/vm/include/common/sqAssert.h:19:23: note: expanded from macro 'assert'
[osx] # define assert(expr) 0 /* hack disabling of asserts.  Better in makefile? */
[osx]                       ^
[osx] /builds/workspace/pharo-vm_headless/generated/vm/src/gcc3x-cointerp.c:2602:51: note: expanded from macro 'stackPageAtpages'
[osx] #define stackPageAtpages(index,pages) ((pages) + (index))
[osx]                                                   ^
[osx] /builds/workspace/pharo-vm_headless/generated/vm/src/gcc3x-cointerp.c:5039:37: warning: expression result unused [-Wunused-value]
[osx]                                                         thePage2 = stackPageAtpages((assert((((((char *) theFP1)) >= (GIV(stackBasePlus1) - 1)) && ((((char *) theFP1)) <= (((char *) GIV(pages)))))),
[osx]                                                                                      ^~~~~~~~~~~~~~~~~~~~~~~~~~~~~~~~~~~~~~~~~~~~~~~~~~~~~~~~~~~~~~~~~~~~~~~~~~~~~~~~~~~~~~~~~~~~~~~~~~~~~~~~~~~~~~~~
[osx] /builds/workspace/pharo-vm_headless/extracted/vm/include/common/sqAssert.h:19:23: note: expanded from macro 'assert'
[osx] # define assert(expr) 0 /* hack disabling of asserts.  Better in makefile? */
[osx]                       ^
[osx] /builds/workspace/pharo-vm_headless/generated/vm/src/gcc3x-cointerp.c:2602:51: note: expanded from macro 'stackPageAtpages'
[osx] #define stackPageAtpages(index,pages) ((pages) + (index))
[osx]                                                   ^
[osx] /builds/workspace/pharo-vm_headless/generated/vm/src/gcc3x-cointerp.c:5209:35: warning: expression result unused [-Wunused-value]
[osx]                                         thePage1 = stackPageAtpages((assert((((((char *) localFP)) >= (GIV(stackBasePlus1) - 1)) && ((((char *) localFP)) <= (((char *) GIV(pages)))))),
[osx]                                                                      ^~~~~~~~~~~~~~~~~~~~~~~~~~~~~~~~~~~~~~~~~~~~~~~~~~~~~~~~~~~~~~~~~~~~~~~~~~~~~~~~~~~~~~~~~~~~~~~~~~~~~~~~~~~~~~~~~~
[osx] /builds/workspace/pharo-vm_headless/extracted/vm/include/common/sqAssert.h:19:23: note: expanded from macro 'assert'
[osx] # define assert(expr) 0 /* hack disabling of asserts.  Better in makefile? */
[osx]                       ^
[osx] /builds/workspace/pharo-vm_headless/generated/vm/src/gcc3x-cointerp.c:2602:51: note: expanded from macro 'stackPageAtpages'
[osx] #define stackPageAtpages(index,pages) ((pages) + (index))
[osx]                                                   ^
[osx] /builds/workspace/pharo-vm_headless/generated/vm/src/gcc3x-cointerp.c:5227:35: warning: expression result unused [-Wunused-value]
[osx]                                                 thePage = stackPageAtpages((assert((((((char *) theFP)) >= (GIV(stackBasePlus1) - 1)) && ((((char *) theFP)) <= (((char *) GIV(pages)))))),
[osx]                                                                             ^~~~~~~~~~~~~~~~~~~~~~~~~~~~~~~~~~~~~~~~~~~~~~~~~~~~~~~~~~~~~~~~~~~~~~~~~~~~~~~~~~~~~~~~~~~~~~~~~~~~~~~~~~~~~~
[osx] /builds/workspace/pharo-vm_headless/extracted/vm/include/common/sqAssert.h:19:23: note: expanded from macro 'assert'
[osx] # define assert(expr) 0 /* hack disabling of asserts.  Better in makefile? */
[osx]                       ^
[osx] /builds/workspace/pharo-vm_headless/generated/vm/src/gcc3x-cointerp.c:2602:51: note: expanded from macro 'stackPageAtpages'
[osx] #define stackPageAtpages(index,pages) ((pages) + (index))
[osx]                                                   ^
[osx] /builds/workspace/pharo-vm_headless/generated/vm/src/gcc3x-cointerp.c:6121:69: warning: expression result unused [-Wunused-value]
[osx]                                                 localIP = pointerForOop(((GIV(newMethod) + ((LiteralStart + ((assert((((methodHeader2) & 7) == 1)),
[osx]                                                                                                               ^~~~~~~~~~~~~~~~~~~~~~~~~~~~~~~~~~~~
[osx] /builds/workspace/pharo-vm_headless/extracted/vm/include/common/sqAssert.h:19:23: note: expanded from macro 'assert'
[osx] # define assert(expr) 0 /* hack disabling of asserts.  Better in makefile? */
[osx]                       ^
[osx] /builds/workspace/pharo-vm_headless/extracted/vm/include/common/sqMemoryAccess.h:217:41: note: expanded from macro 'pointerForOop'
[osx] #  define pointerForOop(oop)            ((char *)(oop))
[osx]                                                   ^
[osx] /builds/workspace/pharo-vm_headless/generated/vm/src/gcc3x-cointerp.c:6265:37: warning: expression result unused [-Wunused-value]
[osx]                                                                 thePage = stackPageAtpages((assert((((((char *) spouseFP)) >= (GIV(stackBasePlus1) - 1)) && ((((char *) spouseFP)) <= (((char *) GIV(pages)))))),
[osx]                                                                                             ^~~~~~~~~~~~~~~~~~~~~~~~~~~~~~~~~~~~~~~~~~~~~~~~~~~~~~~~~~~~~~~~~~~~~~~~~~~~~~~~~~~~~~~~~~~~~~~~~~~~~~~~~~~~~~~~~~~~
[osx] /builds/workspace/pharo-vm_headless/extracted/vm/include/common/sqAssert.h:19:23: note: expanded from macro 'assert'
[osx] # define assert(expr) 0 /* hack disabling of asserts.  Better in makefile? */
[osx]                       ^
[osx] /builds/workspace/pharo-vm_headless/generated/vm/src/gcc3x-cointerp.c:2602:51: note: expanded from macro 'stackPageAtpages'
[osx] #define stackPageAtpages(index,pages) ((pages) + (index))
[osx]                                                   ^
[osx] /builds/workspace/pharo-vm_headless/generated/vm/src/gcc3x-cointerp.c:6439:36: warning: expression result unused [-Wunused-value]
[osx]                                                 thePage1 = stackPageAtpages((assert((((((char *) theFP)) >= (GIV(stackBasePlus1) - 1)) && ((((char *) theFP)) <= (((char *) GIV(pages)))))),
[osx]                                                                              ^~~~~~~~~~~~~~~~~~~~~~~~~~~~~~~~~~~~~~~~~~~~~~~~~~~~~~~~~~~~~~~~~~~~~~~~~~~~~~~~~~~~~~~~~~~~~~~~~~~~~~~~~~~~~~
[osx] /builds/workspace/pharo-vm_headless/extracted/vm/include/common/sqAssert.h:19:23: note: expanded from macro 'assert'
[osx] # define assert(expr) 0 /* hack disabling of asserts.  Better in makefile? */
[osx]                       ^
[osx] /builds/workspace/pharo-vm_headless/generated/vm/src/gcc3x-cointerp.c:2602:51: note: expanded from macro 'stackPageAtpages'
[osx] #define stackPageAtpages(index,pages) ((pages) + (index))
[osx]                                                   ^
[osx] /builds/workspace/pharo-vm_headless/generated/vm/src/gcc3x-cointerp.c:12400:36: warning: expression result unused [-Wunused-value]
[osx]                                                         thePage = stackPageAtpages((assert((((((char *) spouseFP)) >= (GIV(stackBasePlus1) - 1)) && ((((char *) spouseFP)) <= (((char *) GIV(pages)))))),
[osx]                                                                                     ^~~~~~~~~~~~~~~~~~~~~~~~~~~~~~~~~~~~~~~~~~~~~~~~~~~~~~~~~~~~~~~~~~~~~~~~~~~~~~~~~~~~~~~~~~~~~~~~~~~~~~~~~~~~~~~~~~~~
[osx] /builds/workspace/pharo-vm_headless/extracted/vm/include/common/sqAssert.h:19:23: note: expanded from macro 'assert'
[osx] # define assert(expr) 0 /* hack disabling of asserts.  Better in makefile? */
[osx]                       ^
[osx] /builds/workspace/pharo-vm_headless/generated/vm/src/gcc3x-cointerp.c:2602:51: note: expanded from macro 'stackPageAtpages'
[osx] #define stackPageAtpages(index,pages) ((pages) + (index))
[osx]                                                   ^
[osx] /builds/workspace/pharo-vm_headless/generated/vm/src/gcc3x-cointerp.c:12955:35: warning: expression result unused [-Wunused-value]
[osx]                                                 thePage = stackPageAtpages((assert((((((char *) theFP)) >= (GIV(stackBasePlus1) - 1)) && ((((char *) theFP)) <= (((char *) GIV(pages)))))),
[osx]                                                                             ^~~~~~~~~~~~~~~~~~~~~~~~~~~~~~~~~~~~~~~~~~~~~~~~~~~~~~~~~~~~~~~~~~~~~~~~~~~~~~~~~~~~~~~~~~~~~~~~~~~~~~~~~~~~~~
[osx] /builds/workspace/pharo-vm_headless/extracted/vm/include/common/sqAssert.h:19:23: note: expanded from macro 'assert'
[osx] # define assert(expr) 0 /* hack disabling of asserts.  Better in makefile? */
[osx]                       ^
[osx] /builds/workspace/pharo-vm_headless/generated/vm/src/gcc3x-cointerp.c:2602:51: note: expanded from macro 'stackPageAtpages'
[osx] #define stackPageAtpages(index,pages) ((pages) + (index))
[osx]                                                   ^
[osx] /builds/workspace/pharo-vm_headless/generated/vm/src/gcc3x-cointerp.c:13202:35: warning: expression result unused [-Wunused-value]
[osx]                                                 thePage = stackPageAtpages((assert((((((char *) theFP)) >= (GIV(stackBasePlus1) - 1)) && ((((char *) theFP)) <= (((char *) GIV(pages)))))),
[osx]                                                                             ^~~~~~~~~~~~~~~~~~~~~~~~~~~~~~~~~~~~~~~~~~~~~~~~~~~~~~~~~~~~~~~~~~~~~~~~~~~~~~~~~~~~~~~~~~~~~~~~~~~~~~~~~~~~~~
[osx] /builds/workspace/pharo-vm_headless/extracted/vm/include/common/sqAssert.h:19:23: note: expanded from macro 'assert'
[osx] # define assert(expr) 0 /* hack disabling of asserts.  Better in makefile? */
[osx]                       ^
[osx] /builds/workspace/pharo-vm_headless/generated/vm/src/gcc3x-cointerp.c:2602:51: note: expanded from macro 'stackPageAtpages'
[osx] #define stackPageAtpages(index,pages) ((pages) + (index))
[osx]                                                   ^
[osx] /builds/workspace/pharo-vm_headless/generated/vm/src/gcc3x-cointerp.c:13903:27: warning: expression result unused [-Wunused-value]
[osx]         return stackPageAtpages((assert((((((char *) pointer)) >= (GIV(stackBasePlus1) - 1)) && ((((char *) pointer)) <= (((char *) GIV(pages)))))),
[osx]                                  ^~~~~~~~~~~~~~~~~~~~~~~~~~~~~~~~~~~~~~~~~~~~~~~~~~~~~~~~~~~~~~~~~~~~~~~~~~~~~~~~~~~~~~~~~~~~~~~~~~~~~~~~~~~~~~~~~~
[osx] /builds/workspace/pharo-vm_headless/extracted/vm/include/common/sqAssert.h:19:23: note: expanded from macro 'assert'
[osx] # define assert(expr) 0 /* hack disabling of asserts.  Better in makefile? */
[osx]                       ^
[osx] /builds/workspace/pharo-vm_headless/generated/vm/src/gcc3x-cointerp.c:2602:51: note: expanded from macro 'stackPageAtpages'
[osx] #define stackPageAtpages(index,pages) ((pages) + (index))
[osx]                                                   ^
[osx] /builds/workspace/pharo-vm_headless/generated/vm/src/gcc3x-cointerp.c:14810:31: warning: expression result unused [-Wunused-value]
[osx]                 thePage = stackPageAtpages((assert((((((char *) GIV(framePointer))) >= (GIV(stackBasePlus1) - 1)) && ((((char *) GIV(framePointer))) <= (((char *) GIV(pages)))))),
[osx]                                             ^~~~~~~~~~~~~~~~~~~~~~~~~~~~~~~~~~~~~~~~~~~~~~~~~~~~~~~~~~~~~~~~~~~~~~~~~~~~~~~~~~~~~~~~~~~~~~~~~~~~~~~~~~~~~~~~~~~~~~~~~~~~~~~~~~~~~~
[osx] /builds/workspace/pharo-vm_headless/extracted/vm/include/common/sqAssert.h:19:23: note: expanded from macro 'assert'
[osx] # define assert(expr) 0 /* hack disabling of asserts.  Better in makefile? */
[osx]                       ^
[osx] /builds/workspace/pharo-vm_headless/generated/vm/src/gcc3x-cointerp.c:2602:51: note: expanded from macro 'stackPageAtpages'
[osx] #define stackPageAtpages(index,pages) ((pages) + (index))
[osx]                                                   ^
[osx] /builds/workspace/pharo-vm_headless/generated/vm/src/gcc3x-cointerp.c:15420:33: warning: expression result unused [-Wunused-value]
[osx]                         thePage1 = stackPageAtpages((assert((((((char *) theFP)) >= (GIV(stackBasePlus1) - 1)) && ((((char *) theFP)) <= (((char *) GIV(pages)))))),
[osx]                                                      ^~~~~~~~~~~~~~~~~~~~~~~~~~~~~~~~~~~~~~~~~~~~~~~~~~~~~~~~~~~~~~~~~~~~~~~~~~~~~~~~~~~~~~~~~~~~~~~~~~~~~~~~~~~~~~
[osx] /builds/workspace/pharo-vm_headless/extracted/vm/include/common/sqAssert.h:19:23: note: expanded from macro 'assert'
[osx] # define assert(expr) 0 /* hack disabling of asserts.  Better in makefile? */
[osx]                       ^
[osx] /builds/workspace/pharo-vm_headless/generated/vm/src/gcc3x-cointerp.c:2602:51: note: expanded from macro 'stackPageAtpages'
[osx] #define stackPageAtpages(index,pages) ((pages) + (index))
[osx]                                                   ^
[osx] /builds/workspace/pharo-vm_headless/generated/vm/src/gcc3x-cointerp.c:15476:30: warning: expression result unused [-Wunused-value]
[osx]         newPage = stackPageAtpages((assert((((((char *) frameToReturnTo)) >= (GIV(stackBasePlus1) - 1)) && ((((char *) frameToReturnTo)) <= (((char *) GIV(pages)))))),
[osx]                                     ^~~~~~~~~~~~~~~~~~~~~~~~~~~~~~~~~~~~~~~~~~~~~~~~~~~~~~~~~~~~~~~~~~~~~~~~~~~~~~~~~~~~~~~~~~~~~~~~~~~~~~~~~~~~~~~~~~~~~~~~~~~~~~~~~~
[osx] /builds/workspace/pharo-vm_headless/extracted/vm/include/common/sqAssert.h:19:23: note: expanded from macro 'assert'
[osx] # define assert(expr) 0 /* hack disabling of asserts.  Better in makefile? */
[osx]                       ^
[osx] /builds/workspace/pharo-vm_headless/generated/vm/src/gcc3x-cointerp.c:2602:51: note: expanded from macro 'stackPageAtpages'
[osx] #define stackPageAtpages(index,pages) ((pages) + (index))
[osx]                                                   ^
[osx] /builds/workspace/pharo-vm_headless/generated/vm/src/gcc3x-cointerp.c:15483:32: warning: expression result unused [-Wunused-value]
[osx]                 thePage3 = stackPageAtpages((assert((((((char *) theFP5)) >= (GIV(stackBasePlus1) - 1)) && ((((char *) theFP5)) <= (((char *) GIV(pages)))))),
[osx]                                              ^~~~~~~~~~~~~~~~~~~~~~~~~~~~~~~~~~~~~~~~~~~~~~~~~~~~~~~~~~~~~~~~~~~~~~~~~~~~~~~~~~~~~~~~~~~~~~~~~~~~~~~~~~~~~~~~
[osx] /builds/workspace/pharo-vm_headless/extracted/vm/include/common/sqAssert.h:19:23: note: expanded from macro 'assert'
[osx] # define assert(expr) 0 /* hack disabling of asserts.  Better in makefile? */
[osx]                       ^
[osx] /builds/workspace/pharo-vm_headless/generated/vm/src/gcc3x-cointerp.c:2602:51: note: expanded from macro 'stackPageAtpages'
[osx] #define stackPageAtpages(index,pages) ((pages) + (index))
[osx]                                                   ^
[osx] /builds/workspace/pharo-vm_headless/generated/vm/src/gcc3x-cointerp.c:15498:33: warning: expression result unused [-Wunused-value]
[osx]                                 thePage = stackPageAtpages((assert((((((char *) theFP)) >= (GIV(stackBasePlus1) - 1)) && ((((char *) theFP)) <= (((char *) GIV(pages)))))),
[osx]                                                             ^~~~~~~~~~~~~~~~~~~~~~~~~~~~~~~~~~~~~~~~~~~~~~~~~~~~~~~~~~~~~~~~~~~~~~~~~~~~~~~~~~~~~~~~~~~~~~~~~~~~~~~~~~~~~~
[osx] /builds/workspace/pharo-vm_headless/extracted/vm/include/common/sqAssert.h:19:23: note: expanded from macro 'assert'
[osx] # define assert(expr) 0 /* hack disabling of asserts.  Better in makefile? */
[osx]                       ^
[osx] /builds/workspace/pharo-vm_headless/generated/vm/src/gcc3x-cointerp.c:2602:51: note: expanded from macro 'stackPageAtpages'
[osx] #define stackPageAtpages(index,pages) ((pages) + (index))
[osx]                                                   ^
[osx] /builds/workspace/pharo-vm_headless/generated/vm/src/gcc3x-cointerp.c:15504:34: warning: expression result unused [-Wunused-value]
[osx]                                 thePage2 = stackPageAtpages((assert((((((char *) theFP4)) >= (GIV(stackBasePlus1) - 1)) && ((((char *) theFP4)) <= (((char *) GIV(pages)))))),
[osx]                                                              ^~~~~~~~~~~~~~~~~~~~~~~~~~~~~~~~~~~~~~~~~~~~~~~~~~~~~~~~~~~~~~~~~~~~~~~~~~~~~~~~~~~~~~~~~~~~~~~~~~~~~~~~~~~~~~~~
[osx] /builds/workspace/pharo-vm_headless/extracted/vm/include/common/sqAssert.h:19:23: note: expanded from macro 'assert'
[osx] # define assert(expr) 0 /* hack disabling of asserts.  Better in makefile? */
[osx]                       ^
[osx] /builds/workspace/pharo-vm_headless/generated/vm/src/gcc3x-cointerp.c:2602:51: note: expanded from macro 'stackPageAtpages'
[osx] #define stackPageAtpages(index,pages) ((pages) + (index))
[osx]                                                   ^
[osx] /builds/workspace/pharo-vm_headless/generated/vm/src/gcc3x-cointerp.c:17790:30: warning: expression result unused [-Wunused-value]
[osx]         thePage = stackPageAtpages((assert((((((char *) theFP)) >= (GIV(stackBasePlus1) - 1)) && ((((char *) theFP)) <= (((char *) GIV(pages)))))),
[osx]                                     ^~~~~~~~~~~~~~~~~~~~~~~~~~~~~~~~~~~~~~~~~~~~~~~~~~~~~~~~~~~~~~~~~~~~~~~~~~~~~~~~~~~~~~~~~~~~~~~~~~~~~~~~~~~~~~
[osx] /builds/workspace/pharo-vm_headless/extracted/vm/include/common/sqAssert.h:19:23: note: expanded from macro 'assert'
[osx] # define assert(expr) 0 /* hack disabling of asserts.  Better in makefile? */
[osx]                       ^
[osx] /builds/workspace/pharo-vm_headless/generated/vm/src/gcc3x-cointerp.c:2602:51: note: expanded from macro 'stackPageAtpages'
[osx] #define stackPageAtpages(index,pages) ((pages) + (index))
[osx]                                                   ^
[osx] /builds/workspace/pharo-vm_headless/generated/vm/src/gcc3x-cointerp.c:18170:31: warning: expression result unused [-Wunused-value]
[osx]                 thePage = stackPageAtpages((assert((((((char *) spouseFP)) >= (GIV(stackBasePlus1) - 1)) && ((((char *) spouseFP)) <= (((char *) GIV(pages)))))),
[osx]                                             ^~~~~~~~~~~~~~~~~~~~~~~~~~~~~~~~~~~~~~~~~~~~~~~~~~~~~~~~~~~~~~~~~~~~~~~~~~~~~~~~~~~~~~~~~~~~~~~~~~~~~~~~~~~~~~~~~~~~
[osx] /builds/workspace/pharo-vm_headless/extracted/vm/include/common/sqAssert.h:19:23: note: expanded from macro 'assert'
[osx] # define assert(expr) 0 /* hack disabling of asserts.  Better in makefile? */
[osx]                       ^
[osx] /builds/workspace/pharo-vm_headless/generated/vm/src/gcc3x-cointerp.c:2602:51: note: expanded from macro 'stackPageAtpages'
[osx] #define stackPageAtpages(index,pages) ((pages) + (index))
[osx]                                                   ^
[osx] /builds/workspace/pharo-vm_headless/generated/vm/src/gcc3x-cointerp.c:18311:4: warning: expression result unused [-Wunused-value]
[osx]                         !GIV(primFailCode);
[osx]                         ^    ~~~~~~~~~~~~
[osx] /builds/workspace/pharo-vm_headless/generated/vm/src/gcc3x-cointerp.c:18625:99: warning: expression result unused [-Wunused-value]
[osx]         longAtput((aContext + BaseHeaderSize) + (((sqInt)((usqInt)(SenderIndex) << (shiftForWord())))), (assert(((oopForPointer((page->baseFP))) & (BytesPerWord - 1)) == 0),
[osx]                                                                                                          ^~~~~~~~~~~~~~~~~~~~~~~~~~~~~~~~~~~~~~~~~~~~~~~~~~~~~~~~~~~~~~~~~~~
[osx] /builds/workspace/pharo-vm_headless/extracted/vm/include/common/sqAssert.h:19:23: note: expanded from macro 'assert'
[osx] # define assert(expr) 0 /* hack disabling of asserts.  Better in makefile? */
[osx]                       ^
[osx] /builds/workspace/pharo-vm_headless/extracted/vm/include/common/sqMemoryAccess.h:230:67: note: expanded from macro 'longAtput'
[osx] # define longAtput(oop,val)                     longAtPointerput(atPointerArg(oop), val)
[osx]                                                                                     ^
[osx] /builds/workspace/pharo-vm_headless/extracted/vm/include/common/sqMemoryAccess.h:205:62: note: expanded from macro 'longAtPointerput'
[osx] # define longAtPointerput(ptr,val)      (*(sqInt *)(ptr)= (sqInt)(val))
[osx]                                                                   ^
[osx] /builds/workspace/pharo-vm_headless/generated/vm/src/gcc3x-cointerp.c:18629:111: warning: expression result unused [-Wunused-value]
[osx]         longAtput((aContext + BaseHeaderSize) + (((sqInt)((usqInt)(InstructionPointerIndex) << (shiftForWord())))), (assert(((oopForPointer(0)) & (BytesPerWord - 1)) == 0),
[osx]                                                                                                                      ^~~~~~~~~~~~~~~~~~~~~~~~~~~~~~~~~~~~~~~~~~~~~~~~~~~~~~
[osx] /builds/workspace/pharo-vm_headless/extracted/vm/include/common/sqAssert.h:19:23: note: expanded from macro 'assert'
[osx] # define assert(expr) 0 /* hack disabling of asserts.  Better in makefile? */
[osx]                       ^
[osx] /builds/workspace/pharo-vm_headless/extracted/vm/include/common/sqMemoryAccess.h:230:67: note: expanded from macro 'longAtput'
[osx] # define longAtput(oop,val)                     longAtPointerput(atPointerArg(oop), val)
[osx]                                                                                     ^
[osx] /builds/workspace/pharo-vm_headless/extracted/vm/include/common/sqMemoryAccess.h:205:62: note: expanded from macro 'longAtPointerput'
[osx] # define longAtPointerput(ptr,val)      (*(sqInt *)(ptr)= (sqInt)(val))
[osx]                                                                   ^
[osx] /builds/workspace/pharo-vm_headless/generated/vm/src/gcc3x-cointerp.c:19084:10: warning: incompatible pointer to integer conversion returning 'sqInt (sqInt)' from a function with result type 'sqInt' (aka 'long') [-Wint-conversion]
[osx]                 return mcprimHashMultiply;
[osx]                        ^~~~~~~~~~~~~~~~~~
[osx] /builds/workspace/pharo-vm_headless/generated/vm/src/gcc3x-cointerp.c:19530:103: warning: expression result unused [-Wunused-value]
[osx]                         longAtput((theContext + BaseHeaderSize) + (((sqInt)((usqInt)(SenderIndex) << (shiftForWord())))), (assert(((oopForPointer(fpInNewPage)) & (BytesPerWord - 1)) == 0),
[osx]                                                                                                                            ^~~~~~~~~~~~~~~~~~~~~~~~~~~~~~~~~~~~~~~~~~~~~~~~~~~~~~~~~~~~~~~~
[osx] /builds/workspace/pharo-vm_headless/extracted/vm/include/common/sqAssert.h:19:23: note: expanded from macro 'assert'
[osx] # define assert(expr) 0 /* hack disabling of asserts.  Better in makefile? */
[osx]                       ^
[osx] /builds/workspace/pharo-vm_headless/extracted/vm/include/common/sqMemoryAccess.h:230:67: note: expanded from macro 'longAtput'
[osx] # define longAtput(oop,val)                     longAtPointerput(atPointerArg(oop), val)
[osx]                                                                                     ^
[osx] /builds/workspace/pharo-vm_headless/extracted/vm/include/common/sqMemoryAccess.h:205:62: note: expanded from macro 'longAtPointerput'
[osx] # define longAtPointerput(ptr,val)      (*(sqInt *)(ptr)= (sqInt)(val))
[osx]                                                                   ^
[osx] /builds/workspace/pharo-vm_headless/generated/vm/src/gcc3x-cointerp.c:19534:115: warning: expression result unused [-Wunused-value]
[osx]                         longAtput((theContext + BaseHeaderSize) + (((sqInt)((usqInt)(InstructionPointerIndex) << (shiftForWord())))), (assert(((oopForPointer(offsetCallerFP)) & (BytesPerWord - 1)) == 0),
[osx]                                                                                                                                        ^~~~~~~~~~~~~~~~~~~~~~~~~~~~~~~~~~~~~~~~~~~~~~~~~~~~~~~~~~~~~~~~~~~
[osx] /builds/workspace/pharo-vm_headless/extracted/vm/include/common/sqAssert.h:19:23: note: expanded from macro 'assert'
[osx] # define assert(expr) 0 /* hack disabling of asserts.  Better in makefile? */
[osx]                       ^
[osx] /builds/workspace/pharo-vm_headless/extracted/vm/include/common/sqMemoryAccess.h:230:67: note: expanded from macro 'longAtput'
[osx] # define longAtput(oop,val)                     longAtPointerput(atPointerArg(oop), val)
[osx]                                                                                     ^
[osx] /builds/workspace/pharo-vm_headless/extracted/vm/include/common/sqMemoryAccess.h:205:62: note: expanded from macro 'longAtPointerput'
[osx] # define longAtPointerput(ptr,val)      (*(sqInt *)(ptr)= (sqInt)(val))
[osx]                                                                   ^
[osx] /builds/workspace/pharo-vm_headless/generated/vm/src/gcc3x-cointerp.c:19990:33: warning: comparison between pointer and integer ('sqInt' (aka 'long') and 'void (*)()')
[osx]                  && (GIV(disabledFFIFunction) == primitiveFunctionPointer)) {
[osx]                          ~~~~~~~~~~~~~~~~~~~  ^  ~~~~~~~~~~~~~~~~~~~~~~~~
[osx] /builds/workspace/pharo-vm_headless/generated/vm/src/gcc3x-cointerp.c:22546:31: warning: expression result unused [-Wunused-value]
[osx]                 thePage = stackPageAtpages((assert((((((char *) theFrame)) >= (GIV(stackBasePlus1) - 1)) && ((((char *) theFrame)) <= (((char *) GIV(pages)))))),
[osx]                                             ^~~~~~~~~~~~~~~~~~~~~~~~~~~~~~~~~~~~~~~~~~~~~~~~~~~~~~~~~~~~~~~~~~~~~~~~~~~~~~~~~~~~~~~~~~~~~~~~~~~~~~~~~~~~~~~~~~~~
[osx] /builds/workspace/pharo-vm_headless/extracted/vm/include/common/sqAssert.h:19:23: note: expanded from macro 'assert'
[osx] # define assert(expr) 0 /* hack disabling of asserts.  Better in makefile? */
[osx]                       ^
[osx] /builds/workspace/pharo-vm_headless/generated/vm/src/gcc3x-cointerp.c:2602:51: note: expanded from macro 'stackPageAtpages'
[osx] #define stackPageAtpages(index,pages) ((pages) + (index))
[osx]                                                   ^
[osx] /builds/workspace/pharo-vm_headless/generated/vm/src/gcc3x-cointerp.c:24235:36: warning: expression result unused [-Wunused-value]
[osx]                 pageToStopOn = stackPageAtpages((assert((((((char *) contextsFP)) >= (GIV(stackBasePlus1) - 1)) && ((((char *) contextsFP)) <= (((char *) GIV(pages)))))),
[osx]                                                  ^~~~~~~~~~~~~~~~~~~~~~~~~~~~~~~~~~~~~~~~~~~~~~~~~~~~~~~~~~~~~~~~~~~~~~~~~~~~~~~~~~~~~~~~~~~~~~~~~~~~~~~~~~~~~~~~~~~~~~~~
[osx] /builds/workspace/pharo-vm_headless/extracted/vm/include/common/sqAssert.h:19:23: note: expanded from macro 'assert'
[osx] # define assert(expr) 0 /* hack disabling of asserts.  Better in makefile? */
[osx]                       ^
[osx] /builds/workspace/pharo-vm_headless/generated/vm/src/gcc3x-cointerp.c:2602:51: note: expanded from macro 'stackPageAtpages'
[osx] #define stackPageAtpages(index,pages) ((pages) + (index))
[osx]                                                   ^
[osx] /builds/workspace/pharo-vm_headless/generated/vm/src/gcc3x-cointerp.c:24294:101: warning: expression result unused [-Wunused-value]
[osx]                                 longAtput((thisCtx + BaseHeaderSize) + (((sqInt)((usqInt)(SenderIndex) << (shiftForWord())))), (assert(((oopForPointer(newFP)) & (BytesPerWord - 1)) == 0),
[osx]                                                                                                                                 ^~~~~~~~~~~~~~~~~~~~~~~~~~~~~~~~~~~~~~~~~~~~~~~~~~~~~~~~~~
[osx] /builds/workspace/pharo-vm_headless/extracted/vm/include/common/sqAssert.h:19:23: note: expanded from macro 'assert'
[osx] # define assert(expr) 0 /* hack disabling of asserts.  Better in makefile? */
[osx]                       ^
[osx] /builds/workspace/pharo-vm_headless/extracted/vm/include/common/sqMemoryAccess.h:230:67: note: expanded from macro 'longAtput'
[osx] # define longAtput(oop,val)                     longAtPointerput(atPointerArg(oop), val)
[osx]                                                                                     ^
[osx] /builds/workspace/pharo-vm_headless/extracted/vm/include/common/sqMemoryAccess.h:205:62: note: expanded from macro 'longAtPointerput'
[osx] # define longAtPointerput(ptr,val)      (*(sqInt *)(ptr)= (sqInt)(val))
[osx]                                                                   ^
[osx] /builds/workspace/pharo-vm_headless/generated/vm/src/gcc3x-cointerp.c:24298:113: warning: expression result unused [-Wunused-value]
[osx]                                 longAtput((thisCtx + BaseHeaderSize) + (((sqInt)((usqInt)(InstructionPointerIndex) << (shiftForWord())))), (assert(((oopForPointer(contextsFP)) & (BytesPerWord - 1)) == 0),
[osx]                                                                                                                                             ^~~~~~~~~~~~~~~~~~~~~~~~~~~~~~~~~~~~~~~~~~~~~~~~~~~~~~~~~~~~~~~
[osx] /builds/workspace/pharo-vm_headless/extracted/vm/include/common/sqAssert.h:19:23: note: expanded from macro 'assert'
[osx] # define assert(expr) 0 /* hack disabling of asserts.  Better in makefile? */
[osx]                       ^
[osx] /builds/workspace/pharo-vm_headless/extracted/vm/include/common/sqMemoryAccess.h:230:67: note: expanded from macro 'longAtput'
[osx] # define longAtput(oop,val)                     longAtPointerput(atPointerArg(oop), val)
[osx]                                                                                     ^
[osx] /builds/workspace/pharo-vm_headless/extracted/vm/include/common/sqMemoryAccess.h:205:62: note: expanded from macro 'longAtPointerput'
[osx] # define longAtPointerput(ptr,val)      (*(sqInt *)(ptr)= (sqInt)(val))
[osx]                                                                   ^
[osx] /builds/workspace/pharo-vm_headless/generated/vm/src/gcc3x-cointerp.c:24316:32: warning: expression result unused [-Wunused-value]
[osx]                 thePage1 = stackPageAtpages((assert((((((char *) theFP)) >= (GIV(stackBasePlus1) - 1)) && ((((char *) theFP)) <= (((char *) GIV(pages)))))),
[osx]                                              ^~~~~~~~~~~~~~~~~~~~~~~~~~~~~~~~~~~~~~~~~~~~~~~~~~~~~~~~~~~~~~~~~~~~~~~~~~~~~~~~~~~~~~~~~~~~~~~~~~~~~~~~~~~~~~
[osx] /builds/workspace/pharo-vm_headless/extracted/vm/include/common/sqAssert.h:19:23: note: expanded from macro 'assert'
[osx] # define assert(expr) 0 /* hack disabling of asserts.  Better in makefile? */
[osx]                       ^
[osx] /builds/workspace/pharo-vm_headless/generated/vm/src/gcc3x-cointerp.c:2602:51: note: expanded from macro 'stackPageAtpages'
[osx] #define stackPageAtpages(index,pages) ((pages) + (index))
[osx]                                                   ^
[osx] /builds/workspace/pharo-vm_headless/generated/vm/src/gcc3x-cointerp.c:24331:37: warning: expression result unused [-Wunused-value]
[osx]                         pageToStopOn = stackPageAtpages((assert((((((char *) contextsFP)) >= (GIV(stackBasePlus1) - 1)) && ((((char *) contextsFP)) <= (((char *) GIV(pages)))))),
[osx]                                                          ^~~~~~~~~~~~~~~~~~~~~~~~~~~~~~~~~~~~~~~~~~~~~~~~~~~~~~~~~~~~~~~~~~~~~~~~~~~~~~~~~~~~~~~~~~~~~~~~~~~~~~~~~~~~~~~~~~~~~~~~
[osx] /builds/workspace/pharo-vm_headless/extracted/vm/include/common/sqAssert.h:19:23: note: expanded from macro 'assert'
[osx] # define assert(expr) 0 /* hack disabling of asserts.  Better in makefile? */
[osx]                       ^
[osx] /builds/workspace/pharo-vm_headless/generated/vm/src/gcc3x-cointerp.c:2602:51: note: expanded from macro 'stackPageAtpages'
[osx] #define stackPageAtpages(index,pages) ((pages) + (index))
[osx]                                                   ^
[osx] /builds/workspace/pharo-vm_headless/generated/vm/src/gcc3x-cointerp.c:24354:33: warning: expression result unused [-Wunused-value]
[osx]                                 thePage = stackPageAtpages((assert((((((char *) theFP)) >= (GIV(stackBasePlus1) - 1)) && ((((char *) theFP)) <= (((char *) GIV(pages)))))),
[osx]                                                             ^~~~~~~~~~~~~~~~~~~~~~~~~~~~~~~~~~~~~~~~~~~~~~~~~~~~~~~~~~~~~~~~~~~~~~~~~~~~~~~~~~~~~~~~~~~~~~~~~~~~~~~~~~~~~~
[osx] /builds/workspace/pharo-vm_headless/extracted/vm/include/common/sqAssert.h:19:23: note: expanded from macro 'assert'
[osx] # define assert(expr) 0 /* hack disabling of asserts.  Better in makefile? */
[osx]                       ^
[osx] /builds/workspace/pharo-vm_headless/generated/vm/src/gcc3x-cointerp.c:2602:51: note: expanded from macro 'stackPageAtpages'
[osx] #define stackPageAtpages(index,pages) ((pages) + (index))
[osx]                                                   ^
[osx] /builds/workspace/pharo-vm_headless/generated/vm/src/gcc3x-cointerp.c:24385:40: warning: expression result unused [-Wunused-value]
[osx]                                                 pageToStopOn = stackPageAtpages((assert((((((char *) contextsFP)) >= (GIV(stackBasePlus1) - 1)) && ((((char *) contextsFP)) <= (((char *) GIV(pages)))))),
[osx]                                                                                  ^~~~~~~~~~~~~~~~~~~~~~~~~~~~~~~~~~~~~~~~~~~~~~~~~~~~~~~~~~~~~~~~~~~~~~~~~~~~~~~~~~~~~~~~~~~~~~~~~~~~~~~~~~~~~~~~~~~~~~~~
[osx] /builds/workspace/pharo-vm_headless/extracted/vm/include/common/sqAssert.h:19:23: note: expanded from macro 'assert'
[osx] # define assert(expr) 0 /* hack disabling of asserts.  Better in makefile? */
[osx]                       ^
[osx] /builds/workspace/pharo-vm_headless/generated/vm/src/gcc3x-cointerp.c:2602:51: note: expanded from macro 'stackPageAtpages'
[osx] #define stackPageAtpages(index,pages) ((pages) + (index))
[osx]                                                   ^
[osx] /builds/workspace/pharo-vm_headless/generated/vm/src/gcc3x-cointerp.c:24436:36: warning: expression result unused [-Wunused-value]
[osx]                                                 thePage2 = stackPageAtpages((assert((((((char *) theFP1)) >= (GIV(stackBasePlus1) - 1)) && ((((char *) theFP1)) <= (((char *) GIV(pages)))))),
[osx]                                                                              ^~~~~~~~~~~~~~~~~~~~~~~~~~~~~~~~~~~~~~~~~~~~~~~~~~~~~~~~~~~~~~~~~~~~~~~~~~~~~~~~~~~~~~~~~~~~~~~~~~~~~~~~~~~~~~~~
[osx] /builds/workspace/pharo-vm_headless/extracted/vm/include/common/sqAssert.h:19:23: note: expanded from macro 'assert'
[osx] # define assert(expr) 0 /* hack disabling of asserts.  Better in makefile? */
[osx]                       ^
[osx] /builds/workspace/pharo-vm_headless/generated/vm/src/gcc3x-cointerp.c:2602:51: note: expanded from macro 'stackPageAtpages'
[osx] #define stackPageAtpages(index,pages) ((pages) + (index))
[osx]                                                   ^
[osx] /builds/workspace/pharo-vm_headless/generated/vm/src/gcc3x-cointerp.c:24824:30: warning: expression result unused [-Wunused-value]
[osx]         thePage = stackPageAtpages((assert((((((char *) theFrame)) >= (GIV(stackBasePlus1) - 1)) && ((((char *) theFrame)) <= (((char *) GIV(pages)))))),
[osx]                                     ^~~~~~~~~~~~~~~~~~~~~~~~~~~~~~~~~~~~~~~~~~~~~~~~~~~~~~~~~~~~~~~~~~~~~~~~~~~~~~~~~~~~~~~~~~~~~~~~~~~~~~~~~~~~~~~~~~~~
[osx] /builds/workspace/pharo-vm_headless/extracted/vm/include/common/sqAssert.h:19:23: note: expanded from macro 'assert'
[osx] # define assert(expr) 0 /* hack disabling of asserts.  Better in makefile? */
[osx]                       ^
[osx] /builds/workspace/pharo-vm_headless/generated/vm/src/gcc3x-cointerp.c:2602:51: note: expanded from macro 'stackPageAtpages'
[osx] #define stackPageAtpages(index,pages) ((pages) + (index))
[osx]                                                   ^
[osx] /builds/workspace/pharo-vm_headless/generated/vm/src/gcc3x-cointerp.c:25066:27: warning: incompatible pointer to integer conversion assigning to 'sqInt' (aka 'long') from 'void *' [-Wint-conversion]
[osx]         GIV(disabledFFIFunction) = aFunction;
[osx]                                  ^ ~~~~~~~~~
[osx] /builds/workspace/pharo-vm_headless/generated/vm/src/gcc3x-cointerp.c:43422:203: warning: data argument not used by format string [-Wformat-extra-args]
[osx]                 : "\ttenure below 0x%" PRIxSQINT "/%" PRIdSQINT " %s\n"), (GIV(scavengeLogRecord).tTenureThreshold), (GIV(scavengeLogRecord).tTenureThreshold), policyNames[(GIV(scavengeLogRecord).tTenureCriterion)], (GIV(scavengeLogRecord).tRefCountToShrinkRT));
[osx]                   ~~~~~~~~~~~~~~~~~~~~~~~~~~~~~~~~~~~~~~~~~~~~~~~~~~~~~                                                                                                                                                 ^
[osx] /builds/workspace/pharo-vm_headless/generated/vm/src/gcc3x-cointerp.c:51884:5: warning: expression result unused [-Wunused-value]
[osx]                                 -classIndex2;
[osx]                                 ^~~~~~~~~~~~
[osx] /builds/workspace/pharo-vm_headless/generated/vm/src/gcc3x-cointerp.c:51948:26: warning: expression result unused [-Wunused-value]
[osx]                 8 /* allocationUnit */ / BytesPerOop;
[osx]                 ~                      ^ ~~~~~~~~~~~
[osx] /builds/workspace/pharo-vm_headless/generated/vm/src/gcc3x-cointerp.c:57851:41: warning: expression result unused [-Wunused-value]
[osx]                 asserta((checkInterpreterIntegrity()) == 0);
[osx]                         ~~~~~~~~~~~~~~~~~~~~~~~~~~~~~ ^  ~
[osx] /builds/workspace/pharo-vm_headless/extracted/vm/include/common/sqAssert.h:20:25: note: expanded from macro 'asserta'
[osx] # define asserta(expr) (expr)
[osx]                         ^
[osx] /builds/workspace/pharo-vm_headless/generated/vm/src/gcc3x-cointerp.c:57872:41: warning: expression result unused [-Wunused-value]
[osx]                 asserta((checkInterpreterIntegrity()) == 0);
[osx]                         ~~~~~~~~~~~~~~~~~~~~~~~~~~~~~ ^  ~
[osx] /builds/workspace/pharo-vm_headless/extracted/vm/include/common/sqAssert.h:20:25: note: expanded from macro 'asserta'
[osx] # define asserta(expr) (expr)
[osx]                         ^
[osx] /builds/workspace/pharo-vm_headless/generated/vm/src/gcc3x-cointerp.c:61235:108: warning: passing 'usqInt *' (aka 'unsigned long *') to parameter of type 'sqInt *' (aka 'long *') converts between pointers to integer types with different sign [-Wpointer-sign]
[osx]         segAddress = sqAllocateMemorySegmentOfSizeAboveAllocatedSizeInto(ammount, firstGapOfSizeAtLeast(ammount), (&allocatedSize));
[osx]                                                                                                                   ^~~~~~~~~~~~~~~~
[osx] /builds/workspace/pharo-vm_headless/extracted/vm/include/common/sq.h:100:98: note: passing argument to parameter 'asp' here
[osx] extern void *sqAllocateMemorySegmentOfSizeAboveAllocatedSizeInto(sqInt sz, void *minAddr, sqInt *asp);
[osx]                                                                                                  ^
[osx] /builds/workspace/pharo-vm_headless/generated/vm/src/gcc3x-cointerp.c:62813:30: warning: expression result unused [-Wunused-value]
[osx]         thePage = stackPageAtpages((assert((((((char *) maybeFP)) >= (GIV(stackBasePlus1) - 1)) && ((((char *) maybeFP)) <= (((char *) GIV(pages)))))),
[osx]                                     ^~~~~~~~~~~~~~~~~~~~~~~~~~~~~~~~~~~~~~~~~~~~~~~~~~~~~~~~~~~~~~~~~~~~~~~~~~~~~~~~~~~~~~~~~~~~~~~~~~~~~~~~~~~~~~~~~~
[osx] /builds/workspace/pharo-vm_headless/extracted/vm/include/common/sqAssert.h:19:23: note: expanded from macro 'assert'
[osx] # define assert(expr) 0 /* hack disabling of asserts.  Better in makefile? */
[osx]                       ^
[osx] /builds/workspace/pharo-vm_headless/generated/vm/src/gcc3x-cointerp.c:2602:51: note: expanded from macro 'stackPageAtpages'
[osx] #define stackPageAtpages(index,pages) ((pages) + (index))
[osx]                                                   ^
[osx] /builds/workspace/pharo-vm_headless/generated/vm/src/gcc3x-cointerp.c:63079:30: warning: expression result unused [-Wunused-value]
[osx]         thePage = stackPageAtpages((assert((((((char *) theFP)) >= (GIV(stackBasePlus1) - 1)) && ((((char *) theFP)) <= (((char *) GIV(pages)))))),
[osx]                                     ^~~~~~~~~~~~~~~~~~~~~~~~~~~~~~~~~~~~~~~~~~~~~~~~~~~~~~~~~~~~~~~~~~~~~~~~~~~~~~~~~~~~~~~~~~~~~~~~~~~~~~~~~~~~~~
[osx] /builds/workspace/pharo-vm_headless/extracted/vm/include/common/sqAssert.h:19:23: note: expanded from macro 'assert'
[osx] # define assert(expr) 0 /* hack disabling of asserts.  Better in makefile? */
[osx]                       ^
[osx] /builds/workspace/pharo-vm_headless/generated/vm/src/gcc3x-cointerp.c:2602:51: note: expanded from macro 'stackPageAtpages'
[osx] #define stackPageAtpages(index,pages) ((pages) + (index))
[osx]                                                   ^
[osx] /builds/workspace/pharo-vm_headless/generated/vm/src/gcc3x-cointerp.c:63559:30: warning: expression result unused [-Wunused-value]
[osx]         thePage = stackPageAtpages((assert((((((char *) calleeFP)) >= (GIV(stackBasePlus1) - 1)) && ((((char *) calleeFP)) <= (((char *) GIV(pages)))))),
[osx]                                     ^~~~~~~~~~~~~~~~~~~~~~~~~~~~~~~~~~~~~~~~~~~~~~~~~~~~~~~~~~~~~~~~~~~~~~~~~~~~~~~~~~~~~~~~~~~~~~~~~~~~~~~~~~~~~~~~~~~~
[osx] /builds/workspace/pharo-vm_headless/extracted/vm/include/common/sqAssert.h:19:23: note: expanded from macro 'assert'
[osx] # define assert(expr) 0 /* hack disabling of asserts.  Better in makefile? */
[osx]                       ^
[osx] /builds/workspace/pharo-vm_headless/generated/vm/src/gcc3x-cointerp.c:2602:51: note: expanded from macro 'stackPageAtpages'
[osx] #define stackPageAtpages(index,pages) ((pages) + (index))
[osx]                                                   ^
[osx] /builds/workspace/pharo-vm_headless/generated/vm/src/gcc3x-cointerp.c:63761:31: warning: expression result unused [-Wunused-value]
[osx]                 thePage = stackPageAtpages((assert((((((char *) theFP)) >= (GIV(stackBasePlus1) - 1)) && ((((char *) theFP)) <= (((char *) GIV(pages)))))),
[osx]                                             ^~~~~~~~~~~~~~~~~~~~~~~~~~~~~~~~~~~~~~~~~~~~~~~~~~~~~~~~~~~~~~~~~~~~~~~~~~~~~~~~~~~~~~~~~~~~~~~~~~~~~~~~~~~~~~
[osx] /builds/workspace/pharo-vm_headless/extracted/vm/include/common/sqAssert.h:19:23: note: expanded from macro 'assert'
[osx] # define assert(expr) 0 /* hack disabling of asserts.  Better in makefile? */
[osx]                       ^
[osx] /builds/workspace/pharo-vm_headless/generated/vm/src/gcc3x-cointerp.c:2602:51: note: expanded from macro 'stackPageAtpages'
[osx] #define stackPageAtpages(index,pages) ((pages) + (index))
[osx]                                                   ^
[osx] /builds/workspace/pharo-vm_headless/generated/vm/src/gcc3x-cointerp.c:64176:30: warning: expression result unused [-Wunused-value]
[osx]         thePage = stackPageAtpages((assert((((((char *) theFP)) >= (GIV(stackBasePlus1) - 1)) && ((((char *) theFP)) <= (((char *) GIV(pages)))))),
[osx]                                     ^~~~~~~~~~~~~~~~~~~~~~~~~~~~~~~~~~~~~~~~~~~~~~~~~~~~~~~~~~~~~~~~~~~~~~~~~~~~~~~~~~~~~~~~~~~~~~~~~~~~~~~~~~~~~~
[osx] /builds/workspace/pharo-vm_headless/extracted/vm/include/common/sqAssert.h:19:23: note: expanded from macro 'assert'
[osx] # define assert(expr) 0 /* hack disabling of asserts.  Better in makefile? */
[osx]                       ^
[osx] /builds/workspace/pharo-vm_headless/generated/vm/src/gcc3x-cointerp.c:2602:51: note: expanded from macro 'stackPageAtpages'
[osx] #define stackPageAtpages(index,pages) ((pages) + (index))
[osx]                                                   ^
[osx] /builds/workspace/pharo-vm_headless/generated/vm/src/gcc3x-cointerp.c:64191:32: warning: expression result unused [-Wunused-value]
[osx]                 thePage1 = stackPageAtpages((assert((((((char *) theFP)) >= (GIV(stackBasePlus1) - 1)) && ((((char *) theFP)) <= (((char *) GIV(pages)))))),
[osx]                                              ^~~~~~~~~~~~~~~~~~~~~~~~~~~~~~~~~~~~~~~~~~~~~~~~~~~~~~~~~~~~~~~~~~~~~~~~~~~~~~~~~~~~~~~~~~~~~~~~~~~~~~~~~~~~~~
[osx] /builds/workspace/pharo-vm_headless/extracted/vm/include/common/sqAssert.h:19:23: note: expanded from macro 'assert'
[osx] # define assert(expr) 0 /* hack disabling of asserts.  Better in makefile? */
[osx]                       ^
[osx] /builds/workspace/pharo-vm_headless/generated/vm/src/gcc3x-cointerp.c:2602:51: note: expanded from macro 'stackPageAtpages'
[osx] #define stackPageAtpages(index,pages) ((pages) + (index))
[osx]                                                   ^
[osx] /builds/workspace/pharo-vm_headless/generated/vm/src/gcc3x-cointerp.c:64303:30: warning: expression result unused [-Wunused-value]
[osx]         thePage = stackPageAtpages((assert((((((char *) theFP)) >= (GIV(stackBasePlus1) - 1)) && ((((char *) theFP)) <= (((char *) GIV(pages)))))),
[osx]                                     ^~~~~~~~~~~~~~~~~~~~~~~~~~~~~~~~~~~~~~~~~~~~~~~~~~~~~~~~~~~~~~~~~~~~~~~~~~~~~~~~~~~~~~~~~~~~~~~~~~~~~~~~~~~~~~
[osx] /builds/workspace/pharo-vm_headless/extracted/vm/include/common/sqAssert.h:19:23: note: expanded from macro 'assert'
[osx] # define assert(expr) 0 /* hack disabling of asserts.  Better in makefile? */
[osx]                       ^
[osx] /builds/workspace/pharo-vm_headless/generated/vm/src/gcc3x-cointerp.c:2602:51: note: expanded from macro 'stackPageAtpages'
[osx] #define stackPageAtpages(index,pages) ((pages) + (index))
[osx]                                                   ^
[osx] /builds/workspace/pharo-vm_headless/generated/vm/src/gcc3x-cointerp.c:64376:30: warning: expression result unused [-Wunused-value]
[osx]         thePage = stackPageAtpages((assert((((((char *) theFP)) >= (GIV(stackBasePlus1) - 1)) && ((((char *) theFP)) <= (((char *) GIV(pages)))))),
[osx]                                     ^~~~~~~~~~~~~~~~~~~~~~~~~~~~~~~~~~~~~~~~~~~~~~~~~~~~~~~~~~~~~~~~~~~~~~~~~~~~~~~~~~~~~~~~~~~~~~~~~~~~~~~~~~~~~~
[osx] /builds/workspace/pharo-vm_headless/extracted/vm/include/common/sqAssert.h:19:23: note: expanded from macro 'assert'
[osx] # define assert(expr) 0 /* hack disabling of asserts.  Better in makefile? */
[osx]                       ^
[osx] /builds/workspace/pharo-vm_headless/generated/vm/src/gcc3x-cointerp.c:2602:51: note: expanded from macro 'stackPageAtpages'
[osx] #define stackPageAtpages(index,pages) ((pages) + (index))
[osx]                                                   ^
[osx] /builds/workspace/pharo-vm_headless/generated/vm/src/gcc3x-cointerp.c:64598:33: warning: expression result unused [-Wunused-value]
[osx]                                 thePage = stackPageAtpages((assert((((((char *) spouseFP)) >= (GIV(stackBasePlus1) - 1)) && ((((char *) spouseFP)) <= (((char *) GIV(pages)))))),
[osx]                                                             ^~~~~~~~~~~~~~~~~~~~~~~~~~~~~~~~~~~~~~~~~~~~~~~~~~~~~~~~~~~~~~~~~~~~~~~~~~~~~~~~~~~~~~~~~~~~~~~~~~~~~~~~~~~~~~~~~~~~
[osx] /builds/workspace/pharo-vm_headless/extracted/vm/include/common/sqAssert.h:19:23: note: expanded from macro 'assert'
[osx] # define assert(expr) 0 /* hack disabling of asserts.  Better in makefile? */
[osx]                       ^
[osx] /builds/workspace/pharo-vm_headless/generated/vm/src/gcc3x-cointerp.c:2602:51: note: expanded from macro 'stackPageAtpages'
[osx] #define stackPageAtpages(index,pages) ((pages) + (index))
[osx]                                                   ^
[osx] /builds/workspace/pharo-vm_headless/generated/vm/src/gcc3x-cointerp.c:64939:30: warning: expression result unused [-Wunused-value]
[osx]         thePage = stackPageAtpages((assert((((((char *) theFPAbove)) >= (GIV(stackBasePlus1) - 1)) && ((((char *) theFPAbove)) <= (((char *) GIV(pages)))))),
[osx]                                     ^~~~~~~~~~~~~~~~~~~~~~~~~~~~~~~~~~~~~~~~~~~~~~~~~~~~~~~~~~~~~~~~~~~~~~~~~~~~~~~~~~~~~~~~~~~~~~~~~~~~~~~~~~~~~~~~~~~~~~~~
[osx] /builds/workspace/pharo-vm_headless/extracted/vm/include/common/sqAssert.h:19:23: note: expanded from macro 'assert'
[osx] # define assert(expr) 0 /* hack disabling of asserts.  Better in makefile? */
[osx]                       ^
[osx] /builds/workspace/pharo-vm_headless/generated/vm/src/gcc3x-cointerp.c:2602:51: note: expanded from macro 'stackPageAtpages'
[osx] #define stackPageAtpages(index,pages) ((pages) + (index))
[osx]                                                   ^
[osx] /builds/workspace/pharo-vm_headless/generated/vm/src/gcc3x-cointerp.c:65138:30: warning: expression result unused [-Wunused-value]
[osx]         thePage = stackPageAtpages((assert((((((char *) theFPAbove)) >= (GIV(stackBasePlus1) - 1)) && ((((char *) theFPAbove)) <= (((char *) GIV(pages)))))),
[osx]                                     ^~~~~~~~~~~~~~~~~~~~~~~~~~~~~~~~~~~~~~~~~~~~~~~~~~~~~~~~~~~~~~~~~~~~~~~~~~~~~~~~~~~~~~~~~~~~~~~~~~~~~~~~~~~~~~~~~~~~~~~~
[osx] /builds/workspace/pharo-vm_headless/extracted/vm/include/common/sqAssert.h:19:23: note: expanded from macro 'assert'
[osx] # define assert(expr) 0 /* hack disabling of asserts.  Better in makefile? */
[osx]                       ^
[osx] /builds/workspace/pharo-vm_headless/generated/vm/src/gcc3x-cointerp.c:2602:51: note: expanded from macro 'stackPageAtpages'
[osx] #define stackPageAtpages(index,pages) ((pages) + (index))
[osx]                                                   ^
[osx] /builds/workspace/pharo-vm_headless/generated/vm/src/gcc3x-cointerp.c:65760:31: warning: expression result unused [-Wunused-value]
[osx]                 thePage = stackPageAtpages((assert((((((char *) theFP)) >= (GIV(stackBasePlus1) - 1)) && ((((char *) theFP)) <= (((char *) GIV(pages)))))),
[osx]                                             ^~~~~~~~~~~~~~~~~~~~~~~~~~~~~~~~~~~~~~~~~~~~~~~~~~~~~~~~~~~~~~~~~~~~~~~~~~~~~~~~~~~~~~~~~~~~~~~~~~~~~~~~~~~~~~
[osx] /builds/workspace/pharo-vm_headless/extracted/vm/include/common/sqAssert.h:19:23: note: expanded from macro 'assert'
[osx] # define assert(expr) 0 /* hack disabling of asserts.  Better in makefile? */
[osx]                       ^
[osx] /builds/workspace/pharo-vm_headless/generated/vm/src/gcc3x-cointerp.c:2602:51: note: expanded from macro 'stackPageAtpages'
[osx] #define stackPageAtpages(index,pages) ((pages) + (index))
[osx]                                                   ^
[osx] /builds/workspace/pharo-vm_headless/generated/vm/src/gcc3x-cointerp.c:66226:30: warning: expression result unused [-Wunused-value]
[osx]         thePage = stackPageAtpages((assert((((((char *) maybeFrame)) >= (GIV(stackBasePlus1) - 1)) && ((((char *) maybeFrame)) <= (((char *) GIV(pages)))))),
[osx]                                     ^~~~~~~~~~~~~~~~~~~~~~~~~~~~~~~~~~~~~~~~~~~~~~~~~~~~~~~~~~~~~~~~~~~~~~~~~~~~~~~~~~~~~~~~~~~~~~~~~~~~~~~~~~~~~~~~~~~~~~~~
[osx] /builds/workspace/pharo-vm_headless/extracted/vm/include/common/sqAssert.h:19:23: note: expanded from macro 'assert'
[osx] # define assert(expr) 0 /* hack disabling of asserts.  Better in makefile? */
[osx]                       ^
[osx] /builds/workspace/pharo-vm_headless/generated/vm/src/gcc3x-cointerp.c:2602:51: note: expanded from macro 'stackPageAtpages'
[osx] #define stackPageAtpages(index,pages) ((pages) + (index))
[osx]                                                   ^
[osx] /builds/workspace/pharo-vm_headless/generated/vm/src/gcc3x-cointerp.c:66306:30: warning: expression result unused [-Wunused-value]
[osx]         thePage = stackPageAtpages((assert((((((char *) theFrame)) >= (GIV(stackBasePlus1) - 1)) && ((((char *) theFrame)) <= (((char *) GIV(pages)))))),
[osx]                                     ^~~~~~~~~~~~~~~~~~~~~~~~~~~~~~~~~~~~~~~~~~~~~~~~~~~~~~~~~~~~~~~~~~~~~~~~~~~~~~~~~~~~~~~~~~~~~~~~~~~~~~~~~~~~~~~~~~~~
[osx] /builds/workspace/pharo-vm_headless/extracted/vm/include/common/sqAssert.h:19:23: note: expanded from macro 'assert'
[osx] # define assert(expr) 0 /* hack disabling of asserts.  Better in makefile? */
[osx]                       ^
[osx] /builds/workspace/pharo-vm_headless/generated/vm/src/gcc3x-cointerp.c:2602:51: note: expanded from macro 'stackPageAtpages'
[osx] #define stackPageAtpages(index,pages) ((pages) + (index))
[osx]                                                   ^
[osx] /builds/workspace/pharo-vm_headless/generated/vm/src/gcc3x-cointerp.c:67706:32: warning: expression result unused [-Wunused-value]
[osx]                 thePage2 = stackPageAtpages((assert((((((char *) theFP)) >= (GIV(stackBasePlus1) - 1)) && ((((char *) theFP)) <= (((char *) GIV(pages)))))),
[osx]                                              ^~~~~~~~~~~~~~~~~~~~~~~~~~~~~~~~~~~~~~~~~~~~~~~~~~~~~~~~~~~~~~~~~~~~~~~~~~~~~~~~~~~~~~~~~~~~~~~~~~~~~~~~~~~~~~
[osx] /builds/workspace/pharo-vm_headless/extracted/vm/include/common/sqAssert.h:19:23: note: expanded from macro 'assert'
[osx] # define assert(expr) 0 /* hack disabling of asserts.  Better in makefile? */
[osx]                       ^
[osx] /builds/workspace/pharo-vm_headless/generated/vm/src/gcc3x-cointerp.c:2602:51: note: expanded from macro 'stackPageAtpages'
[osx] #define stackPageAtpages(index,pages) ((pages) + (index))
[osx]                                                   ^
[osx] /builds/workspace/pharo-vm_headless/generated/vm/src/gcc3x-cointerp.c:67723:32: warning: expression result unused [-Wunused-value]
[osx]                         thePage = stackPageAtpages((assert((((((char *) pointer)) >= (GIV(stackBasePlus1) - 1)) && ((((char *) pointer)) <= (((char *) GIV(pages)))))),
[osx]                                                     ^~~~~~~~~~~~~~~~~~~~~~~~~~~~~~~~~~~~~~~~~~~~~~~~~~~~~~~~~~~~~~~~~~~~~~~~~~~~~~~~~~~~~~~~~~~~~~~~~~~~~~~~~~~~~~~~~~
[osx] /builds/workspace/pharo-vm_headless/extracted/vm/include/common/sqAssert.h:19:23: note: expanded from macro 'assert'
[osx] # define assert(expr) 0 /* hack disabling of asserts.  Better in makefile? */
[osx]                       ^
[osx] /builds/workspace/pharo-vm_headless/generated/vm/src/gcc3x-cointerp.c:2602:51: note: expanded from macro 'stackPageAtpages'
[osx] #define stackPageAtpages(index,pages) ((pages) + (index))
[osx]                                                   ^
[osx] /builds/workspace/pharo-vm_headless/generated/vm/src/gcc3x-cointerp.c:67781:31: warning: expression result unused [-Wunused-value]
[osx]                 thePage = stackPageAtpages((assert((((((char *) theFP)) >= (GIV(stackBasePlus1) - 1)) && ((((char *) theFP)) <= (((char *) GIV(pages)))))),
[osx]                                             ^~~~~~~~~~~~~~~~~~~~~~~~~~~~~~~~~~~~~~~~~~~~~~~~~~~~~~~~~~~~~~~~~~~~~~~~~~~~~~~~~~~~~~~~~~~~~~~~~~~~~~~~~~~~~~
[osx] /builds/workspace/pharo-vm_headless/extracted/vm/include/common/sqAssert.h:19:23: note: expanded from macro 'assert'
[osx] # define assert(expr) 0 /* hack disabling of asserts.  Better in makefile? */
[osx]                       ^
[osx] /builds/workspace/pharo-vm_headless/generated/vm/src/gcc3x-cointerp.c:2602:51: note: expanded from macro 'stackPageAtpages'
[osx] #define stackPageAtpages(index,pages) ((pages) + (index))
[osx]                                                   ^
[osx] /builds/workspace/pharo-vm_headless/generated/vm/src/gcc3x-cointerp.c:67956:101: warning: expression result unused [-Wunused-value]
[osx]         longAtput((theContext + BaseHeaderSize) + (((sqInt)((usqInt)(SenderIndex) << (shiftForWord())))), (assert(((oopForPointer(theFP)) & (BytesPerWord - 1)) == 0),
[osx]                                                                                                            ^~~~~~~~~~~~~~~~~~~~~~~~~~~~~~~~~~~~~~~~~~~~~~~~~~~~~~~~~~
[osx] /builds/workspace/pharo-vm_headless/extracted/vm/include/common/sqAssert.h:19:23: note: expanded from macro 'assert'
[osx] # define assert(expr) 0 /* hack disabling of asserts.  Better in makefile? */
[osx]                       ^
[osx] /builds/workspace/pharo-vm_headless/extracted/vm/include/common/sqMemoryAccess.h:230:67: note: expanded from macro 'longAtput'
[osx] # define longAtput(oop,val)                     longAtPointerput(atPointerArg(oop), val)
[osx]                                                                                     ^
[osx] /builds/workspace/pharo-vm_headless/extracted/vm/include/common/sqMemoryAccess.h:205:62: note: expanded from macro 'longAtPointerput'
[osx] # define longAtPointerput(ptr,val)      (*(sqInt *)(ptr)= (sqInt)(val))
[osx]                                                                   ^
[osx] /builds/workspace/pharo-vm_headless/generated/vm/src/gcc3x-cointerp.c:69146:33: warning: expression result unused [-Wunused-value]
[osx]                                 thePage = stackPageAtpages((assert((((((char *) theFP)) >= (GIV(stackBasePlus1) - 1)) && ((((char *) theFP)) <= (((char *) GIV(pages)))))),
[osx]                                                             ^~~~~~~~~~~~~~~~~~~~~~~~~~~~~~~~~~~~~~~~~~~~~~~~~~~~~~~~~~~~~~~~~~~~~~~~~~~~~~~~~~~~~~~~~~~~~~~~~~~~~~~~~~~~~~
[osx] /builds/workspace/pharo-vm_headless/extracted/vm/include/common/sqAssert.h:19:23: note: expanded from macro 'assert'
[osx] # define assert(expr) 0 /* hack disabling of asserts.  Better in makefile? */
[osx]                       ^
[osx] /builds/workspace/pharo-vm_headless/generated/vm/src/gcc3x-cointerp.c:2602:51: note: expanded from macro 'stackPageAtpages'
[osx] #define stackPageAtpages(index,pages) ((pages) + (index))
[osx]                                                   ^
[osx] /builds/workspace/pharo-vm_headless/generated/vm/src/gcc3x-cointerp.c:69161:34: warning: expression result unused [-Wunused-value]
[osx]                                 thePage1 = stackPageAtpages((assert((((((char *) theFP)) >= (GIV(stackBasePlus1) - 1)) && ((((char *) theFP)) <= (((char *) GIV(pages)))))),
[osx]                                                              ^~~~~~~~~~~~~~~~~~~~~~~~~~~~~~~~~~~~~~~~~~~~~~~~~~~~~~~~~~~~~~~~~~~~~~~~~~~~~~~~~~~~~~~~~~~~~~~~~~~~~~~~~~~~~~
[osx] /builds/workspace/pharo-vm_headless/extracted/vm/include/common/sqAssert.h:19:23: note: expanded from macro 'assert'
[osx] # define assert(expr) 0 /* hack disabling of asserts.  Better in makefile? */
[osx]                       ^
[osx] /builds/workspace/pharo-vm_headless/generated/vm/src/gcc3x-cointerp.c:2602:51: note: expanded from macro 'stackPageAtpages'
[osx] #define stackPageAtpages(index,pages) ((pages) + (index))
[osx]                                                   ^
[osx] /builds/workspace/pharo-vm_headless/generated/vm/src/gcc3x-cointerp.c:69260:27: warning: expression result unused [-Wunused-value]
[osx]                 printHex(oopForPointer((assert((((sender) & 7) == 1)),
[osx]                                         ^~~~~~~~~~~~~~~~~~~~~~~~~~~~~
[osx] /builds/workspace/pharo-vm_headless/extracted/vm/include/common/sqAssert.h:19:23: note: expanded from macro 'assert'
[osx] # define assert(expr) 0 /* hack disabling of asserts.  Better in makefile? */
[osx]                       ^
[osx] /builds/workspace/pharo-vm_headless/extracted/vm/include/common/sqMemoryAccess.h:218:40: note: expanded from macro 'oopForPointer'
[osx] #  define oopForPointer(ptr)            ((sqInt)(ptr))
[osx]                                                  ^
[osx] /builds/workspace/pharo-vm_headless/generated/vm/src/gcc3x-cointerp.c:69270:27: warning: expression result unused [-Wunused-value]
[osx]                 printHex(oopForPointer((assert((((ip) & 7) == 1)),
[osx]                                         ^~~~~~~~~~~~~~~~~~~~~~~~~
[osx] /builds/workspace/pharo-vm_headless/extracted/vm/include/common/sqAssert.h:19:23: note: expanded from macro 'assert'
[osx] # define assert(expr) 0 /* hack disabling of asserts.  Better in makefile? */
[osx]                       ^
[osx] /builds/workspace/pharo-vm_headless/extracted/vm/include/common/sqMemoryAccess.h:218:40: note: expanded from macro 'oopForPointer'
[osx] #  define oopForPointer(ptr)            ((sqInt)(ptr))
[osx]                                                  ^
[osx] /builds/workspace/pharo-vm_headless/generated/vm/src/gcc3x-cointerp.c:69601:31: warning: expression result unused [-Wunused-value]
[osx]                 thePage = stackPageAtpages((assert((((((char *) theFP)) >= (GIV(stackBasePlus1) - 1)) && ((((char *) theFP)) <= (((char *) GIV(pages)))))),
[osx]                                             ^~~~~~~~~~~~~~~~~~~~~~~~~~~~~~~~~~~~~~~~~~~~~~~~~~~~~~~~~~~~~~~~~~~~~~~~~~~~~~~~~~~~~~~~~~~~~~~~~~~~~~~~~~~~~~
[osx] /builds/workspace/pharo-vm_headless/extracted/vm/include/common/sqAssert.h:19:23: note: expanded from macro 'assert'
[osx] # define assert(expr) 0 /* hack disabling of asserts.  Better in makefile? */
[osx]                       ^
[osx] /builds/workspace/pharo-vm_headless/generated/vm/src/gcc3x-cointerp.c:2602:51: note: expanded from macro 'stackPageAtpages'
[osx] #define stackPageAtpages(index,pages) ((pages) + (index))
[osx]                                                   ^
[osx] /builds/workspace/pharo-vm_headless/generated/vm/src/gcc3x-cointerp.c:71743:31: warning: expression result unused [-Wunused-value]
[osx]                 thePage = stackPageAtpages((assert((((((char *) theFP)) >= (GIV(stackBasePlus1) - 1)) && ((((char *) theFP)) <= (((char *) GIV(pages)))))),
[osx]                                             ^~~~~~~~~~~~~~~~~~~~~~~~~~~~~~~~~~~~~~~~~~~~~~~~~~~~~~~~~~~~~~~~~~~~~~~~~~~~~~~~~~~~~~~~~~~~~~~~~~~~~~~~~~~~~~
[osx] /builds/workspace/pharo-vm_headless/extracted/vm/include/common/sqAssert.h:19:23: note: expanded from macro 'assert'
[osx] # define assert(expr) 0 /* hack disabling of asserts.  Better in makefile? */
[osx]                       ^
[osx] /builds/workspace/pharo-vm_headless/generated/vm/src/gcc3x-cointerp.c:2602:51: note: expanded from macro 'stackPageAtpages'
[osx] #define stackPageAtpages(index,pages) ((pages) + (index))
[osx]                                                   ^
[osx] /builds/workspace/pharo-vm_headless/generated/vm/src/gcc3x-cointerp.c:72115:31: warning: expression result unused [-Wunused-value]
[osx]                 thePage = stackPageAtpages((assert((((((char *) theFP)) >= (GIV(stackBasePlus1) - 1)) && ((((char *) theFP)) <= (((char *) GIV(pages)))))),
[osx]                                             ^~~~~~~~~~~~~~~~~~~~~~~~~~~~~~~~~~~~~~~~~~~~~~~~~~~~~~~~~~~~~~~~~~~~~~~~~~~~~~~~~~~~~~~~~~~~~~~~~~~~~~~~~~~~~~
[osx] /builds/workspace/pharo-vm_headless/extracted/vm/include/common/sqAssert.h:19:23: note: expanded from macro 'assert'
[osx] # define assert(expr) 0 /* hack disabling of asserts.  Better in makefile? */
[osx]                       ^
[osx] /builds/workspace/pharo-vm_headless/generated/vm/src/gcc3x-cointerp.c:2602:51: note: expanded from macro 'stackPageAtpages'
[osx] #define stackPageAtpages(index,pages) ((pages) + (index))
[osx]                                                   ^
[osx] /builds/workspace/pharo-vm_headless/generated/vm/src/gcc3x-cointerp.c:72419:31: warning: expression result unused [-Wunused-value]
[osx]                 thePage = stackPageAtpages((assert((((((char *) pointer)) >= (GIV(stackBasePlus1) - 1)) && ((((char *) pointer)) <= (((char *) GIV(pages)))))),
[osx]                                             ^~~~~~~~~~~~~~~~~~~~~~~~~~~~~~~~~~~~~~~~~~~~~~~~~~~~~~~~~~~~~~~~~~~~~~~~~~~~~~~~~~~~~~~~~~~~~~~~~~~~~~~~~~~~~~~~~~
[osx] /builds/workspace/pharo-vm_headless/extracted/vm/include/common/sqAssert.h:19:23: note: expanded from macro 'assert'
[osx] # define assert(expr) 0 /* hack disabling of asserts.  Better in makefile? */
[osx]                       ^
[osx] /builds/workspace/pharo-vm_headless/generated/vm/src/gcc3x-cointerp.c:2602:51: note: expanded from macro 'stackPageAtpages'
[osx] #define stackPageAtpages(index,pages) ((pages) + (index))
[osx]                                                   ^
[osx] /builds/workspace/pharo-vm_headless/generated/vm/src/gcc3x-cointerp.c:72607:30: warning: expression result unused [-Wunused-value]
[osx]         thePage = stackPageAtpages((assert((((((char *) theFP)) >= (GIV(stackBasePlus1) - 1)) && ((((char *) theFP)) <= (((char *) GIV(pages)))))),
[osx]                                     ^~~~~~~~~~~~~~~~~~~~~~~~~~~~~~~~~~~~~~~~~~~~~~~~~~~~~~~~~~~~~~~~~~~~~~~~~~~~~~~~~~~~~~~~~~~~~~~~~~~~~~~~~~~~~~
[osx] /builds/workspace/pharo-vm_headless/extracted/vm/include/common/sqAssert.h:19:23: note: expanded from macro 'assert'
[osx] # define assert(expr) 0 /* hack disabling of asserts.  Better in makefile? */
[osx]                       ^
[osx] /builds/workspace/pharo-vm_headless/generated/vm/src/gcc3x-cointerp.c:2602:51: note: expanded from macro 'stackPageAtpages'
[osx] #define stackPageAtpages(index,pages) ((pages) + (index))
[osx]                                                   ^
[osx] /builds/workspace/pharo-vm_headless/generated/vm/src/gcc3x-cointerp.c:73509:30: warning: expression result unused [-Wunused-value]
[osx]         thePage = stackPageAtpages((assert((((((char *) theFP)) >= (GIV(stackBasePlus1) - 1)) && ((((char *) theFP)) <= (((char *) GIV(pages)))))),
[osx]                                     ^~~~~~~~~~~~~~~~~~~~~~~~~~~~~~~~~~~~~~~~~~~~~~~~~~~~~~~~~~~~~~~~~~~~~~~~~~~~~~~~~~~~~~~~~~~~~~~~~~~~~~~~~~~~~~
[osx] /builds/workspace/pharo-vm_headless/extracted/vm/include/common/sqAssert.h:19:23: note: expanded from macro 'assert'
[osx] # define assert(expr) 0 /* hack disabling of asserts.  Better in makefile? */
[osx]                       ^
[osx] /builds/workspace/pharo-vm_headless/generated/vm/src/gcc3x-cointerp.c:2602:51: note: expanded from macro 'stackPageAtpages'
[osx] #define stackPageAtpages(index,pages) ((pages) + (index))
[osx]                                                   ^
[osx] /builds/workspace/pharo-vm_headless/generated/vm/src/gcc3x-cointerp.c:73993:32: warning: expression result unused [-Wunused-value]
[osx]                 thePage1 = stackPageAtpages((assert((((((char *) theFP)) >= (GIV(stackBasePlus1) - 1)) && ((((char *) theFP)) <= (((char *) GIV(pages)))))),
[osx]                                              ^~~~~~~~~~~~~~~~~~~~~~~~~~~~~~~~~~~~~~~~~~~~~~~~~~~~~~~~~~~~~~~~~~~~~~~~~~~~~~~~~~~~~~~~~~~~~~~~~~~~~~~~~~~~~~
[osx] /builds/workspace/pharo-vm_headless/extracted/vm/include/common/sqAssert.h:19:23: note: expanded from macro 'assert'
[osx] # define assert(expr) 0 /* hack disabling of asserts.  Better in makefile? */
[osx]                       ^
[osx] /builds/workspace/pharo-vm_headless/generated/vm/src/gcc3x-cointerp.c:2602:51: note: expanded from macro 'stackPageAtpages'
[osx] #define stackPageAtpages(index,pages) ((pages) + (index))
[osx]                                                   ^
[osx] /builds/workspace/pharo-vm_headless/generated/vm/src/gcc3x-cointerp.c:74013:30: warning: expression result unused [-Wunused-value]
[osx]         thePage = stackPageAtpages((assert((((((char *) theFP)) >= (GIV(stackBasePlus1) - 1)) && ((((char *) theFP)) <= (((char *) GIV(pages)))))),
[osx]                                     ^~~~~~~~~~~~~~~~~~~~~~~~~~~~~~~~~~~~~~~~~~~~~~~~~~~~~~~~~~~~~~~~~~~~~~~~~~~~~~~~~~~~~~~~~~~~~~~~~~~~~~~~~~~~~~
[osx] /builds/workspace/pharo-vm_headless/extracted/vm/include/common/sqAssert.h:19:23: note: expanded from macro 'assert'
[osx] # define assert(expr) 0 /* hack disabling of asserts.  Better in makefile? */
[osx]                       ^
[osx] /builds/workspace/pharo-vm_headless/generated/vm/src/gcc3x-cointerp.c:2602:51: note: expanded from macro 'stackPageAtpages'
[osx] #define stackPageAtpages(index,pages) ((pages) + (index))
[osx]                                                   ^
[osx] /builds/workspace/pharo-vm_headless/generated/vm/src/gcc3x-cointerp.c:74662:34: warning: expression result unused [-Wunused-value]
[osx]                                 (thePage = stackPageAtpages((assert((((((char *) theFP)) >= (GIV(stackBasePlus1) - 1)) && ((((char *) theFP)) <= (((char *) GIV(pages)))))),
[osx]                                                              ^~~~~~~~~~~~~~~~~~~~~~~~~~~~~~~~~~~~~~~~~~~~~~~~~~~~~~~~~~~~~~~~~~~~~~~~~~~~~~~~~~~~~~~~~~~~~~~~~~~~~~~~~~~~~~
[osx] /builds/workspace/pharo-vm_headless/extracted/vm/include/common/sqAssert.h:19:23: note: expanded from macro 'assert'
[osx] # define assert(expr) 0 /* hack disabling of asserts.  Better in makefile? */
[osx]                       ^
[osx] /builds/workspace/pharo-vm_headless/generated/vm/src/gcc3x-cointerp.c:2602:51: note: expanded from macro 'stackPageAtpages'
[osx] #define stackPageAtpages(index,pages) ((pages) + (index))
[osx]                                                   ^
[osx] /builds/workspace/pharo-vm_headless/generated/vm/src/gcc3x-cointerp.c:76478:2: warning: expression result unused [-Wunused-value]
[osx]         !GIV(primFailCode);
[osx]         ^    ~~~~~~~~~~~~
[osx] /builds/workspace/pharo-vm_headless/generated/vm/src/gcc3x-cointerp.c:77057:32: warning: expression result unused [-Wunused-value]
[osx]                         thePage = stackPageAtpages((assert((((((char *) theFPAbove)) >= (GIV(stackBasePlus1) - 1)) && ((((char *) theFPAbove)) <= (((char *) GIV(pages)))))),
[osx]                                                     ^~~~~~~~~~~~~~~~~~~~~~~~~~~~~~~~~~~~~~~~~~~~~~~~~~~~~~~~~~~~~~~~~~~~~~~~~~~~~~~~~~~~~~~~~~~~~~~~~~~~~~~~~~~~~~~~~~~~~~~~
[osx] /builds/workspace/pharo-vm_headless/extracted/vm/include/common/sqAssert.h:19:23: note: expanded from macro 'assert'
[osx] # define assert(expr) 0 /* hack disabling of asserts.  Better in makefile? */
[osx]                       ^
[osx] /builds/workspace/pharo-vm_headless/generated/vm/src/gcc3x-cointerp.c:2602:51: note: expanded from macro 'stackPageAtpages'
[osx] #define stackPageAtpages(index,pages) ((pages) + (index))
[osx]                                                   ^
[osx] /builds/workspace/pharo-vm_headless/generated/vm/src/gcc3x-cointerp.c:78668:31: warning: expression result unused [-Wunused-value]
[osx]                 thePage = stackPageAtpages((assert((((((char *) theFP)) >= (GIV(stackBasePlus1) - 1)) && ((((char *) theFP)) <= (((char *) GIV(pages)))))),
[osx]                                             ^~~~~~~~~~~~~~~~~~~~~~~~~~~~~~~~~~~~~~~~~~~~~~~~~~~~~~~~~~~~~~~~~~~~~~~~~~~~~~~~~~~~~~~~~~~~~~~~~~~~~~~~~~~~~~
[osx] /builds/workspace/pharo-vm_headless/extracted/vm/include/common/sqAssert.h:19:23: note: expanded from macro 'assert'
[osx] # define assert(expr) 0 /* hack disabling of asserts.  Better in makefile? */
[osx]                       ^
[osx] /builds/workspace/pharo-vm_headless/generated/vm/src/gcc3x-cointerp.c:2602:51: note: expanded from macro 'stackPageAtpages'
[osx] #define stackPageAtpages(index,pages) ((pages) + (index))
[osx]                                                   ^
[osx] /builds/workspace/pharo-vm_headless/generated/vm/src/gcc3x-cointerp.c:79169:32: warning: expression result unused [-Wunused-value]
[osx]                         thePage = stackPageAtpages((assert((((((char *) theFP)) >= (GIV(stackBasePlus1) - 1)) && ((((char *) theFP)) <= (((char *) GIV(pages)))))),
[osx]                                                     ^~~~~~~~~~~~~~~~~~~~~~~~~~~~~~~~~~~~~~~~~~~~~~~~~~~~~~~~~~~~~~~~~~~~~~~~~~~~~~~~~~~~~~~~~~~~~~~~~~~~~~~~~~~~~~
[osx] /builds/workspace/pharo-vm_headless/extracted/vm/include/common/sqAssert.h:19:23: note: expanded from macro 'assert'
[osx] # define assert(expr) 0 /* hack disabling of asserts.  Better in makefile? */
[osx]                       ^
[osx] /builds/workspace/pharo-vm_headless/generated/vm/src/gcc3x-cointerp.c:2602:51: note: expanded from macro 'stackPageAtpages'
[osx] #define stackPageAtpages(index,pages) ((pages) + (index))
[osx]                                                   ^
[windows] Running on windows in E:\Builds\workspace\pharo-vm_headless
[Pipeline] [windows] {
[Pipeline] [windows] timeout
[windows] Timeout set to expire in 30 min
[Pipeline] [windows] {
[Pipeline] [windows] cleanWs
[windows] [WS-CLEANUP] Deleting project workspace...
[windows] [WS-CLEANUP] Deferred wipeout is used...
[windows] [WS-CLEANUP] done
[Pipeline] [windows] stage
[Pipeline] [windows] { (Checkout-windows)
[Pipeline] [windows] checkout
[windows] Cloning the remote Git repository
[windows] Using shallow clone
[windows] shallow clone depth 2
[windows] Cloning repository https://github.com/pharo-project/opensmalltalk-vm.git
[windows]  > git init E:\Builds\workspace\pharo-vm_headless # timeout=10
[windows] Fetching upstream changes from https://github.com/pharo-project/opensmalltalk-vm.git
[windows]  > git --version # timeout=10
[windows] using GIT_ASKPASS to set credentials pharo-ci GitHub account
[windows]  > git fetch --tags --progress https://github.com/pharo-project/opensmalltalk-vm.git +refs/heads/*:refs/remotes/origin/* --depth=2
[osx] 81 warnings generated.
[osx] [  9%] Building C object CMakeFiles/PharoVMCore.dir/extracted/vm/src/common/sqHeapMap.c.o
[osx] [ 10%] Building C object CMakeFiles/PharoVMCore.dir/extracted/vm/src/common/sqVirtualMachine.c.o
[osx] /builds/workspace/pharo-vm_headless/extracted/vm/src/common/sqVirtualMachine.c:431:37: warning: incompatible pointer types assigning to 'void *(*)(sqInt, sqInt, sqInt)' from 'void *(sqInt, sqInt, void *)' [-Wincompatible-pointer-types]
[osx]         VM->ioLoadSymbolOfLengthFromModule = ioLoadSymbolOfLengthFromModule;
[osx]                                            ^ ~~~~~~~~~~~~~~~~~~~~~~~~~~~~~~
[osx] /builds/workspace/pharo-vm_headless/extracted/vm/src/common/sqVirtualMachine.c:509:22: warning: incompatible pointer types assigning to 'volatile unsigned long (*)(void)' from 'volatile unsigned long long (void)' [-Wincompatible-pointer-types]
[osx]         VM->utcMicroseconds = ioUTCMicroseconds;
[osx]                             ^ ~~~~~~~~~~~~~~~~~
[osx] 2 warnings generated.
[osx] [ 11%] Building C object CMakeFiles/PharoVMCore.dir/extracted/vm/src/common/sqNamedPrims.c.o
[osx] [ 12%] Building C object CMakeFiles/PharoVMCore.dir/extracted/vm/src/common/sqExternalSemaphores.c.o
[osx] [ 12%] Building C object CMakeFiles/PharoVMCore.dir/extracted/vm/src/common/sqTicker.c.o
[osx] [ 13%] Building C object CMakeFiles/PharoVMCore.dir/extracted/vm/src/unix/aio.c.o
[osx] [ 14%] Building C object CMakeFiles/PharoVMCore.dir/extracted/vm/src/unix/sqUnixHeartbeat.c.o
[osx] [ 15%] Building C object CMakeFiles/PharoVMCore.dir/src/debugUnix.c.o
[osx] /builds/workspace/pharo-vm_headless/src/debugUnix.c:304:2: warning: implicit declaration of function 'dumpPrimTraceLog' is invalid in C99 [-Wimplicit-function-declaration]
[osx]         dumpPrimTraceLog();
[osx]         ^
[osx] 1 warning generated.
[osx] [ 16%] Building CXX object CMakeFiles/PharoVMCore.dir/src/utilsMac.mm.o
[osx] [ 17%] Building C object CMakeFiles/PharoVMCore.dir/src/memoryUnix.c.o
[osx] Linking CXX shared library build/vm/libPharoVMCore.dylib
[osx] [ 17%] Built target PharoVMCore
[osx] Scanning dependencies of target B2DPlugin
[osx] [ 17%] Building C object CMakeFiles/B2DPlugin.dir/extracted/plugins/B2DPlugin/src/common/B2DPlugin.c.o
[osx] /builds/workspace/pharo-vm_headless/extracted/plugins/B2DPlugin/src/common/B2DPlugin.c:13646:18: warning: expression result unused [-Wunused-value]
[osx]                 ((signed)lastX >> 8);
[osx]                  ~~~~~~~~~~~~~ ^  ~
[osx] /builds/workspace/pharo-vm_headless/extracted/plugins/B2DPlugin/src/common/B2DPlugin.c:13676:18: warning: expression result unused [-Wunused-value]
[osx]         ((signed)lastX1 >> 8);
[osx]          ~~~~~~~~~~~~~~ ^  ~
[osx] 2 warnings generated.
[osx] Linking C shared library build/vm/libB2DPlugin.dylib
[osx] [ 17%] Built target B2DPlugin
[osx] Scanning dependencies of target BitBltPlugin
[osx] [ 18%] Building C object CMakeFiles/BitBltPlugin.dir/extracted/plugins/BitBltPlugin/src/common/BitBltPlugin.c.o
[osx] Linking C shared library build/vm/libBitBltPlugin.dylib
[osx] [ 18%] Built target BitBltPlugin
[osx] Scanning dependencies of target DSAPrims
[osx] [ 19%] Building C object CMakeFiles/DSAPrims.dir/extracted/plugins/DSAPrims/src/common/DSAPrims.c.o
[osx] Linking C shared library build/vm/libDSAPrims.dylib
[osx] [ 19%] Built target DSAPrims
[osx] Scanning dependencies of target FilePlugin
[osx] [ 20%] Building C object CMakeFiles/FilePlugin.dir/extracted/plugins/FilePlugin/src/common/FilePlugin.c.o
[osx] /builds/workspace/pharo-vm_headless/extracted/plugins/FilePlugin/src/common/FilePlugin.c:579:10: warning: incompatible integer to pointer conversion returning 'sqInt' (aka 'long') from a function with result type 'void *' [-Wint-conversion]
[osx]                 return primitiveFailFor(PrimErrBadArgument);
[osx]                        ^~~~~~~~~~~~~~~~~~~~~~~~~~~~~~~~~~~~
[osx] /builds/workspace/pharo-vm_headless/extracted/plugins/FilePlugin/src/common/FilePlugin.c:1735:21: warning: incompatible pointer types assigning to 'sqInt (*)(sqInt)' from 'sqInt (*)(int)' [-Wincompatible-pointer-types]
[osx]                 characterObjectOf = interpreterProxy->characterObjectOf;
[osx]                                   ^ ~~~~~~~~~~~~~~~~~~~~~~~~~~~~~~~~~~~
[osx] /builds/workspace/pharo-vm_headless/extracted/plugins/FilePlugin/src/common/FilePlugin.c:1749:10: warning: incompatible pointer types assigning to 'sqInt (*)(void)' from 'void (*)(void)' [-Wincompatible-pointer-types]
[osx]                 fullGC = interpreterProxy->fullGC;
[osx]                        ^ ~~~~~~~~~~~~~~~~~~~~~~~~
[osx] 3 warnings generated.
[osx] [ 21%] Building C object CMakeFiles/FilePlugin.dir/extracted/plugins/FilePlugin/src/common/sqFilePluginBasicPrims.c.o
[osx] [ 22%] Building C object CMakeFiles/FilePlugin.dir/extracted/plugins/FilePlugin/src/unix/sqUnixFile.c.o
[osx] [ 23%] Building C object CMakeFiles/FilePlugin.dir/extracted/vm/src/unix/sqUnixCharConv.c.o
[osx] [ 23%] Building C object CMakeFiles/FilePlugin.dir/src/fileUtils.c.o
[osx] Linking C shared library build/vm/libFilePlugin.dylib
[osx] [ 23%] Built target FilePlugin
[osx] Scanning dependencies of target FileAttributesPlugin
[osx] [ 24%] Building C object CMakeFiles/FileAttributesPlugin.dir/extracted/plugins/FileAttributesPlugin/src/common/faCommon.c.o
[osx] [ 25%] Building C object CMakeFiles/FileAttributesPlugin.dir/extracted/plugins/FileAttributesPlugin/src/common/FileAttributesPlugin.c.o
[osx] [ 25%] Building C object CMakeFiles/FileAttributesPlugin.dir/extracted/plugins/FileAttributesPlugin/src/unix/faSupport.c.o
[osx] Linking C shared library build/vm/libFileAttributesPlugin.dylib
[osx] [ 25%] Built target FileAttributesPlugin
[osx] Scanning dependencies of target IA32ABI
[osx] [ 26%] Building C object CMakeFiles/IA32ABI.dir/extracted/plugins/IA32ABI/src/common/IA32ABI.c.o
[osx] /builds/workspace/pharo-vm_headless/extracted/plugins/IA32ABI/src/common/IA32ABI.c:748:24: warning: incompatible integer to pointer conversion passing 'sqInt' (aka 'long') to parameter of type 'const void *' [-Wint-conversion]
[osx]         memcpy((&floatValue), addr, sizeof(floatValue));
[osx]                               ^~~~
[osx] /usr/include/secure/_string.h:65:33: note: expanded from macro 'memcpy'
[osx]   __builtin___memcpy_chk (dest, src, len, __darwin_obsz0 (dest))
[osx]                                 ^
[osx] /builds/workspace/pharo-vm_headless/extracted/plugins/IA32ABI/src/common/IA32ABI.c:795:9: warning: incompatible integer to pointer conversion passing 'sqInt' (aka 'long') to parameter of type 'const void *' [-Wint-conversion]
[osx]         memcpy(addr, (&floatValue), sizeof(floatValue));
[osx]                ^~~~
[osx] /usr/include/secure/_string.h:65:59: note: expanded from macro 'memcpy'
[osx]   __builtin___memcpy_chk (dest, src, len, __darwin_obsz0 (dest))
[osx]                                                           ^
[osx] /usr/include/secure/_common.h:38:55: note: expanded from macro '__darwin_obsz0'
[osx] #define __darwin_obsz0(object) __builtin_object_size (object, 0)
[osx]                                                       ^
[osx] /builds/workspace/pharo-vm_headless/extracted/plugins/IA32ABI/src/common/IA32ABI.c:795:9: warning: incompatible integer to pointer conversion passing 'sqInt' (aka 'long') to parameter of type 'void *' [-Wint-conversion]
[osx]         memcpy(addr, (&floatValue), sizeof(floatValue));
[osx]                ^~~~
[osx] /usr/include/secure/_string.h:65:27: note: expanded from macro 'memcpy'
[osx]   __builtin___memcpy_chk (dest, src, len, __darwin_obsz0 (dest))
[osx]                           ^
[osx] /builds/workspace/pharo-vm_headless/extracted/plugins/IA32ABI/src/common/IA32ABI.c:840:24: warning: incompatible integer to pointer conversion passing 'sqInt' (aka 'long') to parameter of type 'const void *' [-Wint-conversion]
[osx]         memcpy((&floatValue), addr, sizeof(floatValue));
[osx]                               ^~~~
[osx] /usr/include/secure/_string.h:65:33: note: expanded from macro 'memcpy'
[osx]   __builtin___memcpy_chk (dest, src, len, __darwin_obsz0 (dest))
[osx]                                 ^
[osx] /builds/workspace/pharo-vm_headless/extracted/plugins/IA32ABI/src/common/IA32ABI.c:887:9: warning: incompatible integer to pointer conversion passing 'sqInt' (aka 'long') to parameter of type 'const void *' [-Wint-conversion]
[osx]         memcpy(addr, (&floatValue), sizeof(floatValue));
[osx]                ^~~~
[osx] /usr/include/secure/_string.h:65:59: note: expanded from macro 'memcpy'
[osx]   __builtin___memcpy_chk (dest, src, len, __darwin_obsz0 (dest))
[osx]                                                           ^
[osx] /usr/include/secure/_common.h:38:55: note: expanded from macro '__darwin_obsz0'
[osx] #define __darwin_obsz0(object) __builtin_object_size (object, 0)
[osx]                                                       ^
[osx] /builds/workspace/pharo-vm_headless/extracted/plugins/IA32ABI/src/common/IA32ABI.c:887:9: warning: incompatible integer to pointer conversion passing 'sqInt' (aka 'long') to parameter of type 'void *' [-Wint-conversion]
[osx]         memcpy(addr, (&floatValue), sizeof(floatValue));
[osx]                ^~~~
[osx] /usr/include/secure/_string.h:65:27: note: expanded from macro 'memcpy'
[osx]   __builtin___memcpy_chk (dest, src, len, __darwin_obsz0 (dest))
[osx]                           ^
[osx] /builds/workspace/pharo-vm_headless/extracted/plugins/IA32ABI/src/common/IA32ABI.c:2253:34: warning: incompatible pointer types assigning to 'sqInt (*)(sqInt, VMCallbackContext *, sqInt)' from 'sqInt (*)(int, vmccp, sqInt)' [-Wincompatible-pointer-types]
[osx]                 returnAsThroughCallbackContext = interpreterProxy->returnAsThroughCallbackContext;
[osx]                                                ^ ~~~~~~~~~~~~~~~~~~~~~~~~~~~~~~~~~~~~~~~~~~~~~~~~
[osx] 7 warnings generated.
[osx] [ 27%] Building C object CMakeFiles/IA32ABI.dir/extracted/plugins/IA32ABI/src/common/AlienSUnitTestProcedures.c.o
[osx] [ 28%] Building C object CMakeFiles/IA32ABI.dir/extracted/plugins/IA32ABI/src/common/xabicc.c.o
[osx] In file included from /builds/workspace/pharo-vm_headless/extracted/plugins/IA32ABI/src/common/xabicc.c:16:
[osx] /builds/workspace/pharo-vm_headless/extracted/plugins/IA32ABI/src/common/x64sysvabicc.c:283:18: warning: implicit declaration of function 'getpagesize' is invalid in C99 [-Wimplicit-function-declaration]
[osx]         long pagesize = getpagesize();
[osx]                         ^
[osx] 1 warning generated.
[osx] Linking C shared library build/vm/libIA32ABI.dylib
[osx] [ 28%] Built target IA32ABI
[osx] Scanning dependencies of target JPEGReadWriter2Plugin
[osx] [ 29%] Building C object CMakeFiles/JPEGReadWriter2Plugin.dir/extracted/plugins/JPEGReadWriter2Plugin/src/common/Error.c.o
[osx] [ 29%] Building C object CMakeFiles/JPEGReadWriter2Plugin.dir/extracted/plugins/JPEGReadWriter2Plugin/src/common/jcapimin.c.o
[osx] [ 30%] Building C object CMakeFiles/JPEGReadWriter2Plugin.dir/extracted/plugins/JPEGReadWriter2Plugin/src/common/jcapistd.c.o
[osx] [ 31%] Building C object CMakeFiles/JPEGReadWriter2Plugin.dir/extracted/plugins/JPEGReadWriter2Plugin/src/common/jccoefct.c.o
[osx] [ 32%] Building C object CMakeFiles/JPEGReadWriter2Plugin.dir/extracted/plugins/JPEGReadWriter2Plugin/src/common/jccolor.c.o
[osx] [ 33%] Building C object CMakeFiles/JPEGReadWriter2Plugin.dir/extracted/plugins/JPEGReadWriter2Plugin/src/common/jcdctmgr.c.o
[osx] [ 33%] Building C object CMakeFiles/JPEGReadWriter2Plugin.dir/extracted/plugins/JPEGReadWriter2Plugin/src/common/jchuff.c.o
[osx] [ 34%] Building C object CMakeFiles/JPEGReadWriter2Plugin.dir/extracted/plugins/JPEGReadWriter2Plugin/src/common/jcinit.c.o
[osx] [ 35%] Building C object CMakeFiles/JPEGReadWriter2Plugin.dir/extracted/plugins/JPEGReadWriter2Plugin/src/common/jcmainct.c.o
[osx] [ 36%] Building C object CMakeFiles/JPEGReadWriter2Plugin.dir/extracted/plugins/JPEGReadWriter2Plugin/src/common/jcmarker.c.o
[osx] [ 37%] Building C object CMakeFiles/JPEGReadWriter2Plugin.dir/extracted/plugins/JPEGReadWriter2Plugin/src/common/jcmaster.c.o
[osx] [ 37%] Building C object CMakeFiles/JPEGReadWriter2Plugin.dir/extracted/plugins/JPEGReadWriter2Plugin/src/common/jcomapi.c.o
[osx] [ 38%] Building C object CMakeFiles/JPEGReadWriter2Plugin.dir/extracted/plugins/JPEGReadWriter2Plugin/src/common/jcparam.c.o
[osx] [ 39%] Building C object CMakeFiles/JPEGReadWriter2Plugin.dir/extracted/plugins/JPEGReadWriter2Plugin/src/common/jcphuff.c.o
[osx] [ 40%] Building C object CMakeFiles/JPEGReadWriter2Plugin.dir/extracted/plugins/JPEGReadWriter2Plugin/src/common/jcprepct.c.o
[osx] [ 41%] Building C object CMakeFiles/JPEGReadWriter2Plugin.dir/extracted/plugins/JPEGReadWriter2Plugin/src/common/jcsample.c.o
[osx] [ 42%] Building C object CMakeFiles/JPEGReadWriter2Plugin.dir/extracted/plugins/JPEGReadWriter2Plugin/src/common/jctrans.c.o
[osx] [ 42%] Building C object CMakeFiles/JPEGReadWriter2Plugin.dir/extracted/plugins/JPEGReadWriter2Plugin/src/common/jdapimin.c.o
[osx] [ 43%] Building C object CMakeFiles/JPEGReadWriter2Plugin.dir/extracted/plugins/JPEGReadWriter2Plugin/src/common/jdapistd.c.o
[osx] [ 44%] Building C object CMakeFiles/JPEGReadWriter2Plugin.dir/extracted/plugins/JPEGReadWriter2Plugin/src/common/jdatadst.c.o
[osx] [ 45%] Building C object CMakeFiles/JPEGReadWriter2Plugin.dir/extracted/plugins/JPEGReadWriter2Plugin/src/common/jdatasrc.c.o
[osx] [ 46%] Building C object CMakeFiles/JPEGReadWriter2Plugin.dir/extracted/plugins/JPEGReadWriter2Plugin/src/common/jdcoefct.c.o
[osx] [ 46%] Building C object CMakeFiles/JPEGReadWriter2Plugin.dir/extracted/plugins/JPEGReadWriter2Plugin/src/common/jdcolor.c.o
[osx] [ 47%] Building C object CMakeFiles/JPEGReadWriter2Plugin.dir/extracted/plugins/JPEGReadWriter2Plugin/src/common/jddctmgr.c.o
[osx] [ 48%] Building C object CMakeFiles/JPEGReadWriter2Plugin.dir/extracted/plugins/JPEGReadWriter2Plugin/src/common/jdhuff.c.o
[osx] [ 49%] Building C object CMakeFiles/JPEGReadWriter2Plugin.dir/extracted/plugins/JPEGReadWriter2Plugin/src/common/jdinput.c.o
[osx] [ 50%] Building C object CMakeFiles/JPEGReadWriter2Plugin.dir/extracted/plugins/JPEGReadWriter2Plugin/src/common/jdmainct.c.o
[osx] [ 50%] Building C object CMakeFiles/JPEGReadWriter2Plugin.dir/extracted/plugins/JPEGReadWriter2Plugin/src/common/jdmarker.c.o
[osx] [ 51%] Building C object CMakeFiles/JPEGReadWriter2Plugin.dir/extracted/plugins/JPEGReadWriter2Plugin/src/common/jdmaster.c.o
[osx] [ 52%] Building C object CMakeFiles/JPEGReadWriter2Plugin.dir/extracted/plugins/JPEGReadWriter2Plugin/src/common/jdmerge.c.o
[osx] [ 53%] Building C object CMakeFiles/JPEGReadWriter2Plugin.dir/extracted/plugins/JPEGReadWriter2Plugin/src/common/jdphuff.c.o
[osx] [ 54%] Building C object CMakeFiles/JPEGReadWriter2Plugin.dir/extracted/plugins/JPEGReadWriter2Plugin/src/common/jdpostct.c.o
[osx] [ 54%] Building C object CMakeFiles/JPEGReadWriter2Plugin.dir/extracted/plugins/JPEGReadWriter2Plugin/src/common/jdsample.c.o
[osx] [ 55%] Building C object CMakeFiles/JPEGReadWriter2Plugin.dir/extracted/plugins/JPEGReadWriter2Plugin/src/common/jdtrans.c.o
[osx] [ 56%] Building C object CMakeFiles/JPEGReadWriter2Plugin.dir/extracted/plugins/JPEGReadWriter2Plugin/src/common/jerror.c.o
[osx] [ 57%] Building C object CMakeFiles/JPEGReadWriter2Plugin.dir/extracted/plugins/JPEGReadWriter2Plugin/src/common/jfdctflt.c.o
[osx] [ 58%] Building C object CMakeFiles/JPEGReadWriter2Plugin.dir/extracted/plugins/JPEGReadWriter2Plugin/src/common/jfdctfst.c.o
[osx] [ 58%] Building C object CMakeFiles/JPEGReadWriter2Plugin.dir/extracted/plugins/JPEGReadWriter2Plugin/src/common/jfdctint.c.o
[osx] [ 59%] Building C object CMakeFiles/JPEGReadWriter2Plugin.dir/extracted/plugins/JPEGReadWriter2Plugin/src/common/jidctflt.c.o
[osx] [ 60%] Building C object CMakeFiles/JPEGReadWriter2Plugin.dir/extracted/plugins/JPEGReadWriter2Plugin/src/common/jidctfst.c.o
[osx] [ 61%] Building C object CMakeFiles/JPEGReadWriter2Plugin.dir/extracted/plugins/JPEGReadWriter2Plugin/src/common/jidctint.c.o
[osx] [ 62%] Building C object CMakeFiles/JPEGReadWriter2Plugin.dir/extracted/plugins/JPEGReadWriter2Plugin/src/common/jidctred.c.o
[osx] [ 62%] Building C object CMakeFiles/JPEGReadWriter2Plugin.dir/extracted/plugins/JPEGReadWriter2Plugin/src/common/jmemdatadst.c.o
[osx] [ 63%] Building C object CMakeFiles/JPEGReadWriter2Plugin.dir/extracted/plugins/JPEGReadWriter2Plugin/src/common/jmemdatasrc.c.o
[osx] [ 64%] Building C object CMakeFiles/JPEGReadWriter2Plugin.dir/extracted/plugins/JPEGReadWriter2Plugin/src/common/jmemmgr.c.o
[osx] [ 65%] Building C object CMakeFiles/JPEGReadWriter2Plugin.dir/extracted/plugins/JPEGReadWriter2Plugin/src/common/jmemnobs.c.o
[osx] [ 66%] Building C object CMakeFiles/JPEGReadWriter2Plugin.dir/extracted/plugins/JPEGReadWriter2Plugin/src/common/JPEGReadWriter2Plugin.c.o
[osx] [ 67%] Building C object CMakeFiles/JPEGReadWriter2Plugin.dir/extracted/plugins/JPEGReadWriter2Plugin/src/common/jquant1.c.o
[osx] [ 67%] Building C object CMakeFiles/JPEGReadWriter2Plugin.dir/extracted/plugins/JPEGReadWriter2Plugin/src/common/jquant2.c.o
[osx] [ 68%] Building C object CMakeFiles/JPEGReadWriter2Plugin.dir/extracted/plugins/JPEGReadWriter2Plugin/src/common/jutils.c.o
[osx] [ 69%] Building C object CMakeFiles/JPEGReadWriter2Plugin.dir/extracted/plugins/JPEGReadWriter2Plugin/src/common/sqJPEGReadWriter2Plugin.c.o
[osx] Linking C shared library build/vm/libJPEGReadWriter2Plugin.dylib
[osx] [ 69%] Built target JPEGReadWriter2Plugin
[osx] Scanning dependencies of target JPEGReaderPlugin
[osx] [ 70%] Building C object CMakeFiles/JPEGReaderPlugin.dir/extracted/plugins/JPEGReaderPlugin/src/common/JPEGReaderPlugin.c.o
[osx] Linking C shared library build/vm/libJPEGReaderPlugin.dylib
[osx] [ 70%] Built target JPEGReaderPlugin
[osx] Scanning dependencies of target LargeIntegers
[osx] [ 71%] Building C object CMakeFiles/LargeIntegers.dir/extracted/plugins/LargeIntegers/src/common/LargeIntegers.c.o
[osx] Linking C shared library build/vm/libLargeIntegers.dylib
[osx] [ 71%] Built target LargeIntegers
[osx] Scanning dependencies of target LocalePlugin
[osx] [ 71%] Building C object CMakeFiles/LocalePlugin.dir/extracted/plugins/LocalePlugin/src/common/LocalePlugin.c.o
[osx] [ 72%] Building C object CMakeFiles/LocalePlugin.dir/extracted/plugins/LocalePlugin/src/osx/sqIOSLocale.c.o
[osx] /builds/workspace/pharo-vm_headless/extracted/plugins/LocalePlugin/src/osx/sqIOSLocale.c:133:17: warning: incompatible integer to pointer conversion passing 'time_t' (aka 'long') to parameter of type 'time_t *' (aka 'long *') [-Wint-conversion]
[osx]         theTime = time((time_t)NULL);
[osx]                        ^~~~~~~~~~~~
[osx] /usr/include/time.h:118:21: note: passing argument to parameter here
[osx] time_t time(time_t *);
[osx]                     ^
[osx] 1 warning generated.
[osx] Linking C shared library build/vm/libLocalePlugin.dylib
[osx] [ 72%] Built target LocalePlugin
[osx] Scanning dependencies of target MiscPrimitivePlugin
[osx] [ 73%] Building C object CMakeFiles/MiscPrimitivePlugin.dir/extracted/plugins/MiscPrimitivePlugin/src/common/MiscPrimitivePlugin.c.o
[osx] Linking C shared library build/vm/libMiscPrimitivePlugin.dylib
[osx] [ 73%] Built target MiscPrimitivePlugin
[osx] Scanning dependencies of target Pharo
[osx] [ 74%] Building C object CMakeFiles/Pharo.dir/src/main.c.o
[osx] [ 75%] Building C object CMakeFiles/Pharo.dir/src/parameters.c.o
[osx] [ 75%] Building CXX object CMakeFiles/Pharo.dir/src/macOpenFileDialog.mm.o
[windows]  > git config remote.origin.url https://github.com/pharo-project/opensmalltalk-vm.git # timeout=10
[windows]  > git config --add remote.origin.fetch +refs/heads/*:refs/remotes/origin/* # timeout=10
[windows]  > git config remote.origin.url https://github.com/pharo-project/opensmalltalk-vm.git # timeout=10
[windows] Fetching upstream changes from https://github.com/pharo-project/opensmalltalk-vm.git
[windows] using GIT_ASKPASS to set credentials pharo-ci GitHub account
[windows]  > git fetch --tags --progress https://github.com/pharo-project/opensmalltalk-vm.git +refs/heads/headless:refs/remotes/origin/headless --depth=2
[osx] Linking CXX executable build/vm/Pharo
[osx] [ 75%] Built target Pharo
[osx] Scanning dependencies of target SDL2-2.0.7
[osx] [ 76%] Generating build/third-party/SDL2-2.0.7.zip
[osx] --2019-08-12 23:33:52--  https://files.pharo.org/vm/pharo-spur64/mac/third-party/SDL2-2.0.7.zip
[osx] Resolving files.pharo.org... 164.132.235.17, 2001:41d0:301::23
[osx] Connecting to files.pharo.org|164.132.235.17|:443... connected.
[osx] HTTP request sent, awaiting response... 200 OK
[osx] Length: 961356 (939K) [application/zip]
[osx] Saving to: 'SDL2-2.0.7.zip'
[osx] 
[osx]      0K .......... .......... .......... .......... ..........  5% 2.26M 0s
[osx]     50K .......... .......... .......... .......... .......... 10% 7.21M 0s
[osx]    100K .......... .......... .......... .......... .......... 15% 45.9M 0s
[osx]    150K .......... .......... .......... .......... .......... 21% 11.7M 0s
[osx]    200K .......... .......... .......... .......... .......... 26% 15.7M 0s
[osx]    250K .......... .......... .......... .......... .......... 31% 16.0M 0s
[osx]    300K .......... .......... .......... .......... .......... 37% 14.6M 0s
[osx]    350K .......... .......... .......... .......... .......... 42% 13.8M 0s
[osx]    400K .......... .......... .......... .......... .......... 47% 10.6M 0s
[osx]    450K .......... .......... .......... .......... .......... 53% 8.43M 0s
[osx]    500K .......... .......... .......... .......... .......... 58% 20.6M 0s
[osx]    550K .......... .......... .......... .......... .......... 63% 18.1M 0s
[osx]    600K .......... .......... .......... .......... .......... 69% 17.6M 0s
[osx]    650K .......... .......... .......... .......... .......... 74% 19.8M 0s
[osx]    700K .......... .......... .......... .......... .......... 79% 37.2M 0s
[osx]    750K .......... .......... .......... .......... .......... 85% 16.9M 0s
[osx]    800K .......... .......... .......... .......... .......... 90% 21.1M 0s
[osx]    850K .......... .......... .......... .......... .......... 95% 14.7M 0s
[osx]    900K .......... .......... .......... ........             100% 25.0M=0.08s
[osx] 
[osx] 2019-08-12 23:33:53 (11.7 MB/s) - 'SDL2-2.0.7.zip' saved [961356/961356]
[osx] 
[osx] [ 76%] Generating build/third-party/SDL2-2.0.7.done
[osx] Archive:  SDL2-2.0.7.zip
[osx]   inflating: /builds/workspace/pharo-vm_headless/build/vm/libSDL2-2.0.0.dylib  
[osx]   inflating: /builds/workspace/pharo-vm_headless/build/vm/libSDL2.dylib  
[osx] [ 76%] Built target SDL2-2.0.7
[osx] Scanning dependencies of target SecurityPlugin
[osx] [ 77%] Building C object CMakeFiles/SecurityPlugin.dir/plugins/SecurityPlugin/common/DummySecurityPlugin.c.o
[osx] Linking C shared library build/vm/libSecurityPlugin.dylib
[osx] [ 77%] Built target SecurityPlugin
[osx] Scanning dependencies of target SocketPlugin
[osx] [ 78%] Building C object CMakeFiles/SocketPlugin.dir/extracted/plugins/SocketPlugin/src/common/SocketPlugin.c.o
[osx] /builds/workspace/pharo-vm_headless/extracted/plugins/SocketPlugin/src/common/SocketPlugin.c:2399:3: warning: pointer/integer type mismatch in conditional expression ('SocketPtr' (aka 'SQSocket *') and 'int') [-Wconditional-type-mismatch]
[osx]                 ? ((SocketPtr) (firstIndexableField(socketOop)))
[osx]                 ^ ~~~~~~~~~~~~~~~~~~~~~~~~~~~~~~~~~~~~~~~~~~~~~~
[osx] 1 warning generated.
[osx] [ 79%] Building C object CMakeFiles/SocketPlugin.dir/extracted/plugins/SocketPlugin/src/unix/sqUnixSocket.c.o
[windows] Checking out Revision 674b4bbf9cae0390f9e7dede34b29f9e25034d6c (headless)
[windows]  > git config core.sparsecheckout # timeout=10
[windows]  > git checkout -f 674b4bbf9cae0390f9e7dede34b29f9e25034d6c
[windows] Commit message: "Cleaning unused macros"
[Pipeline] [windows] }
[Pipeline] [windows] // stage
[osx] Linking C shared library build/vm/libSocketPlugin.dylib
[osx] [ 79%] Built target SocketPlugin
[Pipeline] [windows] stage
[Pipeline] [windows] { (Build-windows)
[osx] Scanning dependencies of target SqueakFFIPrims
[osx] [ 79%] Building C object CMakeFiles/SqueakFFIPrims.dir/extracted/plugins/SqueakFFIPrims/src/common/SqueakFFIPrims.c.o
[osx] In file included from /builds/workspace/pharo-vm_headless/extracted/plugins/SqueakFFIPrims/src/common/SqueakFFIPrims.c:23:
[osx] /builds/workspace/pharo-vm_headless/extracted/plugins/SqueakFFIPrims/src/common/X64SysVFFIPlugin.c:903:19: warning: incompatible pointer to integer conversion passing 'void *' to parameter of type 'sqInt' (aka 'long') [-Wint-conversion]
[osx]                         if (isInMemory(ptrAddress)) {
[osx]                                        ^~~~~~~~~~
[osx] /builds/workspace/pharo-vm_headless/extracted/plugins/SqueakFFIPrims/src/common/X64SysVFFIPlugin.c:1156:19: warning: incompatible pointer to integer conversion passing 'void *' to parameter of type 'sqInt' (aka 'long') [-Wint-conversion]
[osx]                         if (isInMemory(ptrAddress)) {
[osx]                                        ^~~~~~~~~~
[Pipeline] [windows] echo
[windows] Executing: #!c:\cygwin64\bin\bash --login
[windows]     cd `cygpath "E:\Builds\workspace\pharo-vm_headless"`
[windows]     set -ex
[windows]     cmake . -DWIN=1
[windows]     
[Pipeline] [windows] withEnv
[Pipeline] [windows] {
[osx] /builds/workspace/pharo-vm_headless/extracted/plugins/SqueakFFIPrims/src/common/X64SysVFFIPlugin.c:2984:18: warning: incompatible pointer to integer conversion passing 'void *' to parameter of type 'sqInt' (aka 'long') [-Wint-conversion]
[osx]                 if (isInMemory(ptrAddress)) {
[osx]                                ^~~~~~~~~~
[osx] /builds/workspace/pharo-vm_headless/extracted/plugins/SqueakFFIPrims/src/common/X64SysVFFIPlugin.c:3037:14: warning: incompatible integer to pointer conversion assigning to 'void *' from 'long' [-Wint-conversion]
[osx]                 ptrAddress = ((longAt(oop + BaseHeaderSize)) > 0
[osx]                            ^ ~~~~~~~~~~~~~~~~~~~~~~~~~~~~~~~~~~~
[osx] /builds/workspace/pharo-vm_headless/extracted/plugins/SqueakFFIPrims/src/common/X64SysVFFIPlugin.c:3277:18: warning: incompatible pointer to integer conversion passing 'void *' to parameter of type 'sqInt' (aka 'long') [-Wint-conversion]
[osx]                 if (isInMemory(ptrAddress)) {
[osx]                                ^~~~~~~~~~
[osx] /builds/workspace/pharo-vm_headless/extracted/plugins/SqueakFFIPrims/src/common/X64SysVFFIPlugin.c:3530:18: warning: incompatible pointer to integer conversion passing 'void *' to parameter of type 'sqInt' (aka 'long') [-Wint-conversion]
[osx]                 if (isInMemory(ptrAddress)) {
[osx]                                ^~~~~~~~~~
[osx] /builds/workspace/pharo-vm_headless/extracted/plugins/SqueakFFIPrims/src/common/X64SysVFFIPlugin.c:6596:21: warning: incompatible pointer types assigning to 'sqInt (*)(sqInt)' from 'sqInt (*)(int)' [-Wincompatible-pointer-types]
[osx]                 characterObjectOf = interpreterProxy->characterObjectOf;
[osx]                                   ^ ~~~~~~~~~~~~~~~~~~~~~~~~~~~~~~~~~~~
[Pipeline] [windows] sh
[osx] 7 warnings generated.
[osx] [ 80%] Building C object CMakeFiles/SqueakFFIPrims.dir/extracted/plugins/SqueakFFIPrims/src/common/sqManualSurface.c.o
[osx] [ 81%] Building C object CMakeFiles/SqueakFFIPrims.dir/extracted/plugins/SqueakFFIPrims/src/common/sqFFIPlugin.c.o
[windows] + cmake . -DWIN=1
[osx] [ 82%] Building C object CMakeFiles/SqueakFFIPrims.dir/extracted/plugins/SqueakFFIPrims/src/common/sqFFITestFuncs.c.o
[osx] Linking C shared library build/vm/libSqueakFFIPrims.dylib
[osx] [ 82%] Built target SqueakFFIPrims
[osx] Scanning dependencies of target SqueakSSL
[osx] [ 83%] Building C object CMakeFiles/SqueakSSL.dir/extracted/plugins/SqueakSSL/src/common/SqueakSSL.c.o
[osx] [ 83%] Building C object CMakeFiles/SqueakSSL.dir/extracted/plugins/SqueakSSL/src/osx/sqMacSSL.c.o
[osx] Linking C shared library build/vm/libSqueakSSL.dylib
[osx] [ 83%] Built target SqueakSSL
[osx] Scanning dependencies of target SurfacePlugin
[osx] [ 84%] Building C object CMakeFiles/SurfacePlugin.dir/extracted/plugins/SurfacePlugin/src/common/SurfacePlugin.c.o
[osx] /builds/workspace/pharo-vm_headless/extracted/plugins/SurfacePlugin/src/common/SurfacePlugin.c:135:3: warning: expression result unused [-Wunused-value]
[osx]                 -1;
[osx]                 ^~
[windows] -- 674b4bbf - Commit: 674b4bbf - Date: 2019-08-12 23:26:11 +0200
[windows] -- The C compiler identification is Clang 5.0.1
[windows] -- The CXX compiler identification is Clang 5.0.1
[windows] -- Check for working C compiler: /usr/bin/x86_64-w64-mingw32-clang
[osx] 1 warning generated.
[osx] Linking C shared library build/vm/libSurfacePlugin.dylib
[osx] [ 84%] Built target SurfacePlugin
[osx] Scanning dependencies of target UUIDPlugin
[osx] [ 85%] Building C object CMakeFiles/UUIDPlugin.dir/plugins/UUIDPlugin/common/UUIDPlugin.c.o
[osx] /builds/workspace/pharo-vm_headless/plugins/UUIDPlugin/common/UUIDPlugin.c:110:1: warning: control reaches end of non-void function [-Wreturn-type]
[osx] }
[osx] ^
[osx] 1 warning generated.
[osx] Linking C shared library build/vm/libUUIDPlugin.dylib
[osx] [ 85%] Built target UUIDPlugin
[osx] Scanning dependencies of target cairo-1.15.4
[osx] [ 86%] Generating build/third-party/cairo-1.15.4.zip
[osx] --2019-08-12 23:33:56--  https://files.pharo.org/vm/pharo-spur64/mac/third-party/cairo-1.15.4.zip
[osx] Resolving files.pharo.org... 164.132.235.17, 2001:41d0:301::23
[osx] Connecting to files.pharo.org|164.132.235.17|:443... connected.
[osx] HTTP request sent, awaiting response... 200 OK
[osx] Length: 1017920 (994K) [application/zip]
[osx] Saving to: 'cairo-1.15.4.zip'
[osx] 
[osx]      0K .......... .......... .......... .......... ..........  5% 4.05M 0s
[osx]     50K .......... .......... .......... .......... .......... 10% 7.90M 0s
[osx]    100K .......... .......... .......... .......... .......... 15% 32.8M 0s
[osx]    150K .......... .......... .......... .......... .......... 20% 12.2M 0s
[osx]    200K .......... .......... .......... .......... .......... 25% 18.5M 0s
[osx]    250K .......... .......... .......... .......... .......... 30% 9.57M 0s
[osx]    300K .......... .......... .......... .......... .......... 35% 27.2M 0s
[osx]    350K .......... .......... .......... .......... .......... 40% 23.4M 0s
[osx]    400K .......... .......... .......... .......... .......... 45% 12.3M 0s
[osx]    450K .......... .......... .......... .......... .......... 50% 20.9M 0s
[osx]    500K .......... .......... .......... .......... .......... 55% 34.1M 0s
[osx]    550K .......... .......... .......... .......... .......... 60% 14.0M 0s
[osx]    600K .......... .......... .......... .......... .......... 65% 27.3M 0s
[osx]    650K .......... .......... .......... .......... .......... 70% 17.7M 0s
[osx]    700K .......... .......... .......... .......... .......... 75% 26.8M 0s
[osx]    750K .......... .......... .......... .......... .......... 80% 12.3M 0s
[osx]    800K .......... .......... .......... .......... .......... 85% 19.3M 0s
[osx]    850K .......... .......... .......... .......... .......... 90%  101M 0s
[osx]    900K .......... .......... .......... .......... .......... 95% 29.5M 0s
[osx]    950K .......... .......... .......... .......... ....      100% 13.2M=0.06s
[osx] 
[osx] 2019-08-12 23:33:56 (15.0 MB/s) - 'cairo-1.15.4.zip' saved [1017920/1017920]
[osx] 
[osx] [ 87%] Generating build/third-party/cairo-1.15.4.done
[osx] Archive:  cairo-1.15.4.zip
[osx]   inflating: /builds/workspace/pharo-vm_headless/build/vm/libcairo.2.dylib  
[osx]   inflating: /builds/workspace/pharo-vm_headless/build/vm/libcairo.dylib  
[osx] [ 87%] Built target cairo-1.15.4
[osx] Scanning dependencies of target freetype-2.9.1
[osx] [ 88%] Generating build/third-party/freetype-2.9.1.zip
[osx] --2019-08-12 23:33:56--  https://files.pharo.org/vm/pharo-spur64/mac/third-party/freetype-2.9.1.zip
[osx] Resolving files.pharo.org... 164.132.235.17, 2001:41d0:301::23
[osx] Connecting to files.pharo.org|164.132.235.17|:443... connected.
[osx] HTTP request sent, awaiting response... 200 OK
[osx] Length: 744194 (727K) [application/zip]
[osx] Saving to: 'freetype-2.9.1.zip'
[osx] 
[osx]      0K .......... .......... .......... .......... ..........  6% 7.94M 0s
[osx]     50K .......... .......... .......... .......... .......... 13% 9.30M 0s
[osx]    100K .......... .......... .......... .......... .......... 20% 23.7M 0s
[osx]    150K .......... .......... .......... .......... .......... 27% 11.0M 0s
[osx]    200K .......... .......... .......... .......... .......... 34% 23.3M 0s
[osx]    250K .......... .......... .......... .......... .......... 41% 55.5M 0s
[osx]    300K .......... .......... .......... .......... .......... 48% 10.8M 0s
[osx]    350K .......... .......... .......... .......... .......... 55% 29.6M 0s
[osx]    400K .......... .......... .......... .......... .......... 61% 18.6M 0s
[osx]    450K .......... .......... .......... .......... .......... 68% 12.0M 0s
[osx]    500K .......... .......... .......... .......... .......... 75% 55.2M 0s
[osx]    550K .......... .......... .......... .......... .......... 82% 40.1M 0s
[osx]    600K .......... .......... .......... .......... .......... 89% 13.0M 0s
[osx]    650K .......... .......... .......... .......... .......... 96% 38.6M 0s
[osx]    700K .......... .......... ......                          100%  129M=0.04s
[osx] 
[osx] 2019-08-12 23:33:56 (17.3 MB/s) - 'freetype-2.9.1.zip' saved [744194/744194]
[osx] 
[osx] [ 88%] Generating build/third-party/freetype-2.9.1.done
[osx] Archive:  freetype-2.9.1.zip
[osx]   inflating: /builds/workspace/pharo-vm_headless/build/vm/libfreetype.6.dylib  
[osx]   inflating: /builds/workspace/pharo-vm_headless/build/vm/libfreetype.dylib  
[osx] [ 88%] Built target freetype-2.9.1
[osx] Scanning dependencies of target libffi-3.3-rc0
[osx] [ 89%] Generating build/third-party/libffi-3.3-rc0.zip
[osx] --2019-08-12 23:33:56--  https://files.pharo.org/vm/pharo-spur64/mac/third-party/libffi-3.3-rc0.zip
[osx] Resolving files.pharo.org... 164.132.235.17, 2001:41d0:301::23
[osx] Connecting to files.pharo.org|164.132.235.17|:443... connected.
[windows] -- Check for working C compiler: /usr/bin/x86_64-w64-mingw32-clang -- works
[windows] -- Detecting C compiler ABI info
[osx] HTTP request sent, awaiting response... 200 OK
[osx] Length: 16182 (16K) [application/zip]
[osx] Saving to: 'libffi-3.3-rc0.zip'
[osx] 
[osx]      0K .......... .....                                      100% 3.06M=0.005s
[osx] 
[osx] 2019-08-12 23:33:56 (3.06 MB/s) - 'libffi-3.3-rc0.zip' saved [16182/16182]
[osx] 
[osx] [ 90%] Generating build/third-party/libffi-3.3-rc0.done
[osx] Archive:  libffi-3.3-rc0.zip
[osx]   inflating: /builds/workspace/pharo-vm_headless/build/vm/libffi.7.dylib  
[osx] [ 90%] Built target libffi-3.3-rc0
[osx] Scanning dependencies of target libgit2-0.25.1
[osx] [ 90%] Generating build/third-party/libgit2-0.25.1.zip
[osx] --2019-08-12 23:33:57--  https://files.pharo.org/vm/pharo-spur64/mac/third-party/libgit2-0.25.1.zip
[osx] Resolving files.pharo.org... 164.132.235.17, 2001:41d0:301::23
[osx] Connecting to files.pharo.org|164.132.235.17|:443... connected.
[osx] HTTP request sent, awaiting response... 200 OK
[osx] Length: 1846137 (1.8M) [application/zip]
[osx] Saving to: 'libgit2-0.25.1.zip'
[osx] 
[osx]      0K .......... .......... .......... .......... ..........  2% 4.77M 0s
[osx]     50K .......... .......... .......... .......... ..........  5% 11.5M 0s
[osx]    100K .......... .......... .......... .......... ..........  8% 7.81M 0s
[osx]    150K .......... .......... .......... .......... .......... 11% 8.00M 0s
[osx]    200K .......... .......... .......... .......... .......... 13% 29.5M 0s
[osx]    250K .......... .......... .......... .......... .......... 16% 15.4M 0s
[osx]    300K .......... .......... .......... .......... .......... 19% 20.3M 0s
[osx]    350K .......... .......... .......... .......... .......... 22% 23.5M 0s
[osx]    400K .......... .......... .......... .......... .......... 24% 14.3M 0s
[osx]    450K .......... .......... .......... .......... .......... 27% 19.0M 0s
[osx]    500K .......... .......... .......... .......... .......... 30% 15.7M 0s
[osx]    550K .......... .......... .......... .......... .......... 33% 20.9M 0s
[osx]    600K .......... .......... .......... .......... .......... 36% 24.2M 0s
[osx]    650K .......... .......... .......... .......... .......... 38% 27.9M 0s
[osx]    700K .......... .......... .......... .......... .......... 41% 20.1M 0s
[osx]    750K .......... .......... .......... .......... .......... 44% 15.8M 0s
[osx]    800K .......... .......... .......... .......... .......... 47% 14.0M 0s
[osx]    850K .......... .......... .......... .......... .......... 49% 46.5M 0s
[osx]    900K .......... .......... .......... .......... .......... 52% 11.0M 0s
[osx]    950K .......... .......... .......... .......... .......... 55% 8.01M 0s
[osx]   1000K .......... .......... .......... .......... .......... 58% 3.88M 0s
[osx]   1050K .......... .......... .......... .......... .......... 61% 32.7M 0s
[osx]   1100K .......... .......... .......... .......... .......... 63% 59.8M 0s
[osx]   1150K .......... .......... .......... .......... .......... 66% 61.1M 0s
[osx]   1200K .......... .......... .......... .......... .......... 69% 61.9M 0s
[osx]   1250K .......... .......... .......... .......... .......... 72% 9.80M 0s
[osx]   1300K .......... .......... .......... .......... .......... 74% 46.5M 0s
[osx]   1350K .......... .......... .......... .......... .......... 77% 53.4M 0s
[osx]   1400K .......... .......... .......... .......... .......... 80% 16.5M 0s
[osx]   1450K .......... .......... .......... .......... .......... 83% 46.8M 0s
[osx]   1500K .......... .......... .......... .......... .......... 85% 18.4M 0s
[osx]   1550K .......... .......... .......... .......... .......... 88% 53.9M 0s
[osx]   1600K .......... .......... .......... .......... .......... 91% 14.2M 0s
[osx]   1650K .......... .......... .......... .......... .......... 94% 40.3M 0s
[osx]   1700K .......... .......... .......... .......... .......... 97% 51.0M 0s
[osx]   1750K .......... .......... .......... .......... .......... 99% 18.3M 0s
[osx]   1800K ..                                                    100% 51.9M=0.1s
[osx] 
[osx] 2019-08-12 23:33:57 (15.8 MB/s) - 'libgit2-0.25.1.zip' saved [1846137/1846137]
[osx] 
[osx] [ 91%] Generating build/third-party/libgit2-0.25.1.done
[osx] Archive:  libgit2-0.25.1.zip
[osx]   inflating: /builds/workspace/pharo-vm_headless/build/vm/libgit2.0.25.1.dylib  
[osx]   inflating: /builds/workspace/pharo-vm_headless/build/vm/libgit2.25.dylib  
[osx]   inflating: /builds/workspace/pharo-vm_headless/build/vm/libgit2.dylib  
[osx] [ 91%] Built target libgit2-0.25.1
[osx] Scanning dependencies of target libpng-1.2.49
[osx] [ 92%] Generating build/third-party/libpng-1.2.49.zip
[osx] --2019-08-12 23:33:57--  https://files.pharo.org/vm/pharo-spur64/mac/third-party/libpng-1.2.49.zip
[osx] Resolving files.pharo.org... 164.132.235.17, 2001:41d0:301::23
[osx] Connecting to files.pharo.org|164.132.235.17|:443... connected.
[osx] HTTP request sent, awaiting response... 200 OK
[osx] Length: 148996 (146K) [application/zip]
[osx] Saving to: 'libpng-1.2.49.zip'
[osx] 
[osx]      0K .......... .......... .......... .......... .......... 34% 4.33M 0s
[osx]     50K .......... .......... .......... .......... .......... 68% 9.41M 0s
[osx]    100K .......... .......... .......... .......... .....     100% 14.6M=0.02s
[osx] 
[osx] 2019-08-12 23:33:57 (7.29 MB/s) - 'libpng-1.2.49.zip' saved [148996/148996]
[osx] 
[osx] [ 93%] Generating build/third-party/libpng-1.2.49.done
[osx] Archive:  libpng-1.2.49.zip
[osx]   inflating: /builds/workspace/pharo-vm_headless/build/vm/libpng12.0.dylib  
[osx]   inflating: /builds/workspace/pharo-vm_headless/build/vm/libpng12.dylib  
[osx] [ 93%] Built target libpng-1.2.49
[osx] Scanning dependencies of target libssh2-1.7.0
[osx] [ 94%] Generating build/third-party/libssh2-1.7.0.zip
[osx] --2019-08-12 23:33:57--  https://files.pharo.org/vm/pharo-spur64/mac/third-party/libssh2-1.7.0.zip
[osx] Resolving files.pharo.org... 164.132.235.17, 2001:41d0:301::23
[osx] Connecting to files.pharo.org|164.132.235.17|:443... connected.
[osx] HTTP request sent, awaiting response... 200 OK
[osx] Length: 184746 (180K) [application/zip]
[osx] Saving to: 'libssh2-1.7.0.zip'
[osx] 
[osx]      0K .......... .......... .......... .......... .......... 27% 5.13M 0s
[osx]     50K .......... .......... .......... .......... .......... 55% 7.01M 0s
[osx]    100K .......... .......... .......... .......... .......... 83% 21.2M 0s
[osx]    150K .......... .......... ..........                      100% 21.3M=0.02s
[osx] 
[osx] 2019-08-12 23:33:57 (8.73 MB/s) - 'libssh2-1.7.0.zip' saved [184746/184746]
[osx] 
[osx] [ 95%] Generating build/third-party/libssh2-1.7.0.done
[osx] Archive:  libssh2-1.7.0.zip
[osx]   inflating: /builds/workspace/pharo-vm_headless/build/vm/libssh2.1.dylib  
[osx]   inflating: /builds/workspace/pharo-vm_headless/build/vm/libssh2.dylib  
[osx] [ 95%] Built target libssh2-1.7.0
[osx] Scanning dependencies of target openssl-1.0.2q
[osx] [ 96%] Generating build/third-party/openssl-1.0.2q.zip
[osx] --2019-08-12 23:33:57--  https://files.pharo.org/vm/pharo-spur64/mac/third-party/openssl-1.0.2q.zip
[osx] Resolving files.pharo.org... 164.132.235.17, 2001:41d0:301::23
[osx] Connecting to files.pharo.org|164.132.235.17|:443... connected.
[osx] HTTP request sent, awaiting response... 200 OK
[osx] Length: 1343688 (1.3M) [application/zip]
[osx] Saving to: 'openssl-1.0.2q.zip'
[osx] 
[osx]      0K .......... .......... .......... .......... ..........  3% 4.22M 0s
[windows] -- Detecting C compiler ABI info - done
[windows] -- Detecting C compile features
[osx]     50K .......... .......... .......... .......... ..........  7% 7.60M 0s
[osx]    100K .......... .......... .......... .......... .......... 11% 30.1M 0s
[osx]    150K .......... .......... .......... .......... .......... 15% 12.6M 0s
[osx]    200K .......... .......... .......... .......... .......... 19% 16.0M 0s
[osx]    250K .......... .......... .......... .......... .......... 22% 17.9M 0s
[osx]    300K .......... .......... .......... .......... .......... 26% 13.0M 0s
[osx]    350K .......... .......... .......... .......... .......... 30% 8.77M 0s
[osx]    400K .......... .......... .......... .......... .......... 34% 36.3M 0s
[osx]    450K .......... .......... .......... .......... .......... 38% 14.0M 0s
[osx]    500K .......... .......... .......... .......... .......... 41% 19.0M 0s
[osx]    550K .......... .......... .......... .......... .......... 45% 16.9M 0s
[osx]    600K .......... .......... .......... .......... .......... 49% 18.8M 0s
[osx]    650K .......... .......... .......... .......... .......... 53% 70.8M 0s
[osx]    700K .......... .......... .......... .......... .......... 57% 24.1M 0s
[osx]    750K .......... .......... .......... .......... .......... 60% 12.5M 0s
[osx]    800K .......... .......... .......... .......... .......... 64% 18.8M 0s
[osx]    850K .......... .......... .......... .......... .......... 68% 7.84M 0s
[osx]    900K .......... .......... .......... .......... .......... 72% 6.51M 0s
[osx]    950K .......... .......... .......... .......... .......... 76% 5.63M 0s
[osx]   1000K .......... .......... .......... .......... .......... 80% 20.4M 0s
[osx]   1050K .......... .......... .......... .......... .......... 83% 64.0M 0s
[osx]   1100K .......... .......... .......... .......... .......... 87% 11.1M 0s
[osx]   1150K .......... .......... .......... .......... .......... 91% 8.81M 0s
[osx]   1200K .......... .......... .......... .......... .......... 95% 36.6M 0s
[osx]   1250K .......... .......... .......... .......... .......... 99% 23.6M 0s
[osx]   1300K .......... ..                                         100% 22.6M=0.1s
[osx] 
[osx] 2019-08-12 23:33:58 (12.8 MB/s) - 'openssl-1.0.2q.zip' saved [1343688/1343688]
[osx] 
[osx] [ 96%] Generating build/third-party/openssl-1.0.2q.done
[osx] Archive:  openssl-1.0.2q.zip
[osx]   inflating: /builds/workspace/pharo-vm_headless/build/vm/libssl.1.0.0.dylib  
[osx]   inflating: /builds/workspace/pharo-vm_headless/build/vm/libssl.dylib  
[osx]   inflating: /builds/workspace/pharo-vm_headless/build/vm/libcrypto.1.0.0.dylib  
[osx] [ 96%] Built target openssl-1.0.2q
[osx] Scanning dependencies of target pixman-0.34.0
[osx] [ 97%] Generating build/third-party/pixman-0.34.0.zip
[osx] --2019-08-12 23:33:58--  https://files.pharo.org/vm/pharo-spur64/mac/third-party/pixman-0.34.0.zip
[osx] Resolving files.pharo.org... 164.132.235.17, 2001:41d0:301::23
[osx] Connecting to files.pharo.org|164.132.235.17|:443... connected.
[osx] HTTP request sent, awaiting response... 200 OK
[osx] Length: 1343558 (1.3M) [application/zip]
[osx] Saving to: 'pixman-0.34.0.zip'
[osx] 
[osx]      0K .......... .......... .......... .......... ..........  3% 3.87M 0s
[osx]     50K .......... .......... .......... .......... ..........  7% 9.72M 0s
[osx]    100K .......... .......... .......... .......... .......... 11% 6.78M 0s
[osx]    150K .......... .......... .......... .......... .......... 15% 13.4M 0s
[osx]    200K .......... .......... .......... .......... .......... 19% 24.8M 0s
[osx]    250K .......... .......... .......... .......... .......... 22% 14.7M 0s
[osx]    300K .......... .......... .......... .......... .......... 26% 10.8M 0s
[osx]    350K .......... .......... .......... .......... .......... 30% 26.8M 0s
[osx]    400K .......... .......... .......... .......... .......... 34% 6.68M 0s
[osx]    450K .......... .......... .......... .......... .......... 38% 8.30M 0s
[osx]    500K .......... .......... .......... .......... .......... 41% 13.2M 0s
[osx]    550K .......... .......... .......... .......... .......... 45% 15.6M 0s
[osx]    600K .......... .......... .......... .......... .......... 49% 24.4M 0s
[osx]    650K .......... .......... .......... .......... .......... 53% 25.3M 0s
[osx]    700K .......... .......... .......... .......... .......... 57% 22.0M 0s
[osx]    750K .......... .......... .......... .......... .......... 60% 29.5M 0s
[osx]    800K .......... .......... .......... .......... .......... 64% 13.6M 0s
[osx]    850K .......... .......... .......... .......... .......... 68% 20.4M 0s
[osx]    900K .......... .......... .......... .......... .......... 72% 32.8M 0s
[osx]    950K .......... .......... .......... .......... .......... 76% 27.4M 0s
[osx]   1000K .......... .......... .......... .......... .......... 80% 14.2M 0s
[osx]   1050K .......... .......... .......... .......... .......... 83% 17.9M 0s
[osx]   1100K .......... .......... .......... .......... .......... 87% 30.2M 0s
[osx]   1150K .......... .......... .......... .......... .......... 91% 19.8M 0s
[osx]   1200K .......... .......... .......... .......... .......... 95% 16.1M 0s
[osx]   1250K .......... .......... .......... .......... .......... 99% 22.5M 0s
[osx]   1300K .......... ..                                         100% 3.80M=0.1s
[osx] 
[osx] 2019-08-12 23:33:58 (13.4 MB/s) - 'pixman-0.34.0.zip' saved [1343558/1343558]
[osx] 
[osx] [ 98%] Generating build/third-party/pixman-0.34.0.done
[osx] Archive:  pixman-0.34.0.zip
[osx]   inflating: /builds/workspace/pharo-vm_headless/build/vm/libpixman-1.0.dylib  
[osx]   inflating: /builds/workspace/pharo-vm_headless/build/vm/libpixman-1.dylib  
[osx] [ 98%] Built target pixman-0.34.0
[osx] Scanning dependencies of target pthreadedPlugin-0.0.1
[osx] [ 99%] Generating build/third-party/pthreadedPlugin-0.0.1.zip
[osx] --2019-08-12 23:33:58--  https://files.pharo.org/vm/pharo-spur64/mac/third-party/pthreadedPlugin-0.0.1.zip
[osx] Resolving files.pharo.org... 164.132.235.17, 2001:41d0:301::23
[osx] Connecting to files.pharo.org|164.132.235.17|:443... connected.
[osx] HTTP request sent, awaiting response... 200 OK
[osx] Length: 438839 (429K) [application/zip]
[osx] Saving to: 'pthreadedPlugin-0.0.1.zip'
[osx] 
[osx]      0K .......... .......... .......... .......... .......... 11% 4.85M 0s
[osx]     50K .......... .......... .......... .......... .......... 23% 7.38M 0s
[osx]    100K .......... .......... .......... .......... .......... 35% 15.0M 0s
[osx]    150K .......... .......... .......... .......... .......... 46% 20.9M 0s
[osx]    200K .......... .......... .......... .......... .......... 58% 14.2M 0s
[osx]    250K .......... .......... .......... .......... .......... 70% 21.7M 0s
[osx]    300K .......... .......... .......... .......... .......... 81% 16.4M 0s
[osx]    350K .......... .......... .......... .......... .......... 93% 16.1M 0s
[osx]    400K .......... .......... ........                        100% 36.5M=0.03s
[osx] 
[osx] 2019-08-12 23:33:58 (12.0 MB/s) - 'pthreadedPlugin-0.0.1.zip' saved [438839/438839]
[osx] 
[osx] [100%] Generating build/third-party/pthreadedPlugin-0.0.1.done
[osx] Archive:  pthreadedPlugin-0.0.1.zip
[osx]   inflating: /builds/workspace/pharo-vm_headless/build/vm/cygffi-7.dll  
[osx]   inflating: /builds/workspace/pharo-vm_headless/build/vm/PThreadedPlugin.dll  
[osx]   inflating: /builds/workspace/pharo-vm_headless/build/vm/libPThreadedPlugin.dylib  
[osx] [100%] Built target pthreadedPlugin-0.0.1
[osx] Install the project...
[osx] -- Install configuration: ""
[osx] -- Installing: /builds/workspace/pharo-vm_headless/build/dist/Pharo.app/Contents/MacOS
[osx] -- Installing: /builds/workspace/pharo-vm_headless/build/dist/Pharo.app/Contents/MacOS/Pharo
[osx] -- Installing: /builds/workspace/pharo-vm_headless/build/dist/Pharo.app/Contents/MacOS/Plugins
[osx] -- Installing: /builds/workspace/pharo-vm_headless/build/dist/Pharo.app/Contents/MacOS/Plugins/libB2DPlugin.dylib
[osx] -- Installing: /builds/workspace/pharo-vm_headless/build/dist/Pharo.app/Contents/MacOS/Plugins/libBitBltPlugin.dylib
[osx] -- Installing: /builds/workspace/pharo-vm_headless/build/dist/Pharo.app/Contents/MacOS/Plugins/libcairo.2.dylib
[osx] -- Installing: /builds/workspace/pharo-vm_headless/build/dist/Pharo.app/Contents/MacOS/Plugins/libcairo.dylib
[osx] -- Installing: /builds/workspace/pharo-vm_headless/build/dist/Pharo.app/Contents/MacOS/Plugins/libcrypto.1.0.0.dylib
[osx] -- Installing: /builds/workspace/pharo-vm_headless/build/dist/Pharo.app/Contents/MacOS/Plugins/libDSAPrims.dylib
[osx] -- Installing: /builds/workspace/pharo-vm_headless/build/dist/Pharo.app/Contents/MacOS/Plugins/libffi.7.dylib
[osx] -- Installing: /builds/workspace/pharo-vm_headless/build/dist/Pharo.app/Contents/MacOS/Plugins/libFileAttributesPlugin.dylib
[osx] -- Installing: /builds/workspace/pharo-vm_headless/build/dist/Pharo.app/Contents/MacOS/Plugins/libFilePlugin.dylib
[osx] -- Installing: /builds/workspace/pharo-vm_headless/build/dist/Pharo.app/Contents/MacOS/Plugins/libfreetype.6.dylib
[osx] -- Installing: /builds/workspace/pharo-vm_headless/build/dist/Pharo.app/Contents/MacOS/Plugins/libfreetype.dylib
[osx] -- Installing: /builds/workspace/pharo-vm_headless/build/dist/Pharo.app/Contents/MacOS/Plugins/libgit2.0.25.1.dylib
[osx] -- Installing: /builds/workspace/pharo-vm_headless/build/dist/Pharo.app/Contents/MacOS/Plugins/libgit2.25.dylib
[osx] -- Installing: /builds/workspace/pharo-vm_headless/build/dist/Pharo.app/Contents/MacOS/Plugins/libgit2.dylib
[osx] -- Installing: /builds/workspace/pharo-vm_headless/build/dist/Pharo.app/Contents/MacOS/Plugins/libIA32ABI.dylib
[osx] -- Installing: /builds/workspace/pharo-vm_headless/build/dist/Pharo.app/Contents/MacOS/Plugins/libJPEGReaderPlugin.dylib
[osx] -- Installing: /builds/workspace/pharo-vm_headless/build/dist/Pharo.app/Contents/MacOS/Plugins/libJPEGReadWriter2Plugin.dylib
[osx] -- Installing: /builds/workspace/pharo-vm_headless/build/dist/Pharo.app/Contents/MacOS/Plugins/libLargeIntegers.dylib
[windows] -- Detecting C compile features - done
[windows] -- Check for working CXX compiler: /usr/bin/x86_64-w64-mingw32-clang++
[osx] -- Installing: /builds/workspace/pharo-vm_headless/build/dist/Pharo.app/Contents/MacOS/Plugins/libLocalePlugin.dylib
[osx] -- Installing: /builds/workspace/pharo-vm_headless/build/dist/Pharo.app/Contents/MacOS/Plugins/libMiscPrimitivePlugin.dylib
[osx] -- Installing: /builds/workspace/pharo-vm_headless/build/dist/Pharo.app/Contents/MacOS/Plugins/libPharoVMCore.dylib
[osx] -- Installing: /builds/workspace/pharo-vm_headless/build/dist/Pharo.app/Contents/MacOS/Plugins/libpixman-1.0.dylib
[osx] -- Installing: /builds/workspace/pharo-vm_headless/build/dist/Pharo.app/Contents/MacOS/Plugins/libpixman-1.dylib
[osx] -- Installing: /builds/workspace/pharo-vm_headless/build/dist/Pharo.app/Contents/MacOS/Plugins/libpng12.0.dylib
[osx] -- Installing: /builds/workspace/pharo-vm_headless/build/dist/Pharo.app/Contents/MacOS/Plugins/libpng12.dylib
[osx] -- Installing: /builds/workspace/pharo-vm_headless/build/dist/Pharo.app/Contents/MacOS/Plugins/libPThreadedPlugin.dylib
[osx] -- Installing: /builds/workspace/pharo-vm_headless/build/dist/Pharo.app/Contents/MacOS/Plugins/libSDL2-2.0.0.dylib
[osx] -- Installing: /builds/workspace/pharo-vm_headless/build/dist/Pharo.app/Contents/MacOS/Plugins/libSDL2.dylib
[osx] -- Installing: /builds/workspace/pharo-vm_headless/build/dist/Pharo.app/Contents/MacOS/Plugins/libSecurityPlugin.dylib
[osx] -- Installing: /builds/workspace/pharo-vm_headless/build/dist/Pharo.app/Contents/MacOS/Plugins/libSocketPlugin.dylib
[osx] -- Installing: /builds/workspace/pharo-vm_headless/build/dist/Pharo.app/Contents/MacOS/Plugins/libSqueakFFIPrims.dylib
[osx] -- Installing: /builds/workspace/pharo-vm_headless/build/dist/Pharo.app/Contents/MacOS/Plugins/libSqueakSSL.dylib
[osx] -- Installing: /builds/workspace/pharo-vm_headless/build/dist/Pharo.app/Contents/MacOS/Plugins/libssh2.1.dylib
[osx] -- Installing: /builds/workspace/pharo-vm_headless/build/dist/Pharo.app/Contents/MacOS/Plugins/libssh2.dylib
[osx] -- Installing: /builds/workspace/pharo-vm_headless/build/dist/Pharo.app/Contents/MacOS/Plugins/libssl.1.0.0.dylib
[osx] -- Installing: /builds/workspace/pharo-vm_headless/build/dist/Pharo.app/Contents/MacOS/Plugins/libssl.dylib
[osx] -- Installing: /builds/workspace/pharo-vm_headless/build/dist/Pharo.app/Contents/MacOS/Plugins/libSurfacePlugin.dylib
[osx] -- Installing: /builds/workspace/pharo-vm_headless/build/dist/Pharo.app/Contents/MacOS/Plugins/libUUIDPlugin.dylib
[osx] -- Installing: /builds/workspace/pharo-vm_headless/build/dist/Pharo.app/Contents/Info.plist
[osx] -- Installing: /builds/workspace/pharo-vm_headless/build/dist/Pharo.app/Contents/Resources/Pharo.icns
[osx] -- Installing: /builds/workspace/pharo-vm_headless/build/dist/include/sq.h
[osx] -- Installing: /builds/workspace/pharo-vm_headless/build/dist/include/sqMemoryAccess.h
[osx] -- Installing: /builds/workspace/pharo-vm_headless/build/dist/include/sqVirtualMachine.h
[osx] -- Installing: /builds/workspace/pharo-vm_headless/build/dist/include/interp.h
[osx] -- Installing: /builds/workspace/pharo-vm_headless/build/dist/include/vmCallback.h
[osx] -- Up-to-date: /builds/workspace/pharo-vm_headless/build/dist/include/interp.h
[windows] -- Check for working CXX compiler: /usr/bin/x86_64-w64-mingw32-clang++ -- works
[windows] -- Detecting CXX compiler ABI info
[Pipeline] [osx] sh
[windows] -- Detecting CXX compiler ABI info - done
[windows] -- Detecting CXX compile features
[osx] + make package
[osx] [ 17%] Built target PharoVMCore
[osx] [ 17%] Built target B2DPlugin
[osx] [ 18%] Built target BitBltPlugin
[osx] [ 19%] Built target DSAPrims
[osx] [ 23%] Built target FilePlugin
[osx] [ 25%] Built target FileAttributesPlugin
[osx] [ 28%] Built target IA32ABI
[osx] [ 69%] Built target JPEGReadWriter2Plugin
[osx] [ 70%] Built target JPEGReaderPlugin
[osx] [ 71%] Built target LargeIntegers
[osx] [ 72%] Built target LocalePlugin
[osx] [ 73%] Built target MiscPrimitivePlugin
[osx] [ 75%] Built target Pharo
[osx] [ 76%] Built target SDL2-2.0.7
[osx] [ 77%] Built target SecurityPlugin
[osx] [ 79%] Built target SocketPlugin
[osx] [ 82%] Built target SqueakFFIPrims
[osx] [ 83%] Built target SqueakSSL
[osx] [ 84%] Built target SurfacePlugin
[osx] [ 85%] Built target UUIDPlugin
[osx] [ 87%] Built target cairo-1.15.4
[osx] [ 88%] Built target freetype-2.9.1
[osx] [ 90%] Built target libffi-3.3-rc0
[osx] [ 91%] Built target libgit2-0.25.1
[osx] [ 93%] Built target libpng-1.2.49
[osx] [ 95%] Built target libssh2-1.7.0
[osx] [ 96%] Built target openssl-1.0.2q
[osx] [ 98%] Built target pixman-0.34.0
[osx] [100%] Built target pthreadedPlugin-0.0.1
[osx] Run CPack packaging tool...
[osx] CPack: Create package using ZIP
[osx] CPack: Install projects
[osx] CPack: - Run preinstall target for: PharoVM
[windows] -- Detecting CXX compile features - done
[windows] -- Building for WINDOWS
[windows] -- Looking for sys/types.h
[windows] -- Looking for sys/types.h - found
[windows] -- Looking for stdint.h
[osx] CPack: - Install project: PharoVM
[osx] CPack: -   Install component: bin
[windows] -- Looking for stdint.h - found
[windows] -- Looking for stddef.h
[osx] CPack: -   Install component: include
[osx] CPack: Create package
[windows] -- Looking for stddef.h - found
[windows] -- Check size of int
[windows] -- Check size of int - done
[windows] -- Check size of long
[windows] -- Check size of long - done
[windows] -- Check size of long long
[windows] -- Check size of long long - done
[windows] -- Check size of void*
[osx] CPack: - package: /builds/workspace/pharo-vm_headless/build/packages/PharoVM-8.1.0-674b4bb-mac64-bin.zip generated.
[osx] CPack: - package: /builds/workspace/pharo-vm_headless/build/packages/PharoVM-8.1.0-674b4bb-mac64-include.zip generated.
[Pipeline] [osx] stash
[windows] -- Check size of void* - done
[windows] -- int 4
[windows] -- long 4
[windows] -- long long 8
[windows] -- void* 8
[windows] -- Looking for include file dirent.h
[windows] -- Looking for include file dirent.h - found
[windows] -- Looking for include file features.h
[windows] -- Looking for include file features.h - not found
[windows] -- Looking for include file unistd.h
[osx] Stashed 2 file(s)
[Pipeline] [osx] archiveArtifacts
[windows] -- Looking for include file unistd.h - found
[windows] -- Looking for include file ndir.h
[windows] -- Looking for include file ndir.h - not found
[windows] -- Looking for include file sys/ndir.h
[windows] -- Looking for include file sys/ndir.h - not found
[windows] -- Looking for include file sys/dir.h
[osx] Archiving artifacts
[windows] -- Looking for include file sys/dir.h - not found
[windows] -- Looking for include file sys/filio.h
[Pipeline] [osx] }
[Pipeline] [osx] // stage
[Pipeline] [osx] }
[Pipeline] [osx] // timeout
[windows] -- Looking for include file sys/filio.h - not found
[windows] -- Looking for include file sys/time.h
[Pipeline] [osx] }
[Pipeline] [osx] // node
[Pipeline] [osx] }
[windows] -- Looking for include file sys/time.h - found
[windows] -- Looking for include file dlfcn.h
[windows] -- Looking for include file dlfcn.h - not found
[windows] -- Looking for dlopen in dl
[windows] -- Looking for dlopen in dl - not found
[windows] -- Looking for dlopen in dyld
[windows] -- Looking for dlopen in dyld - not found
[windows] -- Performing Test HAVE_TM_GMTOFF
[windows] -- Performing Test HAVE_TM_GMTOFF - Failed
[windows] -- Looking for include file sys/uuid.h
[windows] -- Looking for include file sys/uuid.h - not found
[windows] -- Looking for include file uuid/uuid.h
[windows] -- Looking for include file uuid/uuid.h - not found
[windows] -- Looking for include file uuid.h
[windows] -- Looking for include file uuid.h - not found
[windows] -- Looking for uuidgen in uuid
[windows] -- Looking for uuidgen in uuid - not found
[windows] -- Looking for uuid_generate in uuid
[windows] -- Looking for uuid_generate in uuid - not found
[windows] -- C Compiler: /usr/bin/x86_64-w64-mingw32-clang
[windows] -- C++ Compiler: /usr/bin/x86_64-w64-mingw32-clang++
[windows] -- Resource Compiler: x86_64-w64-mingw32-windres
[windows] -- Adding plugin: SecurityPlugin
[windows] -- Adding plugin: FilePlugin
[windows] -- Adding plugin: FileAttributesPlugin
[windows] -- Adding plugin: UUIDPlugin
[windows] -- Adding plugin: SocketPlugin
[windows] -- Adding plugin: SurfacePlugin
[windows] -- Adding plugin: LargeIntegers
[windows] -- Adding plugin: JPEGReaderPlugin
[windows] -- Adding plugin: JPEGReadWriter2Plugin
[windows] -- Adding plugin: MiscPrimitivePlugin
[windows] -- Adding plugin: B2DPlugin
[windows] -- Adding plugin: LocalePlugin
[windows] -- Adding plugin: SqueakSSL
[windows] -- Adding plugin: DSAPrims
[windows] Adding third-party libraries for win: pixman-0.34.0
[windows] Adding third-party libraries for win: cairo-1.15.4
[windows] Adding third-party libraries for win: freetype-2.9.1
[windows] Adding third-party libraries for win: libffi-3.3-rc0
[windows] Adding third-party libraries for win: libgit2-0.25.1
[windows] Adding third-party libraries for win: libpng-1.6.34
[windows] Adding third-party libraries for win: libssh2-1.7.0
[windows] Adding third-party libraries for win: openssl-1.0.2q
[windows] Adding third-party libraries for win: gcc-runtime-3.4
[windows] Adding third-party libraries for win: zlib-1.2.11
[windows] Adding third-party libraries for win: SDL2-2.0.5
[windows] Adding third-party libraries for win: pthreadedPlugin-0.0.1
[windows] -- Configuring done
[windows] -- Generating done
[windows] -- Build files have been written to: /cygdrive/e/Builds/workspace/pharo-vm_headless
[Pipeline] [windows] }
[Pipeline] [windows] // withEnv
[Pipeline] [windows] echo
[windows] Executing: #!c:\cygwin64\bin\bash --login
[windows]     cd `cygpath "E:\Builds\workspace\pharo-vm_headless"`
[windows]     set -ex
[windows]     make install
[windows]     
[Pipeline] [windows] withEnv
[Pipeline] [windows] {
[Pipeline] [windows] sh
[windows] + make install
[windows] [  0%] Downloading Pharo 70
[windows] --2019-08-12 21:34:22--  http://get.pharo.org/64/70
[windows] Resolving get.pharo.org... 164.132.235.17
[windows] Connecting to get.pharo.org|164.132.235.17|:80... connected.
[windows] HTTP request sent, awaiting response... 200 OK
[windows] Length: 3244 (3.2K) [application/octet-stream]
[windows] Saving to: “STDOUT�
[windows] 
[windows]      0K ...                                                   100% 7.65M=0s
[windows] 
[windows] 2019-08-12 21:34:22 (7.65 MB/s) - written to stdout [3244/3244]
[windows] 
[windows] Downloading the latest 70 Image:
[windows]     http://files.pharo.org/get-files/70/pharo64.zip
[windows] Pharo.image
[windows] --2019-08-12 21:34:25--  http://get.pharo.org/64/vm70
[windows] Resolving get.pharo.org... 164.132.235.17
[windows] Connecting to get.pharo.org|164.132.235.17|:80... connected.
[windows] HTTP request sent, awaiting response... 200 OK
[windows] Length: 5320 (5.2K) [application/octet-stream]
[windows] Saving to: “STDOUT�
[windows] 
[windows]      0K .....                                                 100% 12.1M=0s
[windows] 
[windows] 2019-08-12 21:34:25 (12.1 MB/s) - written to stdout [5320/5320]
[windows] 
[windows] Downloading the latest pharoVM:
[windows] 	http://files.pharo.org/get-files/70/pharo64-win-stable.zip
[windows] pharo-vm/PharoConsole.exe
[windows] Creating starter scripts pharo and pharo-ui
[windows] [  1%] Generating VMMaker image
[windows] FileDoesNotExistException: '/cygdrive/e/Builds/workspace/pharo-vm_headless/scripts/installVMMaker.st'
[windows] File>>openForWrite:
[windows] File>>openForRead
[windows] File>>readStream
[windows] File>>readStreamDo:
[windows] STCommandLineHandler>>installSourceFile:
[windows] [ :reference | self installSourceFile: reference ] in [ sourceFiles do: [ :reference | self installSourceFile: reference ] ] in STCommandLineHandler>>installSourceFiles in Block: [ :reference | self installSourceFile: reference ]...etc...
[windows] OrderedCollection>>do:
[windows] [ sourceFiles do: [ :reference | self installSourceFile: reference ] ] in STCommandLineHandler>>installSourceFiles in Block: [ sourceFiles do: [ :reference | self installSourc...etc...
[windows] BlockClosure>>ensure:
[windows] STCommandLineHandler>>installSourceFiles
[windows] STCommandLineHandler>>activate
[windows] STCommandLineHandler class(CommandLineHandler class)>>activateWith:
[windows] [ aCommandLinehandler activateWith: commandLine ] in PharoCommandLineHandler(BasicCommandLineHandler)>>activateSubCommand: in Block: [ aCommandLinehandler activateWith: commandLine ]
[windows] BlockClosure>>on:do:
[windows] PharoCommandLineHandler(BasicCommandLineHandler)>>activateSubCommand:
[windows] PharoCommandLineHandler(BasicCommandLineHandler)>>handleSubcommand
[windows] PharoCommandLineHandler(BasicCommandLineHandler)>>handleArgument:
[windows] [ self
[windows] 	handleArgument:
[windows] 		(self arguments
[windows] 			ifEmpty: [ '' ]
[windows] 			ifNotEmpty: [ :arguments | arguments first ]) ] in [ [ self
[windows] 	handleArgument:
[windows] 		(self arguments
[windows] 			ifEmpty: [ '' ]
[windows] 			ifNotEmpty: [ :arguments | arguments first ]) ]
[windows] 	on: Exit
[windows] 	do: [ :exit | 
[windows] 		"If the command line is protected by password, we just exit the image because in non-headless mode the handleExit will let the image open. If the password protection is enabled, it is to avoid to let the access to the image."
[windows] 		self class commandLinePasswordManager hasPasswordSet
[windows] 			ifTrue: [ Smalltalk snapshot: false andQuit: true ].
[windows] 		^ self handleExit: exit ] ] in PharoCommandLineHandler(BasicCommandLineHandler)>>activate in Block: [ self...
[windows] BlockClosure>>on:do:
[windows] [ [ self
[windows] 	handleArgument:
[windows] 		(self arguments
[windows] 			ifEmpty: [ '' ]
[windows] 			ifNotEmpty: [ :arguments | arguments first ]) ]
[windows] 	on: Exit
[windows] 	do: [ :exit | 
[windows] 		"If the command line is protected by password, we just exit the image because in non-headless mode the handleExit will let the image open. If the password protection is enabled, it is to avoid to let the access to the image."
[windows] 		self class commandLinePasswordManager hasPasswordSet
[windows] 			ifTrue: [ Smalltalk snapshot: false andQuit: true ].
[windows] 		^ self handleExit: exit ] ] in PharoCommandLineHandler(BasicCommandLineHandler)>>activate in Block: [ [ self...
[windows] [ self value.
[windows] Processor terminateActive ] in BlockClosure>>newProcess in Block: [ self value....
[windows] make[2]: *** [CMakeFiles/PharoVMCore.dir/build.make:72: build/vmmaker/VMMaker.image] Error 1
[windows] make[1]: *** [CMakeFiles/Makefile2:474: CMakeFiles/PharoVMCore.dir/all] Error 2
[windows] make: *** [Makefile:150: all] Error 2
[Pipeline] [windows] }
[Pipeline] [windows] // withEnv
[Pipeline] [windows] }
[Pipeline] [windows] // stage
[Pipeline] [windows] }
[Pipeline] [windows] // timeout
[Pipeline] [windows] }
[Pipeline] [windows] // node
[Pipeline] [windows] }
[windows] Failed in branch windows
[Pipeline] // parallel
[Pipeline] End of Pipeline

GitHub has been notified of this commit’s build result

ERROR: cmake exited with error code 1

Finished: FAILURE