FailedConsole Output

Push event to branch headless
23:26:41 Connecting to https://api.github.com using pharo-ci/****** (pharo-ci GitHub account)
Obtained Jenkinsfile from 674b4bbf9cae0390f9e7dede34b29f9e25034d6c
Running in Durability level: MAX_SURVIVABILITY
[Pipeline] properties
[Pipeline] parallel
[Pipeline] [unix] { (Branch: unix)
[Pipeline] [osx] { (Branch: osx)
[Pipeline] [windows] { (Branch: windows)
[Pipeline] [unix] node
[unix] Running on pharo-ci-jenkins2-unix-3 in /builds/workspace/pharo-vm_headless
[Pipeline] [osx] node
[Pipeline] [windows] node
[Pipeline] [unix] {
[Pipeline] [unix] timeout
[unix] Timeout set to expire in 30 min
[Pipeline] [unix] {
[Pipeline] [unix] cleanWs
[unix] [WS-CLEANUP] Deleting project workspace...
[unix] [WS-CLEANUP] Deferred wipeout is used...
[unix] [WS-CLEANUP] done
[Pipeline] [unix] stage
[Pipeline] [unix] { (Checkout-unix)
[Pipeline] [unix] checkout
[unix] Cloning the remote Git repository
[unix] Using shallow clone
[unix] shallow clone depth 2
[unix] Cloning repository https://github.com/pharo-project/opensmalltalk-vm.git
[unix]  > git init /builds/workspace/pharo-vm_headless # timeout=10
[unix] Fetching upstream changes from https://github.com/pharo-project/opensmalltalk-vm.git
[unix]  > git --version # timeout=10
[unix] using GIT_ASKPASS to set credentials pharo-ci GitHub account
[unix]  > git fetch --tags --progress https://github.com/pharo-project/opensmalltalk-vm.git +refs/heads/*:refs/remotes/origin/* --depth=2
[osx] Still waiting to schedule task
[osx] Waiting for next available executor on pharo-ci-jenkins2-osx
[windows] Still waiting to schedule task
[windows] Waiting for next available executor on windows
[unix]  > git config remote.origin.url https://github.com/pharo-project/opensmalltalk-vm.git # timeout=10
[unix]  > git config --add remote.origin.fetch +refs/heads/*:refs/remotes/origin/* # timeout=10
[unix]  > git config remote.origin.url https://github.com/pharo-project/opensmalltalk-vm.git # timeout=10
[unix] Fetching upstream changes from https://github.com/pharo-project/opensmalltalk-vm.git
[unix] using GIT_ASKPASS to set credentials pharo-ci GitHub account
[unix]  > git fetch --tags --progress https://github.com/pharo-project/opensmalltalk-vm.git +refs/heads/headless:refs/remotes/origin/headless --depth=2
[unix] Checking out Revision 674b4bbf9cae0390f9e7dede34b29f9e25034d6c (headless)
[unix]  > git config core.sparsecheckout # timeout=10
[unix]  > git checkout -f 674b4bbf9cae0390f9e7dede34b29f9e25034d6c
[unix] Commit message: "Cleaning unused macros"
[unix]  > git rev-list --no-walk 5427b3fd2903abed671308b380751016ac92d1cf # timeout=10
[unix] First time build. Skipping changelog.
[Pipeline] [unix] }
[Pipeline] [unix] // stage
[Pipeline] [unix] stage
[Pipeline] [unix] { (Build-unix)
[Pipeline] [unix] cmakeBuild
[unix] [pharo-vm_headless] $ cmake -G "Unix Makefiles" /builds/workspace/pharo-vm_headless
[unix] -- 674b4bb - Commit: 674b4bb - Date: 2019-08-12 23:26:11 +0200
[unix] -- The C compiler identification is GNU 5.4.0
[unix] -- The CXX compiler identification is GNU 5.4.0
[unix] -- Check for working C compiler: /usr/bin/cc
[unix] -- Check for working C compiler: /usr/bin/cc -- works
[unix] -- Detecting C compiler ABI info
[unix] -- Detecting C compiler ABI info - done
[unix] -- Detecting C compile features
[unix] -- Detecting C compile features - done
[unix] -- Check for working CXX compiler: /usr/bin/c++
[unix] -- Check for working CXX compiler: /usr/bin/c++ -- works
[unix] -- Detecting CXX compiler ABI info
[unix] -- Detecting CXX compiler ABI info - done
[unix] -- Detecting CXX compile features
[unix] -- Detecting CXX compile features - done
[unix] -- Looking for sys/types.h
[unix] -- Looking for sys/types.h - found
[unix] -- Looking for stdint.h
[unix] -- Looking for stdint.h - found
[unix] -- Looking for stddef.h
[unix] -- Looking for stddef.h - found
[unix] -- Check size of int
[unix] -- Check size of int - done
[unix] -- Check size of long
[unix] -- Check size of long - done
[unix] -- Check size of long long
[unix] -- Check size of long long - done
[unix] -- Check size of void*
[unix] -- Check size of void* - done
[unix] -- int 4
[unix] -- long 8
[unix] -- long long 8
[unix] -- void* 8
[unix] -- Looking for include file dirent.h
[unix] -- Looking for include file dirent.h - found
[unix] -- Looking for include file features.h
[unix] -- Looking for include file features.h - found
[unix] -- Looking for include file unistd.h
[unix] -- Looking for include file unistd.h - found
[unix] -- Looking for include file ndir.h
[unix] -- Looking for include file ndir.h - not found
[unix] -- Looking for include file sys/ndir.h
[unix] -- Looking for include file sys/ndir.h - not found
[unix] -- Looking for include file sys/dir.h
[unix] -- Looking for include file sys/dir.h - found
[unix] -- Looking for include file sys/filio.h
[unix] -- Looking for include file sys/filio.h - not found
[unix] -- Looking for include file sys/time.h
[unix] -- Looking for include file sys/time.h - found
[unix] -- Looking for include file dlfcn.h
[unix] -- Looking for include file dlfcn.h - found
[unix] -- Looking for dlopen in dl
[unix] -- Looking for dlopen in dl - found
[unix] -- Looking for dlopen in dyld
[unix] -- Looking for dlopen in dyld - not found
[unix] -- Performing Test HAVE_TM_GMTOFF
[unix] -- Performing Test HAVE_TM_GMTOFF - Success
[unix] -- Looking for include file sys/uuid.h
[unix] -- Looking for include file sys/uuid.h - not found
[unix] -- Looking for include file uuid/uuid.h
[unix] -- Looking for include file uuid/uuid.h - found
[unix] -- Looking for include file uuid.h
[unix] -- Looking for include file uuid.h - not found
[unix] -- Looking for uuidgen in uuid
[unix] -- Looking for uuidgen in uuid - not found
[unix] -- Looking for uuid_generate in uuid
[unix] -- Looking for uuid_generate in uuid - found
[unix] -- C Compiler: /usr/bin/cc
[unix] -- C++ Compiler: /usr/bin/c++
[unix] -- Resource Compiler: 
[unix] -- Adding plugin: SecurityPlugin
[unix] -- Adding plugin: FilePlugin
[unix] -- Adding plugin: FileAttributesPlugin
[unix] -- Adding plugin: UUIDPlugin
[unix] -- Adding plugin: SocketPlugin
[unix] -- Adding plugin: SurfacePlugin
[unix] -- Adding plugin: LargeIntegers
[unix] -- Adding plugin: JPEGReaderPlugin
[unix] -- Adding plugin: JPEGReadWriter2Plugin
[unix] -- Adding plugin: MiscPrimitivePlugin
[unix] -- Adding plugin: B2DPlugin
[unix] -- Adding plugin: LocalePlugin
[unix] -- Adding plugin: SqueakSSL
[unix] -- Adding plugin: DSAPrims
[unix] Adding third-party libraries for linux: pthreadedPlugin-0.0.1
[unix] Adding third-party libraries for linux: libffi-3.3-rc0
[unix] Adding third-party libraries for linux: libgit2-0.25.1
[unix] Adding third-party libraries for linux: libssh2-1.7.0
[unix] Adding third-party libraries for linux: openssl-1.0.2q
[unix] Adding third-party libraries for linux: SDL2-2.0.7
[unix] -- Configuring done
[unix] CMake Error: The inter-target dependency graph contains the following strongly connected component (cycle):
[unix]   "pharo" of type EXECUTABLE
[unix]     depends on "PharoVMCore" (weak)
[unix]   "PharoVMCore" of type SHARED_LIBRARY
[unix]     depends on "pharo" (strong)
[unix] At least one of these targets is not a STATIC_LIBRARY.  Cyclic dependencies are allowed only among static libraries.
[unix] -- Build files have been written to: /builds/workspace/pharo-vm_headless
[Pipeline] [unix] }
[Pipeline] [unix] // stage
[Pipeline] [unix] }
[Pipeline] [unix] // timeout
[Pipeline] [unix] }
[Pipeline] [unix] // node
[Pipeline] [unix] }
[unix] Failed in branch unix
[osx] Running on pharo-ci-jenkins2-osx in /builds/workspace/pharo-vm_headless
[Pipeline] [osx] {
[Pipeline] [osx] timeout
[osx] Timeout set to expire in 30 min
[Pipeline] [osx] {
[Pipeline] [osx] cleanWs
[osx] [WS-CLEANUP] Deleting project workspace...
[osx] [WS-CLEANUP] Deferred wipeout is used...
[osx] [WS-CLEANUP] done
[Pipeline] [osx] stage
[Pipeline] [osx] { (Checkout-osx)
[Pipeline] [osx] checkout
[osx] Cloning the remote Git repository
[osx] Using shallow clone
[osx] shallow clone depth 2
[osx] Cloning repository https://github.com/pharo-project/opensmalltalk-vm.git
[osx]  > git init /builds/workspace/pharo-vm_headless # timeout=10
[osx] Fetching upstream changes from https://github.com/pharo-project/opensmalltalk-vm.git
[osx]  > git --version # timeout=10
[osx] using GIT_ASKPASS to set credentials pharo-ci GitHub account
[osx]  > git fetch --tags --progress https://github.com/pharo-project/opensmalltalk-vm.git +refs/heads/*:refs/remotes/origin/* --depth=2
[osx]  > git config remote.origin.url https://github.com/pharo-project/opensmalltalk-vm.git # timeout=10
[osx]  > git config --add remote.origin.fetch +refs/heads/*:refs/remotes/origin/* # timeout=10
[osx]  > git config remote.origin.url https://github.com/pharo-project/opensmalltalk-vm.git # timeout=10
[osx] Fetching upstream changes from https://github.com/pharo-project/opensmalltalk-vm.git
[osx] using GIT_ASKPASS to set credentials pharo-ci GitHub account
[osx]  > git fetch --tags --progress https://github.com/pharo-project/opensmalltalk-vm.git +refs/heads/headless:refs/remotes/origin/headless --depth=2
[osx] Checking out Revision 674b4bbf9cae0390f9e7dede34b29f9e25034d6c (headless)
[osx]  > git config core.sparsecheckout # timeout=10
[osx]  > git checkout -f 674b4bbf9cae0390f9e7dede34b29f9e25034d6c
[osx] Commit message: "Cleaning unused macros"
[Pipeline] [osx] }
[Pipeline] [osx] // stage
[Pipeline] [osx] stage
[Pipeline] [osx] { (Build-osx)
[Pipeline] [osx] cmakeBuild
[osx] [pharo-vm_headless] $ cmake -G "Unix Makefiles" /builds/workspace/pharo-vm_headless
[osx] -- 674b4bb - Commit: 674b4bb - Date: 2019-08-12 23:26:11 +0200
[osx] -- The C compiler identification is AppleClang 6.0.0.6000051
[osx] -- The CXX compiler identification is AppleClang 6.0.0.6000051
[osx] -- Check for working C compiler: /Applications/Xcode.app/Contents/Developer/Toolchains/XcodeDefault.xctoolchain/usr/bin/cc
[osx] -- Check for working C compiler: /Applications/Xcode.app/Contents/Developer/Toolchains/XcodeDefault.xctoolchain/usr/bin/cc -- works
[osx] -- Detecting C compiler ABI info
[osx] -- Detecting C compiler ABI info - done
[osx] -- Detecting C compile features
[osx] -- Detecting C compile features - done
[osx] -- Check for working CXX compiler: /Applications/Xcode.app/Contents/Developer/Toolchains/XcodeDefault.xctoolchain/usr/bin/c++
[osx] -- Check for working CXX compiler: /Applications/Xcode.app/Contents/Developer/Toolchains/XcodeDefault.xctoolchain/usr/bin/c++ -- works
[osx] -- Detecting CXX compiler ABI info
[osx] -- Detecting CXX compiler ABI info - done
[osx] -- Detecting CXX compile features
[osx] -- Detecting CXX compile features - done
[osx] -- Looking for sys/types.h
[osx] -- Looking for sys/types.h - found
[osx] -- Looking for stdint.h
[osx] -- Looking for stdint.h - found
[osx] -- Looking for stddef.h
[osx] -- Looking for stddef.h - found
[osx] -- Check size of int
[osx] -- Check size of int - done
[osx] -- Check size of long
[osx] -- Check size of long - done
[osx] -- Check size of long long
[osx] -- Check size of long long - done
[osx] -- Check size of void*
[osx] -- Check size of void* - done
[osx] -- int 4
[osx] -- long 8
[osx] -- long long 8
[osx] -- void* 8
[osx] -- Looking for include file dirent.h
[osx] -- Looking for include file dirent.h - found
[osx] -- Looking for include file features.h
[osx] -- Looking for include file features.h - not found
[osx] -- Looking for include file unistd.h
[osx] -- Looking for include file unistd.h - found
[osx] -- Looking for include file ndir.h
[osx] -- Looking for include file ndir.h - not found
[osx] -- Looking for include file sys/ndir.h
[osx] -- Looking for include file sys/ndir.h - not found
[osx] -- Looking for include file sys/dir.h
[osx] -- Looking for include file sys/dir.h - found
[osx] -- Looking for include file sys/filio.h
[osx] -- Looking for include file sys/filio.h - found
[osx] -- Looking for include file sys/time.h
[osx] -- Looking for include file sys/time.h - found
[osx] -- Looking for include file dlfcn.h
[osx] -- Looking for include file dlfcn.h - found
[osx] -- Looking for dlopen in dl
[osx] -- Looking for dlopen in dl - found
[osx] -- Looking for dlopen in dyld
[osx] -- Looking for dlopen in dyld - not found
[osx] -- Performing Test HAVE_TM_GMTOFF
[osx] -- Performing Test HAVE_TM_GMTOFF - Success
[osx] -- Looking for include file sys/uuid.h
[osx] -- Looking for include file sys/uuid.h - not found
[osx] -- Looking for include file uuid/uuid.h
[osx] -- Looking for include file uuid/uuid.h - found
[osx] -- Looking for include file uuid.h
[osx] -- Looking for include file uuid.h - not found
[osx] -- Looking for uuidgen in uuid
[osx] -- Looking for uuidgen in uuid - not found
[osx] -- Looking for uuid_generate in uuid
[osx] -- Looking for uuid_generate in uuid - not found
[osx] -- C Compiler: /Applications/Xcode.app/Contents/Developer/Toolchains/XcodeDefault.xctoolchain/usr/bin/cc
[osx] -- C++ Compiler: /Applications/Xcode.app/Contents/Developer/Toolchains/XcodeDefault.xctoolchain/usr/bin/c++
[osx] -- Resource Compiler: 
[osx] -- Adding plugin: SecurityPlugin
[osx] -- Adding plugin: FilePlugin
[osx] -- Adding plugin: FileAttributesPlugin
[osx] -- Adding plugin: UUIDPlugin
[osx] -- Adding plugin: SocketPlugin
[osx] -- Adding plugin: SurfacePlugin
[osx] -- Adding plugin: LargeIntegers
[osx] -- Adding plugin: JPEGReaderPlugin
[osx] -- Adding plugin: JPEGReadWriter2Plugin
[osx] -- Adding plugin: MiscPrimitivePlugin
[osx] -- Adding plugin: B2DPlugin
[osx] -- Adding plugin: LocalePlugin
[osx] -- Adding plugin: SqueakSSL
[osx] -- Adding plugin: DSAPrims
[osx] Adding third-party libraries for mac: pixman-0.34.0
[osx] Adding third-party libraries for mac: cairo-1.15.4
[osx] Adding third-party libraries for mac: freetype-2.9.1
[osx] Adding third-party libraries for mac: libffi-3.3-rc0
[osx] Adding third-party libraries for mac: libgit2-0.25.1
[osx] Adding third-party libraries for mac: libpng-1.2.49
[osx] Adding third-party libraries for mac: libssh2-1.7.0
[osx] Adding third-party libraries for mac: openssl-1.0.2q
[osx] Adding third-party libraries for mac: pthreadedPlugin-0.0.1
[osx] Adding third-party libraries for mac: SDL2-2.0.7
[osx] -- Configuring done
[osx] -- Generating done
[osx] -- Build files have been written to: /builds/workspace/pharo-vm_headless
[Pipeline] [osx] sh
[osx] + make install
[osx] [  1%] Downloading Pharo 70
[osx] --2019-08-12 23:29:02--  http://get.pharo.org/64/70
[osx] Resolving get.pharo.org... 164.132.235.17, 2001:41d0:301::23
[osx] Connecting to get.pharo.org|164.132.235.17|:80... connected.
[osx] HTTP request sent, awaiting response... 200 OK
[osx] Length: 3244 (3.2K) [application/octet-stream]
[osx] Saving to: 'STDOUT'
[osx] 
[osx]      0K ...                                                   100%  206M=0s
[osx] 
[osx] 2019-08-12 23:29:03 (206 MB/s) - written to stdout [3244/3244]
[osx] 
[osx] Downloading the latest 70 Image:
[osx]     http://files.pharo.org/get-files/70/pharo64.zip
[osx] Pharo.image
[osx] --2019-08-12 23:29:05--  http://get.pharo.org/64/vm70
[osx] Resolving get.pharo.org... 164.132.235.17, 2001:41d0:301::23
[osx] Connecting to get.pharo.org|164.132.235.17|:80... connected.
[osx] HTTP request sent, awaiting response... 200 OK
[osx] Length: 5320 (5.2K) [application/octet-stream]
[osx] Saving to: 'STDOUT'
[osx] 
[osx]      0K .....                                                 100%  154M=0s
[osx] 
[osx] 2019-08-12 23:29:05 (154 MB/s) - written to stdout [5320/5320]
[osx] 
[osx] Downloading the latest pharoVM:
[osx] 	http://files.pharo.org/get-files/70/pharo64-mac-stable.zip
[osx] pharo-vm/Pharo.app/Contents/MacOS/Pharo
[osx] Creating starter scripts pharo and pharo-ui
[osx] [  2%] Generating VMMaker image
[osx] 2019-08-12 23:29:06.147 Pharo[70712:507] ApplePersistenceIgnoreState: Existing state will not be touched. New state will be written to /var/folders/w0/nn_htp7n6ddcydvkv21hjzhc0000gn/T/org.pharo.Pharo.savedState
[osx] 2019-08-12 23:29:06.608 Pharo[70712:507] 23:29:06.608 ERROR:     [0x7fff76088310] AQMEIO.cpp:377: _FindIOUnit: error -66680
[osx] 2019-08-12 23:29:06.608 Pharo[70712:507] 23:29:06.608 ERROR:     [0x7fff76088310] >aq> AudioQueueObject.cpp:1590: Prime: failed (-66680); will stop (5512/0 frames)
[osx] 2019-08-12 23:29:06.609 Pharo[70712:507] 23:29:06.609 ERROR:     [0x7fff76088310] AQMEIO.cpp:377: _FindIOUnit: error -66680
[osx] 2019-08-12 23:29:06.610 Pharo[70712:507] 23:29:06.610 ERROR:     [0x7fff76088310] >aq> AudioQueueObject.cpp:1590: Prime: failed (-66680); will stop (33075/0 frames)
[osx] 
[osx] Fetched -> BaselineOfVMMaker-CompatibleUserName.1565645171 --- https://github.com/pharo-project/opensmalltalk-vm.git[Detached at 674b4bb] --- https://github.com/pharo-project/opensmalltalk-vm.git[Detached at 674b4bb]
[osx] Loaded -> BaselineOfVMMaker-CompatibleUserName.1565645171 --- https://github.com/pharo-project/opensmalltalk-vm.git[Detached at 674b4bb] --- https://github.com/pharo-project/opensmalltalk-vm.git[Detached at 674b4bb]
[osx] Loading baseline of BaselineOfVMMaker...
[osx] Fetched -> VMMakerCompatibilityForPharo6-CompatibleUserName.1565645171 --- https://github.com/pharo-project/opensmalltalk-vm.git[Detached at 674b4bb] --- https://github.com/pharo-project/opensmalltalk-vm.git[Detached at 674b4bb]
[osx] Fetched -> VMMakerTests-CompatibleUserName.1565645171 --- https://github.com/pharo-project/opensmalltalk-vm.git[Detached at 674b4bb] --- https://github.com/pharo-project/opensmalltalk-vm.git[Detached at 674b4bb]
[osx] Fetched -> Printf-eem.10 --- http://www.squeaksource.com/Printf --- http://www.squeaksource.com/Printf
[osx] Fetched -> VMMaker-CompatibleUserName.1565645171 --- https://github.com/pharo-project/opensmalltalk-vm.git[Detached at 674b4bb] --- https://github.com/pharo-project/opensmalltalk-vm.git[Detached at 674b4bb]
[osx] *** Warning: Warning: This package depends on the following classes:
[osx]   VMThreadingConstants
[osx]   VMBasicConstants
[osx] You must resolve these dependencies before you will be able to load these definitions: 
[osx]   VMMTTests
[osx]   VMMTTests>>#runCaseManaged
[osx]   VMMTTests>>#setUp
[osx]   VMMTTests>>#testAssignableThreadIsNotVMOwner
[osx]   VMMTTests>>#testAssignableThreadIsWilling
[osx]   VMMTTests>>#testDisownOnRelinquishPutsVMInRelinquishingState
[osx]   VMMTTests>>#testDisownRemembersLastDisownedThread
[osx]   VMMTTests>>#testDisownVMReleasesVM
[osx]   VMMTTests>>#testDisownVMSetsCurrentThreadToUnavailable
[osx]   VMMTTests>>#testHeartbeatReleasesVMWhenNoProcessIsWilling
[osx]   VMMTTests>>#testHeartbeatWakesUpWaitingVMThread
[osx]   VMMTTests>>#testInitialThreadIsAssignableOrInVM
[osx]   VMMTTests>>#testInitialVMHasManyThreads
[osx]   VMMTTests>>#testInitialVMHasNoDisowningVMThread
[osx]   VMMTTests>>#testInitialVMThreadsAreUinitialized
[osx]   VMMTTests>>#testOwnFreeVMOwnsSameThread
[osx]   VMMTTests>>#testPreemptedProcessIsMarkedInExternalCode
[osx]   VMMTTests>>#testPreemptedProcessSetsCurrentMethodInThread
[osx]   VMMTTests>>#testPreemptedVMThreadHasPreemptedProcessPriority
[osx]   VMMTTests>>#testPreemptedVMThreadIsListedInAWOLProcesses
[osx]   VMMTTests>>#testPreemptedVMThreadIsTemporarilyAffinedToProcess
[osx]   VMMTTests>>#testTryOwningOwnedVMLeavesThreadInWaitingState
[osx]   VMMTTests>>#testWantingThreadIsWilling
[osx]   VMMTTests>>#testWantingThreadIsWillingOverAssignableThread
[osx] 
[osx] 
[osx] RBVariableNode>>asTranslatorNodeIn: (TConstantNode is Undeclared) 
[osx] 
[osx] RBVariableNode>>asTranslatorNodeIn: (TConstantNode is Undeclared) 
[osx] 
[osx] RBVariableNode>>asTranslatorNodeIn: (TVariableNode is Undeclared) 
[osx] 
[osx] RBCascadeNode>>asTranslatorNodeIn: (TStmtListNode is Undeclared) 
[osx] 
[osx] RBCascadeNode>>asTranslatorNodeIn: (TVariableNode is Undeclared) 
[osx] 
[osx] RBCascadeNode>>asTranslatorNodeIn: (TAssignmentNode is Undeclared) 
[osx] 
[osx] PharoVMMaker class>>generateCoInterpreter (VMMaker is Undeclared) 
[osx] 
[osx] PharoVMMaker class>>generateCoInterpreter (CoInterpreter is Undeclared) 
[osx] 
[osx] PharoVMMaker class>>generateCoInterpreter (VMMaker is Undeclared) 
[osx] 
[osx] PharoVMMaker class>>generateCoInterpreter (CoInterpreter is Undeclared) 
[osx] 
[osx] PharoVMMaker class>>generateCoInterpreter (StackToRegisterMappingCogit is Undeclared) 
[osx] 
[osx] PharoVMMaker class>>generateCoInterpreterMT (VMMaker is Undeclared) 
[osx] 
[osx] PharoVMMaker class>>generateCoInterpreterMT (VMMaker is Undeclared) 
[osx] 
[osx] PharoVMMaker class>>generateCoInterpreterMT (CoInterpreterMT is Undeclared) 
[osx] 
[osx] PharoVMMaker class>>generateCoInterpreterMT (StackToRegisterMappingCogit is Undeclared) 
[osx] 
[osx] PharoVMMaker class>>generateCoInterpreterWithQueueFFI (VMMaker is Undeclared) 
[osx] 
[osx] PharoVMMaker class>>generateCoInterpreterWithQueueFFI (CoInterpreterWithQueueFFI is Undeclared) 
[osx] 
[osx] PharoVMMaker class>>generateCoInterpreterWithQueueFFI (VMMaker is Undeclared) 
[osx] 
[osx] PharoVMMaker class>>generateCoInterpreterWithQueueFFI (StackToRegisterMappingCogit is Undeclared) 
[osx] 
[osx] RBReturnNode>>asTranslatorNodeIn: (TReturnNode is Undeclared) 
[osx] 
[osx] RBReturnNode>>asTranslatorNodeIn: (TReturnNode is Undeclared) 
[osx] 
[osx] VMCodeGenerationTest>>testCommentsInBlocks (TMethod is Undeclared) 
[osx] 
[osx] VMCodeGenerationTest>>testCommentsInBlocks (CCodeGeneratorGlobalStructure is Undeclared) 
[osx] 
[osx] VMCodeGenerationTest>>testCommentsInInlinedBlocks (TMethod is Undeclared) 
[osx] 
[osx] VMCodeGenerationTest>>testCommentsInInlinedBlocks (CCodeGeneratorGlobalStructure is Undeclared) 
[osx] 
[osx] VMCodeGenerationTest>>testComplexIfNilAssignment (TMethod is Undeclared) 
[osx] 
[osx] VMCodeGenerationTest>>testComplexIfNilAssignment (CCodeGeneratorGlobalStructure is Undeclared) 
[osx] 
[osx] VMCodeGenerationTest>>testLoopVariableIsTemp (TMethod is Undeclared) 
[osx] 
[osx] VMCodeGenerationTest>>testLoopVariableIsTemp (CCodeGeneratorGlobalStructure is Undeclared) 
[osx] 
[osx] VMCodeGenerationTest>>testNilIfNilGeneratesOnlyFirstBranch (TMethod is Undeclared) 
[osx] 
[osx] VMCodeGenerationTest>>testNilIfNilGeneratesOnlyFirstBranch (CCodeGeneratorGlobalStructure is Undeclared) 
[osx] 
[osx] VMCodeGenerationTest>>testSimpleIfNil (TMethod is Undeclared) 
[osx] 
[osx] VMCodeGenerationTest>>testSimpleIfNil (CCodeGeneratorGlobalStructure is Undeclared) 
[osx] 
[osx] VMCodeGenerationTest>>testSimpleIfNilAssignment (TMethod is Undeclared) 
[osx] 
[osx] VMCodeGenerationTest>>testSimpleIfNilAssignment (CCodeGeneratorGlobalStructure is Undeclared) 
[osx] 
[osx] VMMASTTranslationTest>>testArgumentIsNoTemp (TMethod is Undeclared) 
[osx] 
[osx] VMMASTTranslationTest>>testComplexIfNilIfNotNilWithArgument (TMethod is Undeclared) 
[osx] 
[osx] VMMASTTranslationTest>>testComplexIfNilIfNotNilWithArgument (CCodeGeneratorGlobalStructure is Undeclared) 
[osx] 
[osx] VMMASTTranslationTest>>testComplexIfNotNilIfNilWithArgument (TMethod is Undeclared) 
[osx] 
[osx] VMMASTTranslationTest>>testComplexIfNotNilIfNilWithArgument (CCodeGeneratorGlobalStructure is Undeclared) 
[osx] 
[osx] VMMASTTranslationTest>>testComplexIfNotNilWithArgument (TMethod is Undeclared) 
[osx] 
[osx] VMMASTTranslationTest>>testComplexIfNotNilWithArgument (CCodeGeneratorGlobalStructure is Undeclared) 
[osx] 
[osx] VMMASTTranslationTest>>testEmptyBlockGeneratesSingleNilStatement (TMethod is Undeclared) 
[osx] 
[osx] VMMASTTranslationTest>>testEmptyBlockGeneratesSingleNilStatement (CCodeGeneratorGlobalStructure is Undeclared) 
[osx] 
[osx] VMMASTTranslationTest>>testIfNilIfNotNilBecomesIfTrueIfFalse (TMethod is Undeclared) 
[osx] 
[osx] VMMASTTranslationTest>>testIfNilIfNotNilDoesNotInvertBlocks (TMethod is Undeclared) 
[osx] 
[osx] VMMASTTranslationTest>>testIfNotNilIfNilInversesBlocks (TMethod is Undeclared) 
[osx] 
[osx] VMMASTTranslationTest>>testInlineMethodWithLoopDeclaresLoopIndexVariable (TMethod is Undeclared) 
[osx] 
[osx] VMMASTTranslationTest>>testInlineMethodWithLoopDeclaresLoopIndexVariable (TMethod is Undeclared) 
[osx] 
[osx] VMMASTTranslationTest>>testInlineMethodWithLoopDeclaresLoopIndexVariable (CCodeGeneratorGlobalStructure is Undeclared) 
[osx] 
[osx] VMMASTTranslationTest>>testInlineSecondLevelMethodWithLoopDeclaresLoopIndexVariable (TMethod is Undeclared) 
[osx] 
[osx] VMMASTTranslationTest>>testInlineSecondLevelMethodWithLoopDeclaresLoopIndexVariable (TMethod is Undeclared) 
[osx] 
[osx] VMMASTTranslationTest>>testInlineSecondLevelMethodWithLoopDeclaresLoopIndexVariable (CCodeGeneratorGlobalStructure is Undeclared) 
[osx] 
[osx] VMMASTTranslationTest>>testInlineTwiceMethodWithLoopDeclaresTwiceLoopIndexVariable (TMethod is Undeclared) 
[osx] 
[osx] VMMASTTranslationTest>>testInlineTwiceMethodWithLoopDeclaresTwiceLoopIndexVariable (TMethod is Undeclared) 
[osx] 
[osx] VMMASTTranslationTest>>testInlineTwiceMethodWithLoopDeclaresTwiceLoopIndexVariable (CCodeGeneratorGlobalStructure is Undeclared) 
[osx] 
[osx] VMMASTTranslationTest>>testInlineTwiceSecondLevelMethodWithLoopDeclaresLoopIndexVariable (TMethod is Undeclared) 
[osx] 
[osx] VMMASTTranslationTest>>testInlineTwiceSecondLevelMethodWithLoopDeclaresLoopIndexVariable (TMethod is Undeclared) 
[osx] 
[osx] VMMASTTranslationTest>>testInlineTwiceSecondLevelMethodWithLoopDeclaresLoopIndexVariable (CCodeGeneratorGlobalStructure is Undeclared) 
[osx] 
[osx] VMMASTTranslationTest>>testKeywordMethodHasArgument (TMethod is Undeclared) 
[osx] 
[osx] VMMASTTranslationTest>>testMethodWithConditionInLoopLimitHasLimitVariable (TMethod is Undeclared) 
[osx] 
[osx] VMMASTTranslationTest>>testMethodWithConstantConditionInLoopHasNoLimitVariable (TMethod is Undeclared) 
[osx] 
[osx] VMMASTTranslationTest>>testMethodWithLoopDeclaresLoopIndexVariable (TMethod is Undeclared) 
[osx] 
[osx] VMMASTTranslationTest>>testTranslateBinaryMethodHasSameName (TMethod is Undeclared) 
[osx] 
[osx] VMMASTTranslationTest>>testTranslateKeywordMethodHasSameName (TMethod is Undeclared) 
[osx] 
[osx] VMMASTTranslationTest>>testTranslateUnaryMethodHasSameName (TMethod is Undeclared) 
[osx] 
[osx] VMMTGenerationTests>>generate: (CCodeGeneratorGlobalStructure is Undeclared) 
[osx] 
[osx] VMMTGenerationTests>>generate: (CoInterpreter is Undeclared) 
[osx] 
[osx] VMMTGenerationTests>>generate: (InterpreterPrimitives is Undeclared) 
[osx] 
[osx] VMMTGenerationTests>>generate: (StackInterpreterPrimitives is Undeclared) 
[osx] 
[osx] VMMTGenerationTests>>generate: (StackInterpreter is Undeclared) 
[osx] 
[osx] VMMTGenerationTests>>generate: (CoInterpreter is Undeclared) 
[osx] 
[osx] VMMTGenerationTests>>generate: (CogStackPages is Undeclared) 
[osx] 
[osx] VMMTGenerationTests>>generate: (SpurMemoryManager is Undeclared) 
[osx] 
[osx] VMMTGenerationTests>>generate: (Spur64BitMemoryManager is Undeclared) 
[osx] 
[osx] VMMTGenerationTests>>generate: (SpurGenerationScavenger is Undeclared) 
[osx] 
[osx] RBAssignmentNode>>asTranslatorNodeIn: (TAssignmentNode is Undeclared) 
[osx] 
[osx] RBAssignmentNode>>asTranslatorNodeIn: (TStmtListNode is Undeclared) 
[osx] 
[osx] RBAssignmentNode>>asTranslatorNodeIn: (TAssignmentNode is Undeclared) 
[osx] 
[osx] RBBlockNode>>asTranslatorNodeIn: (TVariableNode is Undeclared) 
[osx] 
[osx] RBBlockNode>>asTranslatorNodeIn: (TStmtListNode is Undeclared) 
[osx] 
[osx] RBLiteralNode>>asTranslatorNodeIn: (TConstantNode is Undeclared) 
[osx] 
[osx] RBArrayNode>>asTranslatorNodeIn: (TBraceCaseNode is Undeclared) 
[osx] 
[osx] RBMessageNode>>asTranslatorNodeIn: (TConstantNode is Undeclared) 
[osx] 
[osx] RBMessageNode>>asTranslatorNodeIn: (TAssignmentNode is Undeclared) 
[osx] 
[osx] RBMessageNode>>asTranslatorNodeIn: (TConstantNode is Undeclared) 
[osx] 
[osx] RBMessageNode>>asTranslatorNodeIn: (TSendNode is Undeclared) 
[osx] 
[osx] RBMessageNode>>asTranslatorNodeIn: (TVariableNode is Undeclared) 
[osx] 
[osx] RBMessageNode>>asTranslatorNodeIn: (TAssignmentNode is Undeclared) 
[osx] 
[osx] RBMessageNode>>asTranslatorNodeIn: (TVariableNode is Undeclared) 
[osx] 
[osx] RBMessageNode>>asTranslatorNodeIn: (TSendNode is Undeclared) 
[osx] 
[osx] RBMessageNode>>asTranslatorNodeIn: (TVariableNode is Undeclared) 
[osx] 
[osx] RBMessageNode>>asTranslatorNodeIn: (TConstantNode is Undeclared) 
[osx] 
[osx] RBMessageNode>>asTranslatorNodeIn: (TConstantNode is Undeclared) 
[osx] 
[osx] RBMessageNode>>asTranslatorNodeIn: (TVariableNode is Undeclared) 
[osx] 
[osx] RBMessageNode>>asTranslatorNodeIn: (TStmtListNode is Undeclared) 
[osx] 
[osx] RBMessageNode>>asTranslatorNodeIn: (TAssignmentNode is Undeclared) 
[osx] 
[osx] RBMessageNode>>asTranslatorNodeIn: (TVariableNode is Undeclared) 
[osx] 
[osx] RBMessageNode>>asTranslatorNodeIn: (TSendNode is Undeclared) 
[osx] 
[osx] RBMessageNode>>asTranslatorNodeIn: (TSendNode is Undeclared) 
[osx] 
[osx] RBMessageNode>>asTranslatorNodeIn: (TVariableNode is Undeclared) 
[osx] 
[osx] RBMessageNode>>asTranslatorNodeIn: (TVariableNode is Undeclared) 
[osx] 
[osx] RBMessageNode>>asTranslatorNodeIn: (TVariableNode is Undeclared) 
[osx] 
[osx] RBMessageNode>>asTranslatorNodeIn: (TSendNode is Undeclared) 
[osx] 
[osx] RBMessageNode>>asTranslatorNodeIn: (TVariableNode is Undeclared) 
[osx] 
[osx] RBMessageNode>>asTranslatorNodeIn: (TStmtListNode is Undeclared) 
[osx] 
[osx] RBMessageNode>>asTranslatorNodeIn: (TAssignmentNode is Undeclared) 
[osx] 
[osx] RBMessageNode>>asTranslatorNodeIn: (TVariableNode is Undeclared) 
[osx] 
[osx] RBMessageNode>>asTranslatorNodeIn: (TSendNode is Undeclared) 
[osx] 
[osx] RBMessageNode>>asTranslatorNodeIn: (TSendNode is Undeclared) 
[osx] 
[osx] RBMessageNode>>asTranslatorNodeIn: (TVariableNode is Undeclared) 
[osx] 
[osx] RBMessageNode>>asTranslatorNodeIn: (CCodeGenerator is Undeclared) 
[osx] 
[osx] RBMessageNode>>asTranslatorNodeIn: (TSendNode is Undeclared) 
[osx] 
[osx] DisplayText class>>text: (DefaultTextStyle is Undeclared) 
[osx] 
[osx] RBSequenceNode>>asTranslatorNodeIn: (TStmtListNode is Undeclared) 
[osx] 
[osx] Loaded -> VMMakerCompatibilityForPharo6-CompatibleUserName.1565645171 --- https://github.com/pharo-project/opensmalltalk-vm.git[Detached at 674b4bb] --- cache
[osx] *** Warning: Warning: This package depends on the following classes:
[osx]   StackMTInterpreterSimulator
[osx]   VMClass
[osx]   CogThreadManager
[osx] You must resolve these dependencies before you will be able to load these definitions: 
[osx]   SpurMockMemory
[osx]   SpurMockMemory>>#hasSpurMemoryManagerAPI
[osx]   SpurMockMemory>>#initializeWithOptions:
[osx]   SpurMockMemory>>#numSmallIntegerTagBits
[osx]   SpurMockMemory>>#simulatorClass
[osx]   SpurMockMemory>>#wordSize
[osx]   SpurMockMemory>>#addressCouldBeObj:
[osx]   SpurMockMemory>>#addressOf:
[osx]   SpurMockMemory>>#baseHeaderSize
[osx]   SpurMockMemory>>#bytesPerOop
[osx]   SpurMockMemory>>#coInterpreter:
[osx]   SpurMockMemory>>#fetchPointer:ofObject:
[osx]   SpurMockMemory>>#followField:ofObject:
[osx]   SpurMockMemory>>#followObjField:ofObject:
[osx]   SpurMockMemory>>#goodContextSize:
[osx]   SpurMockMemory>>#hasSpurMemoryManagerAPI
[osx]   SpurMockMemory>>#headerIndicatesAlternateBytecodeSet:
[osx]   SpurMockMemory>>#initialize
[osx]   SpurMockMemory>>#integerObjectOf:
[osx]   SpurMockMemory>>#integerValueOf:
[osx]   SpurMockMemory>>#isContext:
[osx]   SpurMockMemory>>#isForwarded:
[osx]   SpurMockMemory>>#isIntegerObject:
[osx]   SpurMockMemory>>#isNonImmediate:
[osx]   SpurMockMemory>>#isOopCompiledMethod:
[osx]   SpurMockMemory>>#isOopForwarded:
[osx]   SpurMockMemory>>#lastPointerOf:
[osx]   SpurMockMemory>>#lengthOf:
[osx]   SpurMockMemory>>#literalCountOf:
[osx]   SpurMockMemory>>#maxCInteger
[osx]   SpurMockMemory>>#memoryActiveProcess
[osx]   SpurMockMemory>>#methodHeaderOf:
[osx]   SpurMockMemory>>#nextAddress
[osx]   SpurMockMemory>>#nilObject
[osx]   SpurMockMemory>>#numBytesOfBytes:
[osx]   SpurMockMemory>>#numSlotsOf:
[osx]   SpurMockMemory>>#objectFor:
[osx]   SpurMockMemory>>#processorSchedulerMock
[osx]   SpurMockMemory>>#shiftForWord
[osx]   SpurMockMemory>>#smallIntegerTag
[osx]   SpurMockMemory>>#splObj:
[osx]   SpurMockMemory>>#startOfMemory
[osx]   SpurMockMemory>>#storePointer:ofObject:withValue:
[osx]   SpurMockMemory>>#storePointerUnchecked:ofObject:withValue:
[osx]   SpurMockMemory>>#wordSize
[osx]   StackMTInterpreterSimulatorForTest
[osx]   StackMTInterpreterSimulatorForTest>>#onObjectMemory:options:
[osx]   StackMTInterpreterSimulatorForTest>>#enterSmalltalkExecutiveImplementation
[osx]   StackMTInterpreterSimulatorForTest>>#ioNewOS:Thread:
[osx]   StackMTInterpreterSimulatorForTest>>#methodCallingPush
[osx]   VMMockCogThreadManager
[osx]   VMMockCogThreadManager>>#ioWaitOnOSSemaphore:
[osx] 
[osx] 
[osx] Loaded -> VMMakerTests-CompatibleUserName.1565645171 --- https://github.com/pharo-project/opensmalltalk-vm.git[Detached at 674b4bb] --- cache
[osx] Loaded -> Printf-eem.10 --- http://www.squeaksource.com/Printf --- http://www.squeaksource.com/Printf
[osx] SimulatorMorph>>contextPanel (ObjectExplorerWrapper is Undeclared) 
[osx] 
[osx] DetailedInstructionPrinter>>printInstructionsOn: (fullBlockRecursionSelector is Undeclared) 
[osx] 
[osx] Pragmatizer>>newConvertToMessageSendStamp: (Utilities is Undeclared) 
[osx] 
[osx] Pragmatizer>>newConvertToPragmaStamp: (Utilities is Undeclared) 
[osx] 
[osx] TMethod>>statementsFor:varName: (Compiler is Undeclared) 
[osx] 
[osx] RiscOSVMMaker>>export:forExternalPlugin: (FileStreamException is Undeclared) 
[osx] 
[osx] SpurImageTestResource class>>preenImage (Spur32BitPreen is Undeclared) 
[osx] 
[osx] VMMakerTool class>>unload (TheWorldMenu is Undeclared) 
[osx] 
[osx] VMMakerTool>>addSecondButtonRowToWindow:startingAt: (UpdatingThreePhaseButtonMorph is Undeclared) 
[osx] 
[osx] VMMakerTool>>findPlatformsPath (FileList2 is Undeclared) 
[osx] 
[osx] VMMakerTool>>helpText (StringHolder is Undeclared) 
[osx] 
[osx] VMMakerTool>>loadConfig (StandardFileMenu is Undeclared) 
[osx] 
[osx] VMMakerTool>>platformsListMenu (PopUpMenu is Undeclared) 
[osx] 
[osx] VMMakerTool>>saveConfig (StandardFileMenu is Undeclared) 
[osx] 
[osx] CCodeGenerator class>>removeCompilerMethods (ParseNode is Undeclared) 
[osx] 
[osx] ADPCMCodecPlugin class>>monticelloDescription (ADPCMCodec is Undeclared) 
[osx] 
[osx] ADPCMCodecPlugin class>>translatedPrimitives (ADPCMCodec is Undeclared) 
[osx] 
[osx] InterpreterPlugin class>>allCodeOlderThan: (TimeStamp is Undeclared) 
[osx] 
[osx] JPEGReadWriter2Plugin>>compressStructSize (JPEGReadWriter2 is Undeclared) 
[osx] 
[osx] JPEGReadWriter2Plugin>>decompressStructSize (JPEGReadWriter2 is Undeclared) 
[osx] 
[osx] JPEGReadWriter2Plugin>>errorMgr2StructSize (JPEGReadWriter2 is Undeclared) 
[osx] 
[osx] JPEGReadWriter2Plugin>>primImageHeight: (JPEGReadWriter2 is Undeclared) 
[osx] 
[osx] JPEGReadWriter2Plugin>>primImageNumComponents: (JPEGReadWriter2 is Undeclared) 
[osx] 
[osx] JPEGReadWriter2Plugin>>primImageWidth: (JPEGReadWriter2 is Undeclared) 
[osx] 
[osx] JPEGReadWriter2Plugin>>primJPEGPluginIsPresent (JPEGReadWriter2 is Undeclared) 
[osx] 
[osx] JPEGReadWriter2Plugin>>primJPEGReadHeader:fromByteArray:size:errorMgrReadHeader: (JPEGReadWriter2 is Undeclared) 
[osx] 
[osx] JPEGReadWriter2Plugin>>primJPEGReadImagefromByteArrayonFormdoDitheringerrorMgrReadScanlines:_:_:_:_:_:_:_:_: (JPEGReadWriter2 is Undeclared) 
[osx] 
[osx] JPEGReadWriter2Plugin>>primJPEGWriteImageonByteArrayformqualityprogressiveJPEGerrorMgrWriteScanlines:_:_:_:_:_:_:_:_:_:_:_: (JPEGReadWriter2 is Undeclared) 
[osx] 
[osx] TestOSAPlugin>>primOpenDefaultConfiguration:subtype: (ComponentInstance is Undeclared) 
[osx] 
[osx] SoundGenerationPlugin class>>monticelloDescription (AbstractSound is Undeclared) 
[osx] 
[osx] SoundGenerationPlugin class>>translatedPrimitives (AbstractSound is Undeclared) 
[osx] 
[osx] VMClass class>>initialize (Utilities is Undeclared) 
[osx] 
[osx] VMClass class>>openCogMultiWindowBrowser (Browser is Undeclared) 
[osx] 
[osx] VMClass class>>openCogSpurMultiWindowBrowser (Browser is Undeclared) 
[osx] 
[osx] VMClass class>>openCogTestsMultiWindowBrowser (PackageInfo is Undeclared) 
[osx] 
[osx] VMClass class>>openCogTestsMultiWindowBrowser (Browser is Undeclared) 
[osx] 
[osx] VMClass class>>openCogitMultiWindowBrowser (Browser is Undeclared) 
[osx] 
[osx] VMClass class>>openObjectMemoriesInterpretersBrowser (Browser is Undeclared) 
[osx] 
[osx] VMClass class>>openSpurMultiWindowBrowser (Browser is Undeclared) 
[osx] 
[osx] Cogit class>>genAndDis:options: (Compiler is Undeclared) 
[osx] 
[osx] Cogit class>>initializeMiscConstants (BochsX64Alien is Undeclared) 
[osx] 
[osx] Cogit class>>initializeMiscConstants (BochsIA32Alien is Undeclared) 
[osx] 
[osx] Cogit class>>initializeMiscConstants (GdbARMAlien is Undeclared) 
[osx] 
[osx] Cogit class>>initializeMiscConstants (MIPSELSimulator is Undeclared) 
[osx] 
[osx] Cogit>>initializeProcessor (MultiProcessor is Undeclared) 
[osx] 
[osx] Cogit>>setClickStepBreakBlock (Debugger is Undeclared) 
[osx] 
[osx] Cogit>>simulateCogCodeAt: (ProcessorSimulationTrap is Undeclared) 
[osx] 
[osx] Cogit>>simulateLeafCallOf: (ProcessorSimulationTrap is Undeclared) 
[osx] 
[osx] StackToRegisterMappingCogit>>widthInDefaultFontOf: (NewParagraph is Undeclared) 
[osx] 
[osx] StackInterpreterSimulator>>setClickStepBreakBlock (Debugger is Undeclared) 
[osx] 
[osx] CogVMSimulator>>ensureMultiThreadingOverridesAreUpToDate (Parser is Undeclared) 
[osx] 
[osx] CogVMSimulator>>setBreakBlockFromString: (Compiler is Undeclared) 
[osx] 
[osx] StackMTInterpreterSimulator>>setClickStepBreakBlock (Debugger is Undeclared) 
[osx] 
[osx] CogARMCompilerTests>>processor (GdbARMAlien is Undeclared) 
[osx] 
[osx] CogIA32CompilerTests>>processor (BochsIA32Alien is Undeclared) 
[osx] 
[osx] CogMIPSELCompilerTests>>processor (MIPSELSimulator is Undeclared) 
[osx] 
[osx] CogX64CompilerTests>>processor (BochsX64Alien is Undeclared) 
[osx] 
[osx] IncludedMethodsTest>>testConvert8bitSignedFromTo16Bit (SoundBuffer is Undeclared) 
[osx] 
[osx] IncludedMethodsTest>>testConvert8bitSignedFromTo16Bit (SoundBuffer is Undeclared) 
[osx] 
[osx] JPEGReadWriter2PluginTest>>testPluginPresent (JPEGReadWriter2 is Undeclared) 
[osx] 
[osx] JPEGReadWriter2PluginTest>>testPrimJPEGReadImage (JPEGReadWriter2 is Undeclared) 
[osx] 
[osx] JPEGReadWriter2PluginTest>>testPrimJPEGWriteImage (JPEGReadWriter2 is Undeclared) 
[osx] 
[osx] JPEGReadWriter2PluginTest>>testPrimJPEGWriteImage (JPEGReadWriter2 is Undeclared) 
[osx] 
[osx] MiscPrimitivePluginTest>>testConvert8bitSignedFromTo16Bit (SoundBuffer is Undeclared) 
[osx] 
[osx] MiscPrimitivePluginTest>>testConvert8bitSignedFromTo16Bit (SoundBuffer is Undeclared) 
[osx] 
[osx] SpurPlanningCompactorTests class>>preenImage (Spur32BitPreen is Undeclared) 
[osx] 
[osx] SimulatorMorphicModel class>>registerInOpenMenu (TheWorldMenu is Undeclared) 
[osx] 
[osx] SimulatorMorphicModel class>>registerInOpenMenu (TheWorldMenu is Undeclared) 
[osx] 
[osx] SimulatorMorphicModel class>>registerInOpenMenu (TheWorldMenu is Undeclared) 
[osx] 
[osx] SimulatorMorphicModel class>>unregisterFromOpenMenu (TheWorldMenu is Undeclared) 
[osx] 
[osx] SimulatorMorphicModel class>>unregisterFromOpenMenu (TheWorldMenu is Undeclared) 
[osx] 
[osx] SimulatorMorphicModel>>hack (UserDialogBoxMorph is Undeclared) 
[osx] 
[osx] SimulatorMorphicModel>>loadImage (UserDialogBoxMorph is Undeclared) 
[osx] 
[osx] SimulatorMorphicModel>>options (UserDialogBoxMorph is Undeclared) 
[osx] 
[osx] SimulatorMorphicModel>>over (UserDialogBoxMorph is Undeclared) 
[osx] 
[osx] SimulatorMorphicModel>>reset (UserDialogBoxMorph is Undeclared) 
[osx] 
[osx] SimulatorMorphicModel>>return (UserDialogBoxMorph is Undeclared) 
[osx] 
[osx] SimulatorMorphicModel>>send (UserDialogBoxMorph is Undeclared) 
[osx] 
[osx] SimulatorMorphicModel>>step (UserDialogBoxMorph is Undeclared) 
[osx] 
[osx] BalloonEngineBase>>loadRenderingState (GEFBitBltLoadFailed is Undeclared) 
[osx] 
[osx] BalloonEngineBase>>loadRenderingState (GEFFormLoadFailed is Undeclared) 
[osx] 
[osx] BalloonEngineBase>>loadRenderingState (GEFEdgeDataTooSmall is Undeclared) 
[osx] 
[osx] BalloonEngineBase>>loadRenderingState (GEFFillDataTooSmall is Undeclared) 
[osx] 
[osx] BalloonEngineBase>>loadRenderingState (GEFWrongState is Undeclared) 
[osx] 
[osx] BalloonEngineBase>>loadSpanBufferFrom: (GEFClassMismatch is Undeclared) 
[osx] 
[osx] BalloonEngineBase>>loadWorkBufferFrom: (GEFWorkBufferIsInteger is Undeclared) 
[osx] 
[osx] BalloonEngineBase>>loadWorkBufferFrom: (GEFWorkBufferIsPointers is Undeclared) 
[osx] 
[osx] BalloonEngineBase>>loadWorkBufferFrom: (GEFWorkBufferTooSmall is Undeclared) 
[osx] 
[osx] BalloonEngineBase>>loadWorkBufferFrom: (GEFWorkBufferBadMagic is Undeclared) 
[osx] 
[osx] BalloonEngineBase>>loadWorkBufferFrom: (GEFWorkBufferWrongSize is Undeclared) 
[osx] 
[osx] BalloonEngineBase>>loadWorkBufferFrom: (GEFWorkBufferStartWrong is Undeclared) 
[osx] 
[osx] BalloonEngineBase>>loadWorkBufferFrom: (GEFWorkTooBig is Undeclared) 
[osx] 
[osx] BalloonEngineBase>>primitiveAddActiveEdgeEntry (GEFEdgeDataTooSmall is Undeclared) 
[osx] 
[osx] BalloonEngineBase>>primitiveAddActiveEdgeEntry (GEFWorkTooBig is Undeclared) 
[osx] 
[osx] BalloonEngineBase>>primitiveAddActiveEdgeEntry (GEFEngineStopped is Undeclared) 
[osx] 
[osx] BalloonEngineBase>>primitiveChangedActiveEdgeEntry (GEFEdgeDataTooSmall is Undeclared) 
[osx] 
[osx] BalloonEngineBase>>primitiveCopyBuffer (GEFClassMismatch is Undeclared) 
[osx] 
[osx] BalloonEngineBase>>primitiveCopyBuffer (GEFSizeMismatch is Undeclared) 
[osx] 
[osx] BalloonEngineBase>>primitiveDisplaySpanBuffer (GEFBitBltLoadFailed is Undeclared) 
[osx] 
[osx] BalloonEngineBase>>primitiveGetFailureReason (GEFEngineIsInteger is Undeclared) 
[osx] 
[osx] BalloonEngineBase>>primitiveGetFailureReason (GEFEngineIsWords is Undeclared) 
[osx] 
[osx] BalloonEngineBase>>primitiveGetFailureReason (GEFEngineTooSmall is Undeclared) 
[osx] 
[osx] BalloonEngineBase>>primitiveInitializeProcessing (GEFEngineStopped is Undeclared) 
[osx] 
[osx] BalloonEngineBase>>primitiveMergeFillFrom (GEFFillDataTooSmall is Undeclared) 
[osx] 
[osx] BalloonEngineBase>>primitiveMergeFillFrom (GEFWrongFill is Undeclared) 
[osx] 
[osx] BalloonEngineBase>>primitiveMergeFillFrom (GEFWrongFill is Undeclared) 
[osx] 
[osx] BalloonEngineBase>>primitiveMergeFillFrom (GEFWrongFill is Undeclared) 
[osx] 
[osx] BalloonEngineBase>>primitiveNextFillEntry (GEFFormLoadFailed is Undeclared) 
[osx] 
[osx] BalloonEngineBase>>primitiveNextFillEntry (GEFEngineStopped is Undeclared) 
[osx] 
[osx] BalloonEngineBase>>primitiveNextFillEntry (GEFWrongFill is Undeclared) 
[osx] 
[osx] BalloonEngineBase>>primitiveNextGlobalEdgeEntry (GEFWrongEdge is Undeclared) 
[osx] 
[osx] BalloonEngineBase>>primitiveRegisterExternalEdge (GEFWorkTooBig is Undeclared) 
[osx] 
[osx] BalloonEngineBase>>primitiveRegisterExternalEdge (GEFWrongFill is Undeclared) 
[osx] 
[osx] BalloonEngineBase>>primitiveRegisterExternalEdge (GEFEngineStopped is Undeclared) 
[osx] 
[osx] BalloonEngineBase>>primitiveRegisterExternalFill (GEFWorkTooBig is Undeclared) 
[osx] 
[osx] BalloonEngineBase>>primitiveSetColorTransform (GEFEntityLoadFailed is Undeclared) 
[osx] 
[osx] BalloonEngineBase>>quickLoadEngineFrom: (GEFAlreadyFailed is Undeclared) 
[osx] 
[osx] BalloonEngineBase>>quickLoadEngineFrom: (GEFEngineIsInteger is Undeclared) 
[osx] 
[osx] BalloonEngineBase>>quickLoadEngineFrom: (GEFEngineIsWords is Undeclared) 
[osx] 
[osx] BalloonEngineBase>>quickLoadEngineFrom: (GEFEngineTooSmall is Undeclared) 
[osx] 
[osx] BalloonEngineBase>>quickLoadEngineFrom:requiredState: (GEFWrongState is Undeclared) 
[osx] 
[osx] BalloonEngineBase>>quickLoadEngineFrom:requiredState:or: (GEFWrongState is Undeclared) 
[osx] 
[osx] BalloonEnginePlugin>>primitiveAddBezier (GEFWrongFill is Undeclared) 
[osx] 
[osx] BalloonEnginePlugin>>primitiveAddBezier (GEFEngineStopped is Undeclared) 
[osx] 
[osx] BalloonEnginePlugin>>primitiveAddBezier (GEFEntityLoadFailed is Undeclared) 
[osx] 
[osx] BalloonEnginePlugin>>primitiveAddBezierShape (GEFWorkTooBig is Undeclared) 
[osx] 
[osx] BalloonEnginePlugin>>primitiveAddBezierShape (GEFWrongFill is Undeclared) 
[osx] 
[osx] BalloonEnginePlugin>>primitiveAddBezierShape (GEFEngineStopped is Undeclared) 
[osx] 
[osx] BalloonEnginePlugin>>primitiveAddBezierShape (GEFEngineStopped is Undeclared) 
[osx] 
[osx] BalloonEnginePlugin>>primitiveAddBezierShape (GEFEntityLoadFailed is Undeclared) 
[osx] 
[osx] BalloonEnginePlugin>>primitiveAddBitmapFill (GEFBadPoint is Undeclared) 
[osx] 
[osx] BalloonEnginePlugin>>primitiveAddBitmapFill (GEFEngineStopped is Undeclared) 
[osx] 
[osx] BalloonEnginePlugin>>primitiveAddBitmapFill (GEFEntityLoadFailed is Undeclared) 
[osx] 
[osx] BalloonEnginePlugin>>primitiveAddCompressedShape (GEFEntityCheckFailed is Undeclared) 
[osx] 
[osx] BalloonEnginePlugin>>primitiveAddCompressedShape (GEFWorkTooBig is Undeclared) 
[osx] 
[osx] BalloonEnginePlugin>>primitiveAddCompressedShape (GEFEngineStopped is Undeclared) 
[osx] 
[osx] BalloonEnginePlugin>>primitiveAddCompressedShape (GEFEntityLoadFailed is Undeclared) 
[osx] 
[osx] BalloonEnginePlugin>>primitiveAddGradientFill (GEFBadPoint is Undeclared) 
[osx] 
[osx] BalloonEnginePlugin>>primitiveAddGradientFill (GEFEngineStopped is Undeclared) 
[osx] 
[osx] BalloonEnginePlugin>>primitiveAddGradientFill (GEFEntityLoadFailed is Undeclared) 
[osx] 
[osx] BalloonEnginePlugin>>primitiveAddLine (GEFWrongFill is Undeclared) 
[osx] 
[osx] BalloonEnginePlugin>>primitiveAddLine (GEFBadPoint is Undeclared) 
[osx] 
[osx] BalloonEnginePlugin>>primitiveAddLine (GEFEngineStopped is Undeclared) 
[osx] 
[osx] BalloonEnginePlugin>>primitiveAddLine (GEFEngineStopped is Undeclared) 
[osx] 
[osx] BalloonEnginePlugin>>primitiveAddLine (GEFEntityLoadFailed is Undeclared) 
[osx] 
[osx] BalloonEnginePlugin>>primitiveAddOval (GEFWrongFill is Undeclared) 
[osx] 
[osx] BalloonEnginePlugin>>primitiveAddOval (GEFEngineStopped is Undeclared) 
[osx] 
[osx] BalloonEnginePlugin>>primitiveAddOval (GEFWorkTooBig is Undeclared) 
[osx] 
[osx] BalloonEnginePlugin>>primitiveAddOval (GEFBadPoint is Undeclared) 
[osx] 
[osx] BalloonEnginePlugin>>primitiveAddOval (GEFEngineStopped is Undeclared) 
[osx] 
[osx] BalloonEnginePlugin>>primitiveAddOval (GEFEntityLoadFailed is Undeclared) 
[osx] 
[osx] BalloonEnginePlugin>>primitiveAddPolygon (GEFWrongFill is Undeclared) 
[osx] 
[osx] BalloonEnginePlugin>>primitiveAddPolygon (GEFEngineStopped is Undeclared) 
[osx] 
[osx] BalloonEnginePlugin>>primitiveAddPolygon (GEFEngineStopped is Undeclared) 
[osx] 
[osx] BalloonEnginePlugin>>primitiveAddPolygon (GEFEntityLoadFailed is Undeclared) 
[osx] 
[osx] BalloonEnginePlugin>>primitiveAddRect (GEFWrongFill is Undeclared) 
[osx] 
[osx] BalloonEnginePlugin>>primitiveAddRect (GEFEngineStopped is Undeclared) 
[osx] 
[osx] BalloonEnginePlugin>>primitiveAddRect (GEFWorkTooBig is Undeclared) 
[osx] 
[osx] BalloonEnginePlugin>>primitiveAddRect (GEFBadPoint is Undeclared) 
[osx] 
[osx] BalloonEnginePlugin>>primitiveAddRect (GEFEntityLoadFailed is Undeclared) 
[osx] 
[osx] Loaded -> VMMaker-CompatibleUserName.1565645171 --- https://github.com/pharo-project/opensmalltalk-vm.git[Detached at 674b4bb] --- cache
[osx] ...finished baseline2019-08-12 23:32:12.558 Pharo[71296:507] ApplePersistenceIgnoreState: Existing state will not be touched. New state will be written to /var/folders/w0/nn_htp7n6ddcydvkv21hjzhc0000gn/T/org.pharo.Pharo.savedState
[osx] 2019-08-12 23:32:12.885 Pharo[71296:507] 23:32:12.885 ERROR:     [0x7fff76088310] AQMEIO.cpp:377: _FindIOUnit: error -66680
[osx] 2019-08-12 23:32:12.886 Pharo[71296:507] 23:32:12.886 ERROR:     [0x7fff76088310] >aq> AudioQueueObject.cpp:1590: Prime: failed (-66680); will stop (5512/0 frames)
[osx] 2019-08-12 23:32:12.890 Pharo[71296:507] 23:32:12.890 ERROR:     [0x7fff76088310] AQMEIO.cpp:377: _FindIOUnit: error -66680
[osx] 2019-08-12 23:32:12.890 Pharo[71296:507] 23:32:12.890 ERROR:     [0x7fff76088310] >aq> AudioQueueObject.cpp:1590: Prime: failed (-66680); will stop (33075/0 frames)
[osx] [  3%] Generating VM files for flavour: CoInterpreterWithQueueFFI
[osx] 2019-08-12 23:32:15.252 Pharo[71309:507] ApplePersistenceIgnoreState: Existing state will not be touched. New state will be written to /var/folders/w0/nn_htp7n6ddcydvkv21hjzhc0000gn/T/org.pharo.Pharo.savedState
[osx] 2019-08-12 23:32:15.769 Pharo[71309:507] 23:32:15.769 ERROR:     [0x7fff76088310] AQMEIO.cpp:377: _FindIOUnit: error -66680
[osx] 2019-08-12 23:32:15.769 Pharo[71309:507] 23:32:15.769 ERROR:     [0x7fff76088310] >aq> AudioQueueObject.cpp:1590: Prime: failed (-66680); will stop (5512/0 frames)
[osx] 2019-08-12 23:32:15.773 Pharo[71309:507] 23:32:15.773 ERROR:     [0x7fff76088310] AQMEIO.cpp:377: _FindIOUnit: error -66680
[osx] 2019-08-12 23:32:15.773 Pharo[71309:507] 23:32:15.773 ERROR:     [0x7fff76088310] >aq> AudioQueueObject.cpp:1590: Prime: failed (-66680); will stop (33075/0 frames)
[osx] Generating #CoInterpreterWithQueueFFI...
[osx] 
[osx] conflicting return types sqInt, void in reverseDisplayFrom:to:
[osx] conflicting return types sqInt, void in extendedStoreBytecodePop:
[osx] conflicting return types sqInt, void in reverseDisplayFrom:to:
[osx] conflicting return types sqInt, void in baseFrameReturn
[osx] conflicting return types sqInt, void in extendedStoreBytecodePop:
[osx] conflicting return types sqInt, void in reverseDisplayFrom:to:
[osx] conflicting return types sqInt, void in baseFrameReturn
[osx] conflicting return types sqInt, void in extendedStoreBytecodePop:
[osx] conflicting return types sqInt, void in reverseDisplayFrom:to:
[osx] conflicting return types sqInt, void in baseFrameReturn
[osx] conflicting return types sqInt, void in extendedStoreBytecodePop:
[osx] conflicting return types sqInt, void in reverseDisplayFrom:to:
[osx] conflicting return types sqInt, void in baseFrameReturn
[osx] conflicting return types sqInt, void in extendedStoreBytecodePop:
[osx] conflicting return types sqInt, void in reverseDisplayFrom:to:
[osx] 
[osx] compactionStartUsecs localised to fullGC
[osx] 
[osx] gcMarkEndUsecs localised to fullGC
[osx] 
[osx] extA localised to interpret
[osx] 
[osx] extB localised to interpret
[osx] 
[osx] lkupClassTag localised to interpret
[osx] 
[osx] numExtB localised to interpret
[osx] 
[osx] traceSources localised to printLogEntryAt:
[osx] The method ClassDescription>>#theNonMetaClass called from VMStructType class>>#printTypedefOn: has been deprecated.
Please use #instanceSide instead
[osx] 
[osx] pushNilSizeFunction localised to compileBlockBodies
[osx] 
[osx] cStackAlignment localised to compileCallFor:numArgs:arg:arg:arg:arg:resultReg:regsToSave:
[osx] 
[osx] cPICEndOfCodeLabel localised to generateClosedPICPrototype
[osx] 
[osx] endCPICCase1 localised to generateClosedPICPrototype
[osx] 
[osx] primitiveGeneratorTable localised to primitiveGeneratorOrNil
[osx] 
[osx] numPushNilsFunction localised to scanBlock:
[osx] 
[osx] pushNilSizeFunction localised to compileBlockBodies
[osx] 
[osx] cStackAlignment localised to compileCallFor:numArgs:arg:arg:arg:arg:resultReg:regsToSave:
[osx] 
[osx] cPICEndOfCodeLabel localised to generateClosedPICPrototype
[osx] 
[osx] endCPICCase1 localised to generateClosedPICPrototype
[osx] 
[osx] primitiveGeneratorTable localised to primitiveGeneratorOrNil
[osx] 
[osx] numPushNilsFunction localised to scanBlock:
[osx] PharoVMMaker
[osx] Scanning dependencies of target PharoVMCore
[osx] [  4%] Building C object CMakeFiles/PharoVMCore.dir/src/debug.c.o
[osx] [  4%] Building C object CMakeFiles/PharoVMCore.dir/src/utils.c.o
[osx] /builds/workspace/pharo-vm_headless/src/utils.c:421:30: warning: incompatible pointer types assigning to 'void (*)(int, struct __siginfo *, void *)' from 'void (int)' [-Wincompatible-pointer-types]
[osx]         handler_action.sa_sigaction = sighandler;
[osx]                                     ^ ~~~~~~~~~~
[osx] /builds/workspace/pharo-vm_headless/src/utils.c:575:27: warning: passing 'const char *' to parameter of type 'char *' discards qualifiers [-Wincompatible-pointer-types-discards-qualifiers]
[osx]         strcpy(basePath, dirname(path));
[osx]                                  ^~~~
[osx] /usr/include/secure/_string.h:83:33: note: expanded from macro 'strcpy'
[osx]   __builtin___strcpy_chk (dest, src, __darwin_obsz (dest))
[osx]                                 ^
[osx] /usr/include/libgen.h:41:21: note: passing argument to parameter here
[osx] char    *dirname(char *);
[osx]                        ^
[osx] 2 warnings generated.
[osx] [  5%] Building C object CMakeFiles/PharoVMCore.dir/src/nullDisplay.c.o
[osx] [  6%] Building C object CMakeFiles/PharoVMCore.dir/src/externalPrimitives.c.o
[osx] [  7%] Building C object CMakeFiles/PharoVMCore.dir/src/client.c.o
[osx] [  7%] Downloading Pharo 70
[osx] --2019-08-12 23:32:54--  http://get.pharo.org/64/70
[osx] Resolving get.pharo.org... 164.132.235.17, 2001:41d0:301::23
[osx] Connecting to get.pharo.org|164.132.235.17|:80... connected.
[osx] HTTP request sent, awaiting response... 200 OK
[osx] Length: 3244 (3.2K) [application/octet-stream]
[osx] Saving to: 'STDOUT'
[osx] 
[osx]      0K ...                                                   100%  163M=0s
[osx] 
[osx] 2019-08-12 23:32:54 (163 MB/s) - written to stdout [3244/3244]
[osx] 
[osx] Downloading the latest 70 Image:
[osx]     http://files.pharo.org/get-files/70/pharo64.zip
[osx] overwrite Pharo7.0-32bit-0903ade.sources? (y/n [n]) not overwritten
[osx] --2019-08-12 23:32:56--  http://get.pharo.org/64/vm70
[osx] Resolving get.pharo.org... 164.132.235.17, 2001:41d0:301::23
[osx] Connecting to get.pharo.org|164.132.235.17|:80... connected.
[osx] HTTP request sent, awaiting response... 200 OK
[osx] Length: 5320 (5.2K) [application/octet-stream]
[osx] Saving to: 'STDOUT'
[osx] 
[osx]      0K .....                                                 100%  159M=0s
[osx] 
[osx] 2019-08-12 23:32:56 (159 MB/s) - written to stdout [5320/5320]
[osx] 
[osx] Downloading the latest pharoVM:
[osx] 	http://files.pharo.org/get-files/70/pharo64-mac-stable.zip
[osx] replace pharo-vm/Pharo.app/Contents/_CodeSignature/CodeResources? [y]es, [n]o, [A]ll, [N]one, [r]ename: new name: replace pharo-vm/Pharo.app/Contents/Info.plist? [y]es, [n]o, [A]ll, [N]one, [r]ename: error:  invalid response [
[osx] ]
[osx] replace pharo-vm/Pharo.app/Contents/Info.plist? [y]es, [n]o, [A]ll, [N]one, [r]ename: error:  invalid response [i]
[osx] replace pharo-vm/Pharo.app/Contents/Info.plist? [y]es, [n]o, [A]ll, [N]one, [r]ename: error:  invalid response [S]
[osx] replace pharo-vm/Pharo.app/Contents/Info.plist? [y]es, [n]o, [A]ll, [N]one, [r]ename: error:  invalid response [i]
[osx] replace pharo-vm/Pharo.app/Contents/Info.plist? [y]es, [n]o, [A]ll, [N]one, [r]ename: error:  invalid response [h]
[osx] replace pharo-vm/Pharo.app/Contents/Info.plist? [y]es, [n]o, [A]ll, [N]one, [r]ename: error:  invalid response [ ]
[osx] replace pharo-vm/Pharo.app/Contents/Info.plist? [y]es, [n]o, [A]ll, [N]one, [r]ename: error:  invalid response [O]
[osx] replace pharo-vm/Pharo.app/Contents/Info.plist? [y]es, [n]o, [A]ll, [N]one, [r]ename: replace pharo-vm/Pharo.app/Contents/MacOS/Pharo? [y]es, [n]o, [A]ll, [N]one, [r]ename: error:  invalid response [I]
[osx] replace pharo-vm/Pharo.app/Contents/MacOS/Pharo? [y]es, [n]o, [A]ll, [N]one, [r]ename: error:  invalid response [ ]
[osx] replace pharo-vm/Pharo.app/Contents/MacOS/Pharo? [y]es, [n]o, [A]ll, [N]one, [r]ename: [  8%] Building C object CMakeFiles/PharoVMCore.dir/generated/vm/src/cogit.c.o
[osx] In file included from /builds/workspace/pharo-vm_headless/generated/vm/src/cogit.c:11:
[osx] /builds/workspace/pharo-vm_headless/generated/vm/src/cogitX64SysV.c:3926:3: warning: implicit declaration of function 'warning' is invalid in C99 [-Wimplicit-function-declaration]
[osx]                 haltmsg("Compilation of breakMethod");
[osx]                 ^
[osx] /builds/workspace/pharo-vm_headless/generated/vm/src/cogitX64SysV.c:1997:22: note: expanded from macro 'haltmsg'
[osx] #define haltmsg(msg) warning("halt: " msg)
[osx]                      ^
[osx] /builds/workspace/pharo-vm_headless/generated/vm/src/cogitX64SysV.c:4005:62: warning: incompatible integer to pointer conversion passing 'sqInt' (aka 'long') to parameter of type 'void *' [-Wint-conversion]
[osx]                                  || (((cogMethod->methodObject)) == (((usqInt)(methodFor((cogMethod->methodObject))))))))) {
[osx]                                                                                          ^~~~~~~~~~~~~~~~~~~~~~~~~
[osx] /builds/workspace/pharo-vm_headless/generated/vm/src/cogitX64SysV.c:755:36: note: passing argument to parameter 'address' here
[osx] extern CogMethod * methodFor(void *address);
[osx]                                    ^
[osx] /builds/workspace/pharo-vm_headless/generated/vm/src/cogitX64SysV.c:4275:36: warning: incompatible pointer to integer conversion passing 'char *' to parameter of type 'unsigned long' [-Wint-conversion]
[osx]         address = positive64BitIntegerFor(mcpc);
[osx]                                           ^~~~
[osx] /builds/workspace/pharo-vm_headless/generated/vm/include/cointerp.h:91:46: note: passing argument to parameter 'integerValue' here
[osx] extern sqInt positive64BitIntegerFor(usqLong integerValue);
[osx]                                              ^
[osx] In file included from /builds/workspace/pharo-vm_headless/generated/vm/src/cogit.c:11:
[osx] /builds/workspace/pharo-vm_headless/generated/vm/src/cogitX64SysV.c:4317:85: warning: incompatible pointer to integer conversion passing 'char *' to parameter of type 'sqInt' (aka 'long') [-Wint-conversion]
[osx]                                 (targetMethod1->methodObject = classForInlineCacheTag(inlineCacheTagAt(backEnd, mcpc)));
[osx]                                                                                                                 ^~~~
[osx] /builds/workspace/pharo-vm_headless/generated/vm/src/cogitX64SysV.c:2385:72: note: passing argument to parameter 'callSiteReturnAddress' here
[osx] inlineCacheTagAt(AbstractInstruction * self_in_inlineCacheTagAt, sqInt callSiteReturnAddress)
[osx]                                                                        ^
[osx] /builds/workspace/pharo-vm_headless/generated/vm/src/cogitX64SysV.c:4781:4: warning: expression result unused [-Wunused-value]
[osx]                 ((AbstractInstruction *) backEnd);
[osx]                  ^                       ~~~~~~~
[osx] /builds/workspace/pharo-vm_headless/generated/vm/src/cogitX64SysV.c:4797:4: warning: expression result unused [-Wunused-value]
[osx]                 ((AbstractInstruction *) backEnd);
[osx]                  ^                       ~~~~~~~
[osx] /builds/workspace/pharo-vm_headless/generated/vm/src/cogitX64SysV.c:4813:4: warning: expression result unused [-Wunused-value]
[osx]                 ((AbstractInstruction *) backEnd);
[osx]                  ^                       ~~~~~~~
[osx] /builds/workspace/pharo-vm_headless/generated/vm/src/cogitX64SysV.c:4829:4: warning: expression result unused [-Wunused-value]
[osx]                 ((AbstractInstruction *) backEnd);
[osx]                  ^                       ~~~~~~~
[osx] /builds/workspace/pharo-vm_headless/generated/vm/src/cogitX64SysV.c:4845:3: warning: expression result unused [-Wunused-value]
[osx]         ((AbstractInstruction *) backEnd);
[osx]          ^                       ~~~~~~~
[osx] /builds/workspace/pharo-vm_headless/generated/vm/src/cogitX64SysV.c:5180:3: warning: expression result unused [-Wunused-value]
[osx]         ((AbstractInstruction *) backEnd);
[osx]          ^                       ~~~~~~~
[osx] /builds/workspace/pharo-vm_headless/generated/vm/src/cogitX64SysV.c:5229:3: warning: expression result unused [-Wunused-value]
[osx]         ((AbstractInstruction *) backEnd);
[osx]          ^                       ~~~~~~~
[osx] /builds/workspace/pharo-vm_headless/generated/vm/src/cogitX64SysV.c:6386:16: warning: incompatible pointer to integer conversion assigning to 'sqInt' (aka 'long') from 'CogMethod *' [-Wint-conversion]
[osx]         cPICPrototype = cPIC;
[osx]                       ^ ~~~~
[osx] /builds/workspace/pharo-vm_headless/generated/vm/src/cogitX64SysV.c:8319:129: warning: incompatible pointer to integer conversion passing 'char *' to parameter of type 'sqInt' (aka 'long') [-Wint-conversion]
[osx]                                 rewriteInlineCacheAttagtarget(backEnd, ((sqInt)mcpc), indexForSelectorinat((targetMethod1->selector), enumeratingCogMethod, mcpc), unlinkedRoutine);
[osx]                                                                                                                                                             ^~~~
[osx] /builds/workspace/pharo-vm_headless/generated/vm/src/cogitX64SysV.c:7189:66: note: passing argument to parameter 'mcpc' here
[osx] indexForSelectorinat(sqInt selector, CogMethod *cogMethod, sqInt mcpc)
[osx]                                                                  ^
[osx] /builds/workspace/pharo-vm_headless/generated/vm/src/cogitX64SysV.c:9121:3: warning: expression result unused [-Wunused-value]
[osx]         ((AbstractInstruction *) backEnd);
[osx]          ^                       ~~~~~~~
[osx] /builds/workspace/pharo-vm_headless/generated/vm/src/cogitX64SysV.c:9176:126: warning: incompatible pointer to integer conversion passing 'char *' to parameter of type 'sqInt' (aka 'long') [-Wint-conversion]
[osx]                 rewriteInlineCacheAttagtarget(backEnd, ((sqInt)mcpc), indexForSelectorinat((targetMethod->selector), enumeratingCogMethod, mcpc), unlinkedRoutine);
[osx]                                                                                                                                            ^~~~
[osx] /builds/workspace/pharo-vm_headless/generated/vm/src/cogitX64SysV.c:7189:66: note: passing argument to parameter 'mcpc' here
[osx] indexForSelectorinat(sqInt selector, CogMethod *cogMethod, sqInt mcpc)
[osx]                                                                  ^
[osx] /builds/workspace/pharo-vm_headless/generated/vm/src/cogitX64SysV.c:9617:129: warning: incompatible pointer to integer conversion passing 'char *' to parameter of type 'sqInt' (aka 'long') [-Wint-conversion]
[osx]                                 rewriteInlineCacheAttagtarget(backEnd, ((sqInt)mcpc), indexForSelectorinat((targetMethod1->selector), enumeratingCogMethod, mcpc), unlinkedRoutine);
[osx]                                                                                                                                                             ^~~~
[osx] /builds/workspace/pharo-vm_headless/generated/vm/src/cogitX64SysV.c:7189:66: note: passing argument to parameter 'mcpc' here
[osx] indexForSelectorinat(sqInt selector, CogMethod *cogMethod, sqInt mcpc)
[osx]                                                                  ^
[osx] /builds/workspace/pharo-vm_headless/generated/vm/src/cogitX64SysV.c:9669:141: warning: incompatible pointer to integer conversion passing 'char *' to parameter of type 'sqInt' (aka 'long') [-Wint-conversion]
[osx]                                         rewriteInlineCacheAttagtarget(backEnd, ((sqInt)mcpc), inlineCacheValueForSelectorinat((targetMethod1->selector), enumeratingCogMethod, mcpc), unlinkedRoutine);
[osx]                                                                                                                                                                                ^~~~
[osx] /builds/workspace/pharo-vm_headless/generated/vm/src/cogitX64SysV.c:7296:78: note: passing argument to parameter 'mcpc' here
[osx] inlineCacheValueForSelectorinat(sqInt selector, CogMethod *aCogMethod, sqInt mcpc)
[osx]                                                                              ^
[osx] /builds/workspace/pharo-vm_headless/generated/vm/src/cogitX64SysV.c:9719:140: warning: incompatible pointer to integer conversion passing 'char *' to parameter of type 'sqInt' (aka 'long') [-Wint-conversion]
[osx]                                 rewriteInlineCacheAttagtarget(backEnd, ((sqInt)mcpc), inlineCacheValueForSelectorinat((targetMethod1->selector), enumeratingCogMethod, mcpc), unlinkedRoutine);
[osx]                                                                                                                                                                        ^~~~
[osx] /builds/workspace/pharo-vm_headless/generated/vm/src/cogitX64SysV.c:7296:78: note: passing argument to parameter 'mcpc' here
[osx] inlineCacheValueForSelectorinat(sqInt selector, CogMethod *aCogMethod, sqInt mcpc)
[osx]                                                                              ^
[osx] /builds/workspace/pharo-vm_headless/generated/vm/src/cogitX64SysV.c:9767:139: warning: incompatible pointer to integer conversion passing 'char *' to parameter of type 'sqInt' (aka 'long') [-Wint-conversion]
[osx]                         rewriteInlineCacheAttagtarget(backEnd, ((sqInt)mcpc), inlineCacheValueForSelectorinat((targetMethod1->selector), enumeratingCogMethod, mcpc), unlinkedRoutine);
[osx]                                                                                                                                                                ^~~~
[osx] /builds/workspace/pharo-vm_headless/generated/vm/src/cogitX64SysV.c:7296:78: note: passing argument to parameter 'mcpc' here
[osx] inlineCacheValueForSelectorinat(sqInt selector, CogMethod *aCogMethod, sqInt mcpc)
[osx]                                                                              ^
[osx] /builds/workspace/pharo-vm_headless/generated/vm/src/cogitX64SysV.c:9815:140: warning: incompatible pointer to integer conversion passing 'char *' to parameter of type 'sqInt' (aka 'long') [-Wint-conversion]
[osx]                                 rewriteInlineCacheAttagtarget(backEnd, ((sqInt)mcpc), inlineCacheValueForSelectorinat((targetMethod1->selector), enumeratingCogMethod, mcpc), unlinkedRoutine);
[osx]                                                                                                                                                                        ^~~~
[osx] /builds/workspace/pharo-vm_headless/generated/vm/src/cogitX64SysV.c:7296:78: note: passing argument to parameter 'mcpc' here
[osx] inlineCacheValueForSelectorinat(sqInt selector, CogMethod *aCogMethod, sqInt mcpc)
[osx]                                                                              ^
[osx] /builds/workspace/pharo-vm_headless/generated/vm/src/cogitX64SysV.c:15200:88: warning: incompatible pointer to integer conversion passing 'AbstractInstruction *' (aka 'struct _AbstractInstruction *') to parameter of type 'sqInt' (aka 'long') [-Wint-conversion]
[osx]         return genEnsureOopInRegNotForwardedscratchRegifForwarderifNotForwarder(reg, scratch, instruction, 0);
[osx]                                                                                               ^~~~~~~~~~~
[osx] /builds/workspace/pharo-vm_headless/generated/vm/src/cogitX64SysV.c:884:125: note: passing argument to parameter 'fwdJumpTarget' here
[osx] static sqInt NoDbgRegParms genEnsureOopInRegNotForwardedscratchRegifForwarderifNotForwarder(sqInt reg, sqInt scratch, sqInt fwdJumpTarget, sqInt nonFwdJumpTargetOrZero);
[osx]                                                                                                                             ^
[osx] /builds/workspace/pharo-vm_headless/generated/vm/src/cogitX64SysV.c:15242:12: warning: incompatible integer to pointer conversion assigning to 'AbstractInstruction *' (aka 'struct _AbstractInstruction *') from 'sqInt' (aka 'long') [-Wint-conversion]
[osx]                 finished = nonFwdJumpTargetOrZero;
[osx]                          ^ ~~~~~~~~~~~~~~~~~~~~~~
[osx] /builds/workspace/pharo-vm_headless/generated/vm/src/cogitX64SysV.c:16255:86: warning: incompatible pointer to integer conversion passing 'AbstractInstruction *' (aka 'struct _AbstractInstruction *') to parameter of type 'sqInt' (aka 'long') [-Wint-conversion]
[osx]                 genEnsureOopInRegNotForwardedscratchRegifForwarderifNotForwarder(Arg0Reg, TempReg, comp, 0);
[osx]                                                                                                    ^~~~
[osx] /builds/workspace/pharo-vm_headless/generated/vm/src/cogitX64SysV.c:15210:98: note: passing argument to parameter 'fwdJumpTarget' here
[osx] genEnsureOopInRegNotForwardedscratchRegifForwarderifNotForwarder(sqInt reg, sqInt scratch, sqInt fwdJumpTarget, sqInt nonFwdJumpTargetOrZero)
[osx]                                                                                                  ^
[osx] /builds/workspace/pharo-vm_headless/generated/vm/src/cogitX64SysV.c:16281:86: warning: incompatible pointer to integer conversion passing 'AbstractInstruction *' (aka 'struct _AbstractInstruction *') to parameter of type 'sqInt' (aka 'long') [-Wint-conversion]
[osx]                 genEnsureOopInRegNotForwardedscratchRegifForwarderifNotForwarder(Arg0Reg, TempReg, comp, 0);
[osx]                                                                                                    ^~~~
[osx] /builds/workspace/pharo-vm_headless/generated/vm/src/cogitX64SysV.c:15210:98: note: passing argument to parameter 'fwdJumpTarget' here
[osx] genEnsureOopInRegNotForwardedscratchRegifForwarderifNotForwarder(sqInt reg, sqInt scratch, sqInt fwdJumpTarget, sqInt nonFwdJumpTargetOrZero)
[osx]                                                                                                  ^
[osx] /builds/workspace/pharo-vm_headless/generated/vm/src/cogitX64SysV.c:20540:33: warning: expression result unused [-Wunused-value]
[osx]                         (self_in_dispatchConcretize->machineCodeSize);
[osx]                          ~~~~~~~~~~~~~~~~~~~~~~~~~~  ^~~~~~~~~~~~~~~
[osx] /builds/workspace/pharo-vm_headless/generated/vm/src/cogitX64SysV.c:20673:33: warning: expression result unused [-Wunused-value]
[osx]                         (self_in_dispatchConcretize->machineCodeSize);
[osx]                          ~~~~~~~~~~~~~~~~~~~~~~~~~~  ^~~~~~~~~~~~~~~
[osx] /builds/workspace/pharo-vm_headless/generated/vm/src/cogitX64SysV.c:20807:33: warning: expression result unused [-Wunused-value]
[osx]                         (self_in_dispatchConcretize->machineCodeSize);
[osx]                          ~~~~~~~~~~~~~~~~~~~~~~~~~~  ^~~~~~~~~~~~~~~
[osx] /builds/workspace/pharo-vm_headless/generated/vm/src/cogitX64SysV.c:20905:33: warning: expression result unused [-Wunused-value]
[osx]                         (self_in_dispatchConcretize->machineCodeSize);
[osx]                          ~~~~~~~~~~~~~~~~~~~~~~~~~~  ^~~~~~~~~~~~~~~
[osx] /builds/workspace/pharo-vm_headless/generated/vm/src/cogitX64SysV.c:23442:9: warning: incompatible integer to pointer conversion passing 'sqInt' (aka 'long') to parameter of type 'const void *' [-Wint-conversion]
[osx]         memset(startAddr, 204 /* stop */, (endAddr - startAddr) + 1);
[osx]                ^~~~~~~~~
[osx] /usr/include/secure/_string.h:77:59: note: expanded from macro 'memset'
[osx]   __builtin___memset_chk (dest, val, len, __darwin_obsz0 (dest))
[osx]                                                           ^
[osx] /usr/include/secure/_common.h:38:55: note: expanded from macro '__darwin_obsz0'
[osx] #define __darwin_obsz0(object) __builtin_object_size (object, 0)
[osx]                                                       ^
[osx] In file included from /builds/workspace/pharo-vm_headless/generated/vm/src/cogit.c:11:
[osx] /builds/workspace/pharo-vm_headless/generated/vm/src/cogitX64SysV.c:23442:9: warning: incompatible integer to pointer conversion passing 'sqInt' (aka 'long') to parameter of type 'void *' [-Wint-conversion]
[osx]         memset(startAddr, 204 /* stop */, (endAddr - startAddr) + 1);
[osx]                ^~~~~~~~~
[osx] /usr/include/secure/_string.h:77:27: note: expanded from macro 'memset'
[osx]   __builtin___memset_chk (dest, val, len, __darwin_obsz0 (dest))
[osx]                           ^
[osx] In file included from /builds/workspace/pharo-vm_headless/generated/vm/src/cogit.c:11:
[osx] /builds/workspace/pharo-vm_headless/generated/vm/src/cogitX64SysV.c:23716:4: warning: expression result unused [-Wunused-value]
[osx]                 ((AbstractInstruction *) backEnd);
[osx]                  ^                       ~~~~~~~
[osx] /builds/workspace/pharo-vm_headless/generated/vm/src/cogitX64SysV.c:23727:4: warning: expression result unused [-Wunused-value]
[osx]                 ((AbstractInstruction *) backEnd);
[osx]                  ^                       ~~~~~~~
[osx] /builds/workspace/pharo-vm_headless/generated/vm/src/cogitX64SysV.c:23744:4: warning: expression result unused [-Wunused-value]
[osx]                 ((AbstractInstruction *) backEnd);
[osx]                  ^                       ~~~~~~~
[osx] /builds/workspace/pharo-vm_headless/generated/vm/src/cogitX64SysV.c:23755:4: warning: expression result unused [-Wunused-value]
[osx]                 ((AbstractInstruction *) backEnd);
[osx]                  ^                       ~~~~~~~
[osx] /builds/workspace/pharo-vm_headless/generated/vm/src/cogitX64SysV.c:23894:4: warning: expression result unused [-Wunused-value]
[osx]                 ((AbstractInstruction *) backEnd);
[osx]                  ^                       ~~~~~~~
[osx] /builds/workspace/pharo-vm_headless/generated/vm/src/cogitX64SysV.c:23900:4: warning: expression result unused [-Wunused-value]
[osx]                 ((AbstractInstruction *) backEnd);
[osx]                  ^                       ~~~~~~~
[osx] /builds/workspace/pharo-vm_headless/generated/vm/src/cogitX64SysV.c:23906:4: warning: expression result unused [-Wunused-value]
[osx]                 ((AbstractInstruction *) backEnd);
[osx]                  ^                       ~~~~~~~
[osx] /builds/workspace/pharo-vm_headless/generated/vm/src/cogitX64SysV.c:23912:4: warning: expression result unused [-Wunused-value]
[osx]                 ((AbstractInstruction *) backEnd);
[osx]                  ^                       ~~~~~~~
[osx] /builds/workspace/pharo-vm_headless/generated/vm/src/cogitX64SysV.c:23918:3: warning: expression result unused [-Wunused-value]
[osx]         ((AbstractInstruction *) backEnd);
[osx]          ^                       ~~~~~~~
[osx] /builds/workspace/pharo-vm_headless/generated/vm/src/cogitX64SysV.c:24030:39: warning: incompatible pointer to integer conversion passing 'void *' to parameter of type 'sqInt' (aka 'long') [-Wint-conversion]
[osx]         if (!(isWithinMwOffsetRange(backEnd, methodCacheAddress()))) {
[osx]                                              ^~~~~~~~~~~~~~~~~~~~
[osx] /builds/workspace/pharo-vm_headless/generated/vm/src/cogitX64SysV.c:22934:82: note: passing argument to parameter 'anAddress' here
[osx] isWithinMwOffsetRange(AbstractInstruction * self_in_isWithinMwOffsetRange, sqInt anAddress)
[osx]                                                                                  ^
[osx] /builds/workspace/pharo-vm_headless/generated/vm/src/cogitX64SysV.c:24188:49: warning: incompatible integer to pointer conversion passing 'sqInt' (aka 'long') to parameter of type 'void (*)(void)' [-Wint-conversion]
[osx]                 return compileMachineCodeInterpreterPrimitive(mcprimFunctionForPrimitiveIndex(primitiveIndex));
[osx]                                                               ^~~~~~~~~~~~~~~~~~~~~~~~~~~~~~~~~~~~~~~~~~~~~~~
[osx] /builds/workspace/pharo-vm_headless/generated/vm/src/cogitX64SysV.c:23854:47: note: passing argument to parameter 'primitiveRoutine' here
[osx] compileMachineCodeInterpreterPrimitive(void (*primitiveRoutine)(void))
[osx]                                               ^
[osx] /builds/workspace/pharo-vm_headless/generated/vm/src/cogitX64SysV.c:24191:24: warning: comparison of distinct pointer types ('void (*)(void)' and 'sqInt (*)(void)') [-Wcompare-distinct-pointer-types]
[osx]          || (primitiveRoutine == primitiveFail)) {
[osx]              ~~~~~~~~~~~~~~~~ ^  ~~~~~~~~~~~~~
[osx] /builds/workspace/pharo-vm_headless/generated/vm/src/cogitX64SysV.c:24825:39: warning: incompatible pointer to integer conversion passing 'void *' to parameter of type 'sqInt' (aka 'long') [-Wint-conversion]
[osx]         if (!(isWithinMwOffsetRange(backEnd, methodCacheAddress()))) {
[osx]                                              ^~~~~~~~~~~~~~~~~~~~
[osx] /builds/workspace/pharo-vm_headless/generated/vm/src/cogitX64SysV.c:22934:82: note: passing argument to parameter 'anAddress' here
[osx] isWithinMwOffsetRange(AbstractInstruction * self_in_isWithinMwOffsetRange, sqInt anAddress)
[osx]                                                                                  ^
[osx] /builds/workspace/pharo-vm_headless/generated/vm/src/cogitX64SysV.c:28610:85: warning: incompatible pointer to integer conversion passing 'AbstractInstruction *' (aka 'struct _AbstractInstruction *') to parameter of type 'sqInt' (aka 'long') [-Wint-conversion]
[osx]                 genEnsureOopInRegNotForwardedscratchRegifForwarderifNotForwarder(argReg, TempReg, label, 0);
[osx]                                                                                                   ^~~~~
[osx] /builds/workspace/pharo-vm_headless/generated/vm/src/cogitX64SysV.c:15210:98: note: passing argument to parameter 'fwdJumpTarget' here
[osx] genEnsureOopInRegNotForwardedscratchRegifForwarderifNotForwarder(sqInt reg, sqInt scratch, sqInt fwdJumpTarget, sqInt nonFwdJumpTargetOrZero)
[osx]                                                                                                  ^
[osx] /builds/workspace/pharo-vm_headless/generated/vm/src/cogitX64SysV.c:28614:23: warning: incompatible pointer to integer conversion passing 'AbstractInstruction *' (aka 'struct _AbstractInstruction *') to parameter of type 'sqInt' (aka 'long') [-Wint-conversion]
[osx]                 : argReg), TempReg, label, fixup);
[osx]                                     ^~~~~
[osx] /builds/workspace/pharo-vm_headless/generated/vm/src/cogitX64SysV.c:15210:98: note: passing argument to parameter 'fwdJumpTarget' here
[osx] genEnsureOopInRegNotForwardedscratchRegifForwarderifNotForwarder(sqInt reg, sqInt scratch, sqInt fwdJumpTarget, sqInt nonFwdJumpTargetOrZero)
[osx]                                                                                                  ^
[osx] /builds/workspace/pharo-vm_headless/generated/vm/src/cogitX64SysV.c:28614:30: warning: incompatible pointer to integer conversion passing 'BytecodeFixup *' to parameter of type 'sqInt' (aka 'long') [-Wint-conversion]
[osx]                 : argReg), TempReg, label, fixup);
[osx]                                            ^~~~~
[osx] /builds/workspace/pharo-vm_headless/generated/vm/src/cogitX64SysV.c:15210:119: note: passing argument to parameter 'nonFwdJumpTargetOrZero' here
[osx] genEnsureOopInRegNotForwardedscratchRegifForwarderifNotForwarder(sqInt reg, sqInt scratch, sqInt fwdJumpTarget, sqInt nonFwdJumpTargetOrZero)
[osx]                                                                                                                       ^
[osx] /builds/workspace/pharo-vm_headless/generated/vm/src/cogitX64SysV.c:28688:85: warning: incompatible pointer to integer conversion passing 'AbstractInstruction *' (aka 'struct _AbstractInstruction *') to parameter of type 'sqInt' (aka 'long') [-Wint-conversion]
[osx]                 genEnsureOopInRegNotForwardedscratchRegifForwarderifNotForwarder(argReg, TempReg, label, 0);
[osx]                                                                                                   ^~~~~
[osx] /builds/workspace/pharo-vm_headless/generated/vm/src/cogitX64SysV.c:15210:98: note: passing argument to parameter 'fwdJumpTarget' here
[osx] genEnsureOopInRegNotForwardedscratchRegifForwarderifNotForwarder(sqInt reg, sqInt scratch, sqInt fwdJumpTarget, sqInt nonFwdJumpTargetOrZero)
[osx]                                                                                                  ^
[osx] /builds/workspace/pharo-vm_headless/generated/vm/src/cogitX64SysV.c:28692:92: warning: incompatible pointer to integer conversion passing 'AbstractInstruction *' (aka 'struct _AbstractInstruction *') to parameter of type 'sqInt' (aka 'long') [-Wint-conversion]
[osx]                 genEnsureOopInRegNotForwardedscratchRegifForwarderifNotForwarder(rcvrRegOrNone, TempReg, label, 0);
[osx]                                                                                                          ^~~~~
[osx] /builds/workspace/pharo-vm_headless/generated/vm/src/cogitX64SysV.c:15210:98: note: passing argument to parameter 'fwdJumpTarget' here
[osx] genEnsureOopInRegNotForwardedscratchRegifForwarderifNotForwarder(sqInt reg, sqInt scratch, sqInt fwdJumpTarget, sqInt nonFwdJumpTargetOrZero)
[osx]                                                                                                  ^
[osx] /builds/workspace/pharo-vm_headless/generated/vm/src/cogitX64SysV.c:30914:45: warning: incompatible integer to pointer conversion assigning to 'AbstractInstruction *' (aka 'struct _AbstractInstruction *') from 'unsigned char' [-Wint-conversion]
[osx]                 (self_in_reinitialize->targetInstruction) = ((self_in_reinitialize->simStackPtr) = 0);
[osx]                                                           ^ ~~~~~~~~~~~~~~~~~~~~~~~~~~~~~~~~~~~~~~~~~
[osx] 49 warnings generated.
[osx] [  8%] Building C object CMakeFiles/PharoVMCore.dir/generated/vm/src/gcc3x-cointerp.c.o
[osx] /builds/workspace/pharo-vm_headless/generated/vm/src/gcc3x-cointerp.c:4953:36: warning: expression result unused [-Wunused-value]
[osx]                                                 thePage1 = stackPageAtpages((assert((((((char *) theFP)) >= (GIV(stackBasePlus1) - 1)) && ((((char *) theFP)) <= (((char *) GIV(pages)))))),
[osx]                                                                              ^~~~~~~~~~~~~~~~~~~~~~~~~~~~~~~~~~~~~~~~~~~~~~~~~~~~~~~~~~~~~~~~~~~~~~~~~~~~~~~~~~~~~~~~~~~~~~~~~~~~~~~~~~~~~~
[osx] /builds/workspace/pharo-vm_headless/extracted/vm/include/common/sqAssert.h:19:23: note: expanded from macro 'assert'
[osx] # define assert(expr) 0 /* hack disabling of asserts.  Better in makefile? */
[osx]                       ^
[osx] /builds/workspace/pharo-vm_headless/generated/vm/src/gcc3x-cointerp.c:2602:51: note: expanded from macro 'stackPageAtpages'
[osx] #define stackPageAtpages(index,pages) ((pages) + (index))
[osx]                                                   ^
[osx] /builds/workspace/pharo-vm_headless/generated/vm/src/gcc3x-cointerp.c:5007:33: warning: expression result unused [-Wunused-value]
[osx]                                 newPage = stackPageAtpages((assert((((((char *) frameToReturnTo)) >= (GIV(stackBasePlus1) - 1)) && ((((char *) frameToReturnTo)) <= (((char *) GIV(pages)))))),
[osx]                                                             ^~~~~~~~~~~~~~~~~~~~~~~~~~~~~~~~~~~~~~~~~~~~~~~~~~~~~~~~~~~~~~~~~~~~~~~~~~~~~~~~~~~~~~~~~~~~~~~~~~~~~~~~~~~~~~~~~~~~~~~~~~~~~~~~~~
[osx] /builds/workspace/pharo-vm_headless/extracted/vm/include/common/sqAssert.h:19:23: note: expanded from macro 'assert'
[osx] # define assert(expr) 0 /* hack disabling of asserts.  Better in makefile? */
[osx]                       ^
[osx] /builds/workspace/pharo-vm_headless/generated/vm/src/gcc3x-cointerp.c:2602:51: note: expanded from macro 'stackPageAtpages'
[osx] #define stackPageAtpages(index,pages) ((pages) + (index))
[osx]                                                   ^
[osx] /builds/workspace/pharo-vm_headless/generated/vm/src/gcc3x-cointerp.c:5014:35: warning: expression result unused [-Wunused-value]
[osx]                                         thePage3 = stackPageAtpages((assert((((((char *) theFP2)) >= (GIV(stackBasePlus1) - 1)) && ((((char *) theFP2)) <= (((char *) GIV(pages)))))),
[osx]                                                                      ^~~~~~~~~~~~~~~~~~~~~~~~~~~~~~~~~~~~~~~~~~~~~~~~~~~~~~~~~~~~~~~~~~~~~~~~~~~~~~~~~~~~~~~~~~~~~~~~~~~~~~~~~~~~~~~~
[osx] /builds/workspace/pharo-vm_headless/extracted/vm/include/common/sqAssert.h:19:23: note: expanded from macro 'assert'
[osx] # define assert(expr) 0 /* hack disabling of asserts.  Better in makefile? */
[osx]                       ^
[osx] /builds/workspace/pharo-vm_headless/generated/vm/src/gcc3x-cointerp.c:2602:51: note: expanded from macro 'stackPageAtpages'
[osx] #define stackPageAtpages(index,pages) ((pages) + (index))
[osx]                                                   ^
[osx] /builds/workspace/pharo-vm_headless/generated/vm/src/gcc3x-cointerp.c:5028:36: warning: expression result unused [-Wunused-value]
[osx]                                                         thePage = stackPageAtpages((assert((((((char *) theFP)) >= (GIV(stackBasePlus1) - 1)) && ((((char *) theFP)) <= (((char *) GIV(pages)))))),
[osx]                                                                                     ^~~~~~~~~~~~~~~~~~~~~~~~~~~~~~~~~~~~~~~~~~~~~~~~~~~~~~~~~~~~~~~~~~~~~~~~~~~~~~~~~~~~~~~~~~~~~~~~~~~~~~~~~~~~~~
[osx] /builds/workspace/pharo-vm_headless/extracted/vm/include/common/sqAssert.h:19:23: note: expanded from macro 'assert'
[osx] # define assert(expr) 0 /* hack disabling of asserts.  Better in makefile? */
[osx]                       ^
[osx] /builds/workspace/pharo-vm_headless/generated/vm/src/gcc3x-cointerp.c:2602:51: note: expanded from macro 'stackPageAtpages'
[osx] #define stackPageAtpages(index,pages) ((pages) + (index))
[osx]                                                   ^
[osx] /builds/workspace/pharo-vm_headless/generated/vm/src/gcc3x-cointerp.c:5039:37: warning: expression result unused [-Wunused-value]
[osx]                                                         thePage2 = stackPageAtpages((assert((((((char *) theFP1)) >= (GIV(stackBasePlus1) - 1)) && ((((char *) theFP1)) <= (((char *) GIV(pages)))))),
[osx]                                                                                      ^~~~~~~~~~~~~~~~~~~~~~~~~~~~~~~~~~~~~~~~~~~~~~~~~~~~~~~~~~~~~~~~~~~~~~~~~~~~~~~~~~~~~~~~~~~~~~~~~~~~~~~~~~~~~~~~
[osx] /builds/workspace/pharo-vm_headless/extracted/vm/include/common/sqAssert.h:19:23: note: expanded from macro 'assert'
[osx] # define assert(expr) 0 /* hack disabling of asserts.  Better in makefile? */
[osx]                       ^
[osx] /builds/workspace/pharo-vm_headless/generated/vm/src/gcc3x-cointerp.c:2602:51: note: expanded from macro 'stackPageAtpages'
[osx] #define stackPageAtpages(index,pages) ((pages) + (index))
[osx]                                                   ^
[osx] /builds/workspace/pharo-vm_headless/generated/vm/src/gcc3x-cointerp.c:5209:35: warning: expression result unused [-Wunused-value]
[osx]                                         thePage1 = stackPageAtpages((assert((((((char *) localFP)) >= (GIV(stackBasePlus1) - 1)) && ((((char *) localFP)) <= (((char *) GIV(pages)))))),
[osx]                                                                      ^~~~~~~~~~~~~~~~~~~~~~~~~~~~~~~~~~~~~~~~~~~~~~~~~~~~~~~~~~~~~~~~~~~~~~~~~~~~~~~~~~~~~~~~~~~~~~~~~~~~~~~~~~~~~~~~~~
[osx] /builds/workspace/pharo-vm_headless/extracted/vm/include/common/sqAssert.h:19:23: note: expanded from macro 'assert'
[osx] # define assert(expr) 0 /* hack disabling of asserts.  Better in makefile? */
[osx]                       ^
[osx] /builds/workspace/pharo-vm_headless/generated/vm/src/gcc3x-cointerp.c:2602:51: note: expanded from macro 'stackPageAtpages'
[osx] #define stackPageAtpages(index,pages) ((pages) + (index))
[osx]                                                   ^
[osx] /builds/workspace/pharo-vm_headless/generated/vm/src/gcc3x-cointerp.c:5227:35: warning: expression result unused [-Wunused-value]
[osx]                                                 thePage = stackPageAtpages((assert((((((char *) theFP)) >= (GIV(stackBasePlus1) - 1)) && ((((char *) theFP)) <= (((char *) GIV(pages)))))),
[osx]                                                                             ^~~~~~~~~~~~~~~~~~~~~~~~~~~~~~~~~~~~~~~~~~~~~~~~~~~~~~~~~~~~~~~~~~~~~~~~~~~~~~~~~~~~~~~~~~~~~~~~~~~~~~~~~~~~~~
[osx] /builds/workspace/pharo-vm_headless/extracted/vm/include/common/sqAssert.h:19:23: note: expanded from macro 'assert'
[osx] # define assert(expr) 0 /* hack disabling of asserts.  Better in makefile? */
[osx]                       ^
[osx] /builds/workspace/pharo-vm_headless/generated/vm/src/gcc3x-cointerp.c:2602:51: note: expanded from macro 'stackPageAtpages'
[osx] #define stackPageAtpages(index,pages) ((pages) + (index))
[osx]                                                   ^
[osx] /builds/workspace/pharo-vm_headless/generated/vm/src/gcc3x-cointerp.c:6121:69: warning: expression result unused [-Wunused-value]
[osx]                                                 localIP = pointerForOop(((GIV(newMethod) + ((LiteralStart + ((assert((((methodHeader2) & 7) == 1)),
[osx]                                                                                                               ^~~~~~~~~~~~~~~~~~~~~~~~~~~~~~~~~~~~
[osx] /builds/workspace/pharo-vm_headless/extracted/vm/include/common/sqAssert.h:19:23: note: expanded from macro 'assert'
[osx] # define assert(expr) 0 /* hack disabling of asserts.  Better in makefile? */
[osx]                       ^
[osx] /builds/workspace/pharo-vm_headless/extracted/vm/include/common/sqMemoryAccess.h:217:41: note: expanded from macro 'pointerForOop'
[osx] #  define pointerForOop(oop)            ((char *)(oop))
[osx]                                                   ^
[osx] /builds/workspace/pharo-vm_headless/generated/vm/src/gcc3x-cointerp.c:6265:37: warning: expression result unused [-Wunused-value]
[osx]                                                                 thePage = stackPageAtpages((assert((((((char *) spouseFP)) >= (GIV(stackBasePlus1) - 1)) && ((((char *) spouseFP)) <= (((char *) GIV(pages)))))),
[osx]                                                                                             ^~~~~~~~~~~~~~~~~~~~~~~~~~~~~~~~~~~~~~~~~~~~~~~~~~~~~~~~~~~~~~~~~~~~~~~~~~~~~~~~~~~~~~~~~~~~~~~~~~~~~~~~~~~~~~~~~~~~
[osx] /builds/workspace/pharo-vm_headless/extracted/vm/include/common/sqAssert.h:19:23: note: expanded from macro 'assert'
[osx] # define assert(expr) 0 /* hack disabling of asserts.  Better in makefile? */
[osx]                       ^
[osx] /builds/workspace/pharo-vm_headless/generated/vm/src/gcc3x-cointerp.c:2602:51: note: expanded from macro 'stackPageAtpages'
[osx] #define stackPageAtpages(index,pages) ((pages) + (index))
[osx]                                                   ^
[osx] /builds/workspace/pharo-vm_headless/generated/vm/src/gcc3x-cointerp.c:6439:36: warning: expression result unused [-Wunused-value]
[osx]                                                 thePage1 = stackPageAtpages((assert((((((char *) theFP)) >= (GIV(stackBasePlus1) - 1)) && ((((char *) theFP)) <= (((char *) GIV(pages)))))),
[osx]                                                                              ^~~~~~~~~~~~~~~~~~~~~~~~~~~~~~~~~~~~~~~~~~~~~~~~~~~~~~~~~~~~~~~~~~~~~~~~~~~~~~~~~~~~~~~~~~~~~~~~~~~~~~~~~~~~~~
[osx] /builds/workspace/pharo-vm_headless/extracted/vm/include/common/sqAssert.h:19:23: note: expanded from macro 'assert'
[osx] # define assert(expr) 0 /* hack disabling of asserts.  Better in makefile? */
[osx]                       ^
[osx] /builds/workspace/pharo-vm_headless/generated/vm/src/gcc3x-cointerp.c:2602:51: note: expanded from macro 'stackPageAtpages'
[osx] #define stackPageAtpages(index,pages) ((pages) + (index))
[osx]                                                   ^
[osx] /builds/workspace/pharo-vm_headless/generated/vm/src/gcc3x-cointerp.c:12400:36: warning: expression result unused [-Wunused-value]
[osx]                                                         thePage = stackPageAtpages((assert((((((char *) spouseFP)) >= (GIV(stackBasePlus1) - 1)) && ((((char *) spouseFP)) <= (((char *) GIV(pages)))))),
[osx]                                                                                     ^~~~~~~~~~~~~~~~~~~~~~~~~~~~~~~~~~~~~~~~~~~~~~~~~~~~~~~~~~~~~~~~~~~~~~~~~~~~~~~~~~~~~~~~~~~~~~~~~~~~~~~~~~~~~~~~~~~~
[osx] /builds/workspace/pharo-vm_headless/extracted/vm/include/common/sqAssert.h:19:23: note: expanded from macro 'assert'
[osx] # define assert(expr) 0 /* hack disabling of asserts.  Better in makefile? */
[osx]                       ^
[osx] /builds/workspace/pharo-vm_headless/generated/vm/src/gcc3x-cointerp.c:2602:51: note: expanded from macro 'stackPageAtpages'
[osx] #define stackPageAtpages(index,pages) ((pages) + (index))
[osx]                                                   ^
[osx] /builds/workspace/pharo-vm_headless/generated/vm/src/gcc3x-cointerp.c:12955:35: warning: expression result unused [-Wunused-value]
[osx]                                                 thePage = stackPageAtpages((assert((((((char *) theFP)) >= (GIV(stackBasePlus1) - 1)) && ((((char *) theFP)) <= (((char *) GIV(pages)))))),
[osx]                                                                             ^~~~~~~~~~~~~~~~~~~~~~~~~~~~~~~~~~~~~~~~~~~~~~~~~~~~~~~~~~~~~~~~~~~~~~~~~~~~~~~~~~~~~~~~~~~~~~~~~~~~~~~~~~~~~~
[osx] /builds/workspace/pharo-vm_headless/extracted/vm/include/common/sqAssert.h:19:23: note: expanded from macro 'assert'
[osx] # define assert(expr) 0 /* hack disabling of asserts.  Better in makefile? */
[osx]                       ^
[osx] /builds/workspace/pharo-vm_headless/generated/vm/src/gcc3x-cointerp.c:2602:51: note: expanded from macro 'stackPageAtpages'
[osx] #define stackPageAtpages(index,pages) ((pages) + (index))
[osx]                                                   ^
[osx] /builds/workspace/pharo-vm_headless/generated/vm/src/gcc3x-cointerp.c:13202:35: warning: expression result unused [-Wunused-value]
[osx]                                                 thePage = stackPageAtpages((assert((((((char *) theFP)) >= (GIV(stackBasePlus1) - 1)) && ((((char *) theFP)) <= (((char *) GIV(pages)))))),
[osx]                                                                             ^~~~~~~~~~~~~~~~~~~~~~~~~~~~~~~~~~~~~~~~~~~~~~~~~~~~~~~~~~~~~~~~~~~~~~~~~~~~~~~~~~~~~~~~~~~~~~~~~~~~~~~~~~~~~~
[osx] /builds/workspace/pharo-vm_headless/extracted/vm/include/common/sqAssert.h:19:23: note: expanded from macro 'assert'
[osx] # define assert(expr) 0 /* hack disabling of asserts.  Better in makefile? */
[osx]                       ^
[osx] /builds/workspace/pharo-vm_headless/generated/vm/src/gcc3x-cointerp.c:2602:51: note: expanded from macro 'stackPageAtpages'
[osx] #define stackPageAtpages(index,pages) ((pages) + (index))
[osx]                                                   ^
[osx] /builds/workspace/pharo-vm_headless/generated/vm/src/gcc3x-cointerp.c:13903:27: warning: expression result unused [-Wunused-value]
[osx]         return stackPageAtpages((assert((((((char *) pointer)) >= (GIV(stackBasePlus1) - 1)) && ((((char *) pointer)) <= (((char *) GIV(pages)))))),
[osx]                                  ^~~~~~~~~~~~~~~~~~~~~~~~~~~~~~~~~~~~~~~~~~~~~~~~~~~~~~~~~~~~~~~~~~~~~~~~~~~~~~~~~~~~~~~~~~~~~~~~~~~~~~~~~~~~~~~~~~
[osx] /builds/workspace/pharo-vm_headless/extracted/vm/include/common/sqAssert.h:19:23: note: expanded from macro 'assert'
[osx] # define assert(expr) 0 /* hack disabling of asserts.  Better in makefile? */
[osx]                       ^
[osx] /builds/workspace/pharo-vm_headless/generated/vm/src/gcc3x-cointerp.c:2602:51: note: expanded from macro 'stackPageAtpages'
[osx] #define stackPageAtpages(index,pages) ((pages) + (index))
[osx]                                                   ^
[osx] /builds/workspace/pharo-vm_headless/generated/vm/src/gcc3x-cointerp.c:14810:31: warning: expression result unused [-Wunused-value]
[osx]                 thePage = stackPageAtpages((assert((((((char *) GIV(framePointer))) >= (GIV(stackBasePlus1) - 1)) && ((((char *) GIV(framePointer))) <= (((char *) GIV(pages)))))),
[osx]                                             ^~~~~~~~~~~~~~~~~~~~~~~~~~~~~~~~~~~~~~~~~~~~~~~~~~~~~~~~~~~~~~~~~~~~~~~~~~~~~~~~~~~~~~~~~~~~~~~~~~~~~~~~~~~~~~~~~~~~~~~~~~~~~~~~~~~~~~
[osx] /builds/workspace/pharo-vm_headless/extracted/vm/include/common/sqAssert.h:19:23: note: expanded from macro 'assert'
[osx] # define assert(expr) 0 /* hack disabling of asserts.  Better in makefile? */
[osx]                       ^
[osx] /builds/workspace/pharo-vm_headless/generated/vm/src/gcc3x-cointerp.c:2602:51: note: expanded from macro 'stackPageAtpages'
[osx] #define stackPageAtpages(index,pages) ((pages) + (index))
[osx]                                                   ^
[osx] /builds/workspace/pharo-vm_headless/generated/vm/src/gcc3x-cointerp.c:15420:33: warning: expression result unused [-Wunused-value]
[osx]                         thePage1 = stackPageAtpages((assert((((((char *) theFP)) >= (GIV(stackBasePlus1) - 1)) && ((((char *) theFP)) <= (((char *) GIV(pages)))))),
[osx]                                                      ^~~~~~~~~~~~~~~~~~~~~~~~~~~~~~~~~~~~~~~~~~~~~~~~~~~~~~~~~~~~~~~~~~~~~~~~~~~~~~~~~~~~~~~~~~~~~~~~~~~~~~~~~~~~~~
[osx] /builds/workspace/pharo-vm_headless/extracted/vm/include/common/sqAssert.h:19:23: note: expanded from macro 'assert'
[osx] # define assert(expr) 0 /* hack disabling of asserts.  Better in makefile? */
[osx]                       ^
[osx] /builds/workspace/pharo-vm_headless/generated/vm/src/gcc3x-cointerp.c:2602:51: note: expanded from macro 'stackPageAtpages'
[osx] #define stackPageAtpages(index,pages) ((pages) + (index))
[osx]                                                   ^
[osx] /builds/workspace/pharo-vm_headless/generated/vm/src/gcc3x-cointerp.c:15476:30: warning: expression result unused [-Wunused-value]
[osx]         newPage = stackPageAtpages((assert((((((char *) frameToReturnTo)) >= (GIV(stackBasePlus1) - 1)) && ((((char *) frameToReturnTo)) <= (((char *) GIV(pages)))))),
[osx]                                     ^~~~~~~~~~~~~~~~~~~~~~~~~~~~~~~~~~~~~~~~~~~~~~~~~~~~~~~~~~~~~~~~~~~~~~~~~~~~~~~~~~~~~~~~~~~~~~~~~~~~~~~~~~~~~~~~~~~~~~~~~~~~~~~~~~
[osx] /builds/workspace/pharo-vm_headless/extracted/vm/include/common/sqAssert.h:19:23: note: expanded from macro 'assert'
[osx] # define assert(expr) 0 /* hack disabling of asserts.  Better in makefile? */
[osx]                       ^
[osx] /builds/workspace/pharo-vm_headless/generated/vm/src/gcc3x-cointerp.c:2602:51: note: expanded from macro 'stackPageAtpages'
[osx] #define stackPageAtpages(index,pages) ((pages) + (index))
[osx]                                                   ^
[osx] /builds/workspace/pharo-vm_headless/generated/vm/src/gcc3x-cointerp.c:15483:32: warning: expression result unused [-Wunused-value]
[osx]                 thePage3 = stackPageAtpages((assert((((((char *) theFP5)) >= (GIV(stackBasePlus1) - 1)) && ((((char *) theFP5)) <= (((char *) GIV(pages)))))),
[osx]                                              ^~~~~~~~~~~~~~~~~~~~~~~~~~~~~~~~~~~~~~~~~~~~~~~~~~~~~~~~~~~~~~~~~~~~~~~~~~~~~~~~~~~~~~~~~~~~~~~~~~~~~~~~~~~~~~~~
[osx] /builds/workspace/pharo-vm_headless/extracted/vm/include/common/sqAssert.h:19:23: note: expanded from macro 'assert'
[osx] # define assert(expr) 0 /* hack disabling of asserts.  Better in makefile? */
[osx]                       ^
[osx] /builds/workspace/pharo-vm_headless/generated/vm/src/gcc3x-cointerp.c:2602:51: note: expanded from macro 'stackPageAtpages'
[osx] #define stackPageAtpages(index,pages) ((pages) + (index))
[osx]                                                   ^
[osx] /builds/workspace/pharo-vm_headless/generated/vm/src/gcc3x-cointerp.c:15498:33: warning: expression result unused [-Wunused-value]
[osx]                                 thePage = stackPageAtpages((assert((((((char *) theFP)) >= (GIV(stackBasePlus1) - 1)) && ((((char *) theFP)) <= (((char *) GIV(pages)))))),
[osx]                                                             ^~~~~~~~~~~~~~~~~~~~~~~~~~~~~~~~~~~~~~~~~~~~~~~~~~~~~~~~~~~~~~~~~~~~~~~~~~~~~~~~~~~~~~~~~~~~~~~~~~~~~~~~~~~~~~
[osx] /builds/workspace/pharo-vm_headless/extracted/vm/include/common/sqAssert.h:19:23: note: expanded from macro 'assert'
[osx] # define assert(expr) 0 /* hack disabling of asserts.  Better in makefile? */
[osx]                       ^
[osx] /builds/workspace/pharo-vm_headless/generated/vm/src/gcc3x-cointerp.c:2602:51: note: expanded from macro 'stackPageAtpages'
[osx] #define stackPageAtpages(index,pages) ((pages) + (index))
[osx]                                                   ^
[osx] /builds/workspace/pharo-vm_headless/generated/vm/src/gcc3x-cointerp.c:15504:34: warning: expression result unused [-Wunused-value]
[osx]                                 thePage2 = stackPageAtpages((assert((((((char *) theFP4)) >= (GIV(stackBasePlus1) - 1)) && ((((char *) theFP4)) <= (((char *) GIV(pages)))))),
[osx]                                                              ^~~~~~~~~~~~~~~~~~~~~~~~~~~~~~~~~~~~~~~~~~~~~~~~~~~~~~~~~~~~~~~~~~~~~~~~~~~~~~~~~~~~~~~~~~~~~~~~~~~~~~~~~~~~~~~~
[osx] /builds/workspace/pharo-vm_headless/extracted/vm/include/common/sqAssert.h:19:23: note: expanded from macro 'assert'
[osx] # define assert(expr) 0 /* hack disabling of asserts.  Better in makefile? */
[osx]                       ^
[osx] /builds/workspace/pharo-vm_headless/generated/vm/src/gcc3x-cointerp.c:2602:51: note: expanded from macro 'stackPageAtpages'
[osx] #define stackPageAtpages(index,pages) ((pages) + (index))
[osx]                                                   ^
[osx] /builds/workspace/pharo-vm_headless/generated/vm/src/gcc3x-cointerp.c:17790:30: warning: expression result unused [-Wunused-value]
[osx]         thePage = stackPageAtpages((assert((((((char *) theFP)) >= (GIV(stackBasePlus1) - 1)) && ((((char *) theFP)) <= (((char *) GIV(pages)))))),
[osx]                                     ^~~~~~~~~~~~~~~~~~~~~~~~~~~~~~~~~~~~~~~~~~~~~~~~~~~~~~~~~~~~~~~~~~~~~~~~~~~~~~~~~~~~~~~~~~~~~~~~~~~~~~~~~~~~~~
[osx] /builds/workspace/pharo-vm_headless/extracted/vm/include/common/sqAssert.h:19:23: note: expanded from macro 'assert'
[osx] # define assert(expr) 0 /* hack disabling of asserts.  Better in makefile? */
[osx]                       ^
[osx] /builds/workspace/pharo-vm_headless/generated/vm/src/gcc3x-cointerp.c:2602:51: note: expanded from macro 'stackPageAtpages'
[osx] #define stackPageAtpages(index,pages) ((pages) + (index))
[osx]                                                   ^
[osx] /builds/workspace/pharo-vm_headless/generated/vm/src/gcc3x-cointerp.c:18170:31: warning: expression result unused [-Wunused-value]
[osx]                 thePage = stackPageAtpages((assert((((((char *) spouseFP)) >= (GIV(stackBasePlus1) - 1)) && ((((char *) spouseFP)) <= (((char *) GIV(pages)))))),
[osx]                                             ^~~~~~~~~~~~~~~~~~~~~~~~~~~~~~~~~~~~~~~~~~~~~~~~~~~~~~~~~~~~~~~~~~~~~~~~~~~~~~~~~~~~~~~~~~~~~~~~~~~~~~~~~~~~~~~~~~~~
[osx] /builds/workspace/pharo-vm_headless/extracted/vm/include/common/sqAssert.h:19:23: note: expanded from macro 'assert'
[osx] # define assert(expr) 0 /* hack disabling of asserts.  Better in makefile? */
[osx]                       ^
[osx] /builds/workspace/pharo-vm_headless/generated/vm/src/gcc3x-cointerp.c:2602:51: note: expanded from macro 'stackPageAtpages'
[osx] #define stackPageAtpages(index,pages) ((pages) + (index))
[osx]                                                   ^
[osx] /builds/workspace/pharo-vm_headless/generated/vm/src/gcc3x-cointerp.c:18311:4: warning: expression result unused [-Wunused-value]
[osx]                         !GIV(primFailCode);
[osx]                         ^    ~~~~~~~~~~~~
[osx] /builds/workspace/pharo-vm_headless/generated/vm/src/gcc3x-cointerp.c:18625:99: warning: expression result unused [-Wunused-value]
[osx]         longAtput((aContext + BaseHeaderSize) + (((sqInt)((usqInt)(SenderIndex) << (shiftForWord())))), (assert(((oopForPointer((page->baseFP))) & (BytesPerWord - 1)) == 0),
[osx]                                                                                                          ^~~~~~~~~~~~~~~~~~~~~~~~~~~~~~~~~~~~~~~~~~~~~~~~~~~~~~~~~~~~~~~~~~~
[osx] /builds/workspace/pharo-vm_headless/extracted/vm/include/common/sqAssert.h:19:23: note: expanded from macro 'assert'
[osx] # define assert(expr) 0 /* hack disabling of asserts.  Better in makefile? */
[osx]                       ^
[osx] /builds/workspace/pharo-vm_headless/extracted/vm/include/common/sqMemoryAccess.h:230:67: note: expanded from macro 'longAtput'
[osx] # define longAtput(oop,val)                     longAtPointerput(atPointerArg(oop), val)
[osx]                                                                                     ^
[osx] /builds/workspace/pharo-vm_headless/extracted/vm/include/common/sqMemoryAccess.h:205:62: note: expanded from macro 'longAtPointerput'
[osx] # define longAtPointerput(ptr,val)      (*(sqInt *)(ptr)= (sqInt)(val))
[osx]                                                                   ^
[osx] /builds/workspace/pharo-vm_headless/generated/vm/src/gcc3x-cointerp.c:18629:111: warning: expression result unused [-Wunused-value]
[osx]         longAtput((aContext + BaseHeaderSize) + (((sqInt)((usqInt)(InstructionPointerIndex) << (shiftForWord())))), (assert(((oopForPointer(0)) & (BytesPerWord - 1)) == 0),
[osx]                                                                                                                      ^~~~~~~~~~~~~~~~~~~~~~~~~~~~~~~~~~~~~~~~~~~~~~~~~~~~~~
[osx] /builds/workspace/pharo-vm_headless/extracted/vm/include/common/sqAssert.h:19:23: note: expanded from macro 'assert'
[osx] # define assert(expr) 0 /* hack disabling of asserts.  Better in makefile? */
[osx]                       ^
[osx] /builds/workspace/pharo-vm_headless/extracted/vm/include/common/sqMemoryAccess.h:230:67: note: expanded from macro 'longAtput'
[osx] # define longAtput(oop,val)                     longAtPointerput(atPointerArg(oop), val)
[osx]                                                                                     ^
[osx] /builds/workspace/pharo-vm_headless/extracted/vm/include/common/sqMemoryAccess.h:205:62: note: expanded from macro 'longAtPointerput'
[osx] # define longAtPointerput(ptr,val)      (*(sqInt *)(ptr)= (sqInt)(val))
[osx]                                                                   ^
[osx] /builds/workspace/pharo-vm_headless/generated/vm/src/gcc3x-cointerp.c:19084:10: warning: incompatible pointer to integer conversion returning 'sqInt (sqInt)' from a function with result type 'sqInt' (aka 'long') [-Wint-conversion]
[osx]                 return mcprimHashMultiply;
[osx]                        ^~~~~~~~~~~~~~~~~~
[osx] /builds/workspace/pharo-vm_headless/generated/vm/src/gcc3x-cointerp.c:19530:103: warning: expression result unused [-Wunused-value]
[osx]                         longAtput((theContext + BaseHeaderSize) + (((sqInt)((usqInt)(SenderIndex) << (shiftForWord())))), (assert(((oopForPointer(fpInNewPage)) & (BytesPerWord - 1)) == 0),
[osx]                                                                                                                            ^~~~~~~~~~~~~~~~~~~~~~~~~~~~~~~~~~~~~~~~~~~~~~~~~~~~~~~~~~~~~~~~
[osx] /builds/workspace/pharo-vm_headless/extracted/vm/include/common/sqAssert.h:19:23: note: expanded from macro 'assert'
[osx] # define assert(expr) 0 /* hack disabling of asserts.  Better in makefile? */
[osx]                       ^
[osx] /builds/workspace/pharo-vm_headless/extracted/vm/include/common/sqMemoryAccess.h:230:67: note: expanded from macro 'longAtput'
[osx] # define longAtput(oop,val)                     longAtPointerput(atPointerArg(oop), val)
[osx]                                                                                     ^
[osx] /builds/workspace/pharo-vm_headless/extracted/vm/include/common/sqMemoryAccess.h:205:62: note: expanded from macro 'longAtPointerput'
[osx] # define longAtPointerput(ptr,val)      (*(sqInt *)(ptr)= (sqInt)(val))
[osx]                                                                   ^
[osx] /builds/workspace/pharo-vm_headless/generated/vm/src/gcc3x-cointerp.c:19534:115: warning: expression result unused [-Wunused-value]
[osx]                         longAtput((theContext + BaseHeaderSize) + (((sqInt)((usqInt)(InstructionPointerIndex) << (shiftForWord())))), (assert(((oopForPointer(offsetCallerFP)) & (BytesPerWord - 1)) == 0),
[osx]                                                                                                                                        ^~~~~~~~~~~~~~~~~~~~~~~~~~~~~~~~~~~~~~~~~~~~~~~~~~~~~~~~~~~~~~~~~~~
[osx] /builds/workspace/pharo-vm_headless/extracted/vm/include/common/sqAssert.h:19:23: note: expanded from macro 'assert'
[osx] # define assert(expr) 0 /* hack disabling of asserts.  Better in makefile? */
[osx]                       ^
[osx] /builds/workspace/pharo-vm_headless/extracted/vm/include/common/sqMemoryAccess.h:230:67: note: expanded from macro 'longAtput'
[osx] # define longAtput(oop,val)                     longAtPointerput(atPointerArg(oop), val)
[osx]                                                                                     ^
[osx] /builds/workspace/pharo-vm_headless/extracted/vm/include/common/sqMemoryAccess.h:205:62: note: expanded from macro 'longAtPointerput'
[osx] # define longAtPointerput(ptr,val)      (*(sqInt *)(ptr)= (sqInt)(val))
[osx]                                                                   ^
[osx] /builds/workspace/pharo-vm_headless/generated/vm/src/gcc3x-cointerp.c:19990:33: warning: comparison between pointer and integer ('sqInt' (aka 'long') and 'void (*)()')
[osx]                  && (GIV(disabledFFIFunction) == primitiveFunctionPointer)) {
[osx]                          ~~~~~~~~~~~~~~~~~~~  ^  ~~~~~~~~~~~~~~~~~~~~~~~~
[osx] /builds/workspace/pharo-vm_headless/generated/vm/src/gcc3x-cointerp.c:22546:31: warning: expression result unused [-Wunused-value]
[osx]                 thePage = stackPageAtpages((assert((((((char *) theFrame)) >= (GIV(stackBasePlus1) - 1)) && ((((char *) theFrame)) <= (((char *) GIV(pages)))))),
[osx]                                             ^~~~~~~~~~~~~~~~~~~~~~~~~~~~~~~~~~~~~~~~~~~~~~~~~~~~~~~~~~~~~~~~~~~~~~~~~~~~~~~~~~~~~~~~~~~~~~~~~~~~~~~~~~~~~~~~~~~~
[osx] /builds/workspace/pharo-vm_headless/extracted/vm/include/common/sqAssert.h:19:23: note: expanded from macro 'assert'
[osx] # define assert(expr) 0 /* hack disabling of asserts.  Better in makefile? */
[osx]                       ^
[osx] /builds/workspace/pharo-vm_headless/generated/vm/src/gcc3x-cointerp.c:2602:51: note: expanded from macro 'stackPageAtpages'
[osx] #define stackPageAtpages(index,pages) ((pages) + (index))
[osx]                                                   ^
[osx] /builds/workspace/pharo-vm_headless/generated/vm/src/gcc3x-cointerp.c:24235:36: warning: expression result unused [-Wunused-value]
[osx]                 pageToStopOn = stackPageAtpages((assert((((((char *) contextsFP)) >= (GIV(stackBasePlus1) - 1)) && ((((char *) contextsFP)) <= (((char *) GIV(pages)))))),
[osx]                                                  ^~~~~~~~~~~~~~~~~~~~~~~~~~~~~~~~~~~~~~~~~~~~~~~~~~~~~~~~~~~~~~~~~~~~~~~~~~~~~~~~~~~~~~~~~~~~~~~~~~~~~~~~~~~~~~~~~~~~~~~~
[osx] /builds/workspace/pharo-vm_headless/extracted/vm/include/common/sqAssert.h:19:23: note: expanded from macro 'assert'
[osx] # define assert(expr) 0 /* hack disabling of asserts.  Better in makefile? */
[osx]                       ^
[osx] /builds/workspace/pharo-vm_headless/generated/vm/src/gcc3x-cointerp.c:2602:51: note: expanded from macro 'stackPageAtpages'
[osx] #define stackPageAtpages(index,pages) ((pages) + (index))
[osx]                                                   ^
[osx] /builds/workspace/pharo-vm_headless/generated/vm/src/gcc3x-cointerp.c:24294:101: warning: expression result unused [-Wunused-value]
[osx]                                 longAtput((thisCtx + BaseHeaderSize) + (((sqInt)((usqInt)(SenderIndex) << (shiftForWord())))), (assert(((oopForPointer(newFP)) & (BytesPerWord - 1)) == 0),
[osx]                                                                                                                                 ^~~~~~~~~~~~~~~~~~~~~~~~~~~~~~~~~~~~~~~~~~~~~~~~~~~~~~~~~~
[osx] /builds/workspace/pharo-vm_headless/extracted/vm/include/common/sqAssert.h:19:23: note: expanded from macro 'assert'
[osx] # define assert(expr) 0 /* hack disabling of asserts.  Better in makefile? */
[osx]                       ^
[osx] /builds/workspace/pharo-vm_headless/extracted/vm/include/common/sqMemoryAccess.h:230:67: note: expanded from macro 'longAtput'
[osx] # define longAtput(oop,val)                     longAtPointerput(atPointerArg(oop), val)
[osx]                                                                                     ^
[osx] /builds/workspace/pharo-vm_headless/extracted/vm/include/common/sqMemoryAccess.h:205:62: note: expanded from macro 'longAtPointerput'
[osx] # define longAtPointerput(ptr,val)      (*(sqInt *)(ptr)= (sqInt)(val))
[osx]                                                                   ^
[osx] /builds/workspace/pharo-vm_headless/generated/vm/src/gcc3x-cointerp.c:24298:113: warning: expression result unused [-Wunused-value]
[osx]                                 longAtput((thisCtx + BaseHeaderSize) + (((sqInt)((usqInt)(InstructionPointerIndex) << (shiftForWord())))), (assert(((oopForPointer(contextsFP)) & (BytesPerWord - 1)) == 0),
[osx]                                                                                                                                             ^~~~~~~~~~~~~~~~~~~~~~~~~~~~~~~~~~~~~~~~~~~~~~~~~~~~~~~~~~~~~~~
[osx] /builds/workspace/pharo-vm_headless/extracted/vm/include/common/sqAssert.h:19:23: note: expanded from macro 'assert'
[osx] # define assert(expr) 0 /* hack disabling of asserts.  Better in makefile? */
[osx]                       ^
[osx] /builds/workspace/pharo-vm_headless/extracted/vm/include/common/sqMemoryAccess.h:230:67: note: expanded from macro 'longAtput'
[osx] # define longAtput(oop,val)                     longAtPointerput(atPointerArg(oop), val)
[osx]                                                                                     ^
[osx] /builds/workspace/pharo-vm_headless/extracted/vm/include/common/sqMemoryAccess.h:205:62: note: expanded from macro 'longAtPointerput'
[osx] # define longAtPointerput(ptr,val)      (*(sqInt *)(ptr)= (sqInt)(val))
[osx]                                                                   ^
[osx] /builds/workspace/pharo-vm_headless/generated/vm/src/gcc3x-cointerp.c:24316:32: warning: expression result unused [-Wunused-value]
[osx]                 thePage1 = stackPageAtpages((assert((((((char *) theFP)) >= (GIV(stackBasePlus1) - 1)) && ((((char *) theFP)) <= (((char *) GIV(pages)))))),
[osx]                                              ^~~~~~~~~~~~~~~~~~~~~~~~~~~~~~~~~~~~~~~~~~~~~~~~~~~~~~~~~~~~~~~~~~~~~~~~~~~~~~~~~~~~~~~~~~~~~~~~~~~~~~~~~~~~~~
[osx] /builds/workspace/pharo-vm_headless/extracted/vm/include/common/sqAssert.h:19:23: note: expanded from macro 'assert'
[osx] # define assert(expr) 0 /* hack disabling of asserts.  Better in makefile? */
[osx]                       ^
[osx] /builds/workspace/pharo-vm_headless/generated/vm/src/gcc3x-cointerp.c:2602:51: note: expanded from macro 'stackPageAtpages'
[osx] #define stackPageAtpages(index,pages) ((pages) + (index))
[osx]                                                   ^
[osx] /builds/workspace/pharo-vm_headless/generated/vm/src/gcc3x-cointerp.c:24331:37: warning: expression result unused [-Wunused-value]
[osx]                         pageToStopOn = stackPageAtpages((assert((((((char *) contextsFP)) >= (GIV(stackBasePlus1) - 1)) && ((((char *) contextsFP)) <= (((char *) GIV(pages)))))),
[osx]                                                          ^~~~~~~~~~~~~~~~~~~~~~~~~~~~~~~~~~~~~~~~~~~~~~~~~~~~~~~~~~~~~~~~~~~~~~~~~~~~~~~~~~~~~~~~~~~~~~~~~~~~~~~~~~~~~~~~~~~~~~~~
[osx] /builds/workspace/pharo-vm_headless/extracted/vm/include/common/sqAssert.h:19:23: note: expanded from macro 'assert'
[osx] # define assert(expr) 0 /* hack disabling of asserts.  Better in makefile? */
[osx]                       ^
[osx] /builds/workspace/pharo-vm_headless/generated/vm/src/gcc3x-cointerp.c:2602:51: note: expanded from macro 'stackPageAtpages'
[osx] #define stackPageAtpages(index,pages) ((pages) + (index))
[osx]                                                   ^
[osx] /builds/workspace/pharo-vm_headless/generated/vm/src/gcc3x-cointerp.c:24354:33: warning: expression result unused [-Wunused-value]
[osx]                                 thePage = stackPageAtpages((assert((((((char *) theFP)) >= (GIV(stackBasePlus1) - 1)) && ((((char *) theFP)) <= (((char *) GIV(pages)))))),
[osx]                                                             ^~~~~~~~~~~~~~~~~~~~~~~~~~~~~~~~~~~~~~~~~~~~~~~~~~~~~~~~~~~~~~~~~~~~~~~~~~~~~~~~~~~~~~~~~~~~~~~~~~~~~~~~~~~~~~
[osx] /builds/workspace/pharo-vm_headless/extracted/vm/include/common/sqAssert.h:19:23: note: expanded from macro 'assert'
[osx] # define assert(expr) 0 /* hack disabling of asserts.  Better in makefile? */
[osx]                       ^
[osx] /builds/workspace/pharo-vm_headless/generated/vm/src/gcc3x-cointerp.c:2602:51: note: expanded from macro 'stackPageAtpages'
[osx] #define stackPageAtpages(index,pages) ((pages) + (index))
[osx]                                                   ^
[osx] /builds/workspace/pharo-vm_headless/generated/vm/src/gcc3x-cointerp.c:24385:40: warning: expression result unused [-Wunused-value]
[osx]                                                 pageToStopOn = stackPageAtpages((assert((((((char *) contextsFP)) >= (GIV(stackBasePlus1) - 1)) && ((((char *) contextsFP)) <= (((char *) GIV(pages)))))),
[osx]                                                                                  ^~~~~~~~~~~~~~~~~~~~~~~~~~~~~~~~~~~~~~~~~~~~~~~~~~~~~~~~~~~~~~~~~~~~~~~~~~~~~~~~~~~~~~~~~~~~~~~~~~~~~~~~~~~~~~~~~~~~~~~~
[osx] /builds/workspace/pharo-vm_headless/extracted/vm/include/common/sqAssert.h:19:23: note: expanded from macro 'assert'
[osx] # define assert(expr) 0 /* hack disabling of asserts.  Better in makefile? */
[osx]                       ^
[osx] /builds/workspace/pharo-vm_headless/generated/vm/src/gcc3x-cointerp.c:2602:51: note: expanded from macro 'stackPageAtpages'
[osx] #define stackPageAtpages(index,pages) ((pages) + (index))
[osx]                                                   ^
[osx] /builds/workspace/pharo-vm_headless/generated/vm/src/gcc3x-cointerp.c:24436:36: warning: expression result unused [-Wunused-value]
[osx]                                                 thePage2 = stackPageAtpages((assert((((((char *) theFP1)) >= (GIV(stackBasePlus1) - 1)) && ((((char *) theFP1)) <= (((char *) GIV(pages)))))),
[osx]                                                                              ^~~~~~~~~~~~~~~~~~~~~~~~~~~~~~~~~~~~~~~~~~~~~~~~~~~~~~~~~~~~~~~~~~~~~~~~~~~~~~~~~~~~~~~~~~~~~~~~~~~~~~~~~~~~~~~~
[osx] /builds/workspace/pharo-vm_headless/extracted/vm/include/common/sqAssert.h:19:23: note: expanded from macro 'assert'
[osx] # define assert(expr) 0 /* hack disabling of asserts.  Better in makefile? */
[osx]                       ^
[osx] /builds/workspace/pharo-vm_headless/generated/vm/src/gcc3x-cointerp.c:2602:51: note: expanded from macro 'stackPageAtpages'
[osx] #define stackPageAtpages(index,pages) ((pages) + (index))
[osx]                                                   ^
[osx] /builds/workspace/pharo-vm_headless/generated/vm/src/gcc3x-cointerp.c:24824:30: warning: expression result unused [-Wunused-value]
[osx]         thePage = stackPageAtpages((assert((((((char *) theFrame)) >= (GIV(stackBasePlus1) - 1)) && ((((char *) theFrame)) <= (((char *) GIV(pages)))))),
[osx]                                     ^~~~~~~~~~~~~~~~~~~~~~~~~~~~~~~~~~~~~~~~~~~~~~~~~~~~~~~~~~~~~~~~~~~~~~~~~~~~~~~~~~~~~~~~~~~~~~~~~~~~~~~~~~~~~~~~~~~~
[osx] /builds/workspace/pharo-vm_headless/extracted/vm/include/common/sqAssert.h:19:23: note: expanded from macro 'assert'
[osx] # define assert(expr) 0 /* hack disabling of asserts.  Better in makefile? */
[osx]                       ^
[osx] /builds/workspace/pharo-vm_headless/generated/vm/src/gcc3x-cointerp.c:2602:51: note: expanded from macro 'stackPageAtpages'
[osx] #define stackPageAtpages(index,pages) ((pages) + (index))
[osx]                                                   ^
[osx] /builds/workspace/pharo-vm_headless/generated/vm/src/gcc3x-cointerp.c:25066:27: warning: incompatible pointer to integer conversion assigning to 'sqInt' (aka 'long') from 'void *' [-Wint-conversion]
[osx]         GIV(disabledFFIFunction) = aFunction;
[osx]                                  ^ ~~~~~~~~~
[osx] /builds/workspace/pharo-vm_headless/generated/vm/src/gcc3x-cointerp.c:43422:203: warning: data argument not used by format string [-Wformat-extra-args]
[osx]                 : "\ttenure below 0x%" PRIxSQINT "/%" PRIdSQINT " %s\n"), (GIV(scavengeLogRecord).tTenureThreshold), (GIV(scavengeLogRecord).tTenureThreshold), policyNames[(GIV(scavengeLogRecord).tTenureCriterion)], (GIV(scavengeLogRecord).tRefCountToShrinkRT));
[osx]                   ~~~~~~~~~~~~~~~~~~~~~~~~~~~~~~~~~~~~~~~~~~~~~~~~~~~~~                                                                                                                                                 ^
[osx] /builds/workspace/pharo-vm_headless/generated/vm/src/gcc3x-cointerp.c:51884:5: warning: expression result unused [-Wunused-value]
[osx]                                 -classIndex2;
[osx]                                 ^~~~~~~~~~~~
[osx] /builds/workspace/pharo-vm_headless/generated/vm/src/gcc3x-cointerp.c:51948:26: warning: expression result unused [-Wunused-value]
[osx]                 8 /* allocationUnit */ / BytesPerOop;
[osx]                 ~                      ^ ~~~~~~~~~~~
[osx] /builds/workspace/pharo-vm_headless/generated/vm/src/gcc3x-cointerp.c:57851:41: warning: expression result unused [-Wunused-value]
[osx]                 asserta((checkInterpreterIntegrity()) == 0);
[osx]                         ~~~~~~~~~~~~~~~~~~~~~~~~~~~~~ ^  ~
[osx] /builds/workspace/pharo-vm_headless/extracted/vm/include/common/sqAssert.h:20:25: note: expanded from macro 'asserta'
[osx] # define asserta(expr) (expr)
[osx]                         ^
[osx] /builds/workspace/pharo-vm_headless/generated/vm/src/gcc3x-cointerp.c:57872:41: warning: expression result unused [-Wunused-value]
[osx]                 asserta((checkInterpreterIntegrity()) == 0);
[osx]                         ~~~~~~~~~~~~~~~~~~~~~~~~~~~~~ ^  ~
[osx] /builds/workspace/pharo-vm_headless/extracted/vm/include/common/sqAssert.h:20:25: note: expanded from macro 'asserta'
[osx] # define asserta(expr) (expr)
[osx]                         ^
[osx] /builds/workspace/pharo-vm_headless/generated/vm/src/gcc3x-cointerp.c:61235:108: warning: passing 'usqInt *' (aka 'unsigned long *') to parameter of type 'sqInt *' (aka 'long *') converts between pointers to integer types with different sign [-Wpointer-sign]
[osx]         segAddress = sqAllocateMemorySegmentOfSizeAboveAllocatedSizeInto(ammount, firstGapOfSizeAtLeast(ammount), (&allocatedSize));
[osx]                                                                                                                   ^~~~~~~~~~~~~~~~
[osx] /builds/workspace/pharo-vm_headless/extracted/vm/include/common/sq.h:100:98: note: passing argument to parameter 'asp' here
[osx] extern void *sqAllocateMemorySegmentOfSizeAboveAllocatedSizeInto(sqInt sz, void *minAddr, sqInt *asp);
[osx]                                                                                                  ^
[osx] /builds/workspace/pharo-vm_headless/generated/vm/src/gcc3x-cointerp.c:62813:30: warning: expression result unused [-Wunused-value]
[osx]         thePage = stackPageAtpages((assert((((((char *) maybeFP)) >= (GIV(stackBasePlus1) - 1)) && ((((char *) maybeFP)) <= (((char *) GIV(pages)))))),
[osx]                                     ^~~~~~~~~~~~~~~~~~~~~~~~~~~~~~~~~~~~~~~~~~~~~~~~~~~~~~~~~~~~~~~~~~~~~~~~~~~~~~~~~~~~~~~~~~~~~~~~~~~~~~~~~~~~~~~~~~
[osx] /builds/workspace/pharo-vm_headless/extracted/vm/include/common/sqAssert.h:19:23: note: expanded from macro 'assert'
[osx] # define assert(expr) 0 /* hack disabling of asserts.  Better in makefile? */
[osx]                       ^
[osx] /builds/workspace/pharo-vm_headless/generated/vm/src/gcc3x-cointerp.c:2602:51: note: expanded from macro 'stackPageAtpages'
[osx] #define stackPageAtpages(index,pages) ((pages) + (index))
[osx]                                                   ^
[osx] /builds/workspace/pharo-vm_headless/generated/vm/src/gcc3x-cointerp.c:63079:30: warning: expression result unused [-Wunused-value]
[osx]         thePage = stackPageAtpages((assert((((((char *) theFP)) >= (GIV(stackBasePlus1) - 1)) && ((((char *) theFP)) <= (((char *) GIV(pages)))))),
[osx]                                     ^~~~~~~~~~~~~~~~~~~~~~~~~~~~~~~~~~~~~~~~~~~~~~~~~~~~~~~~~~~~~~~~~~~~~~~~~~~~~~~~~~~~~~~~~~~~~~~~~~~~~~~~~~~~~~
[osx] /builds/workspace/pharo-vm_headless/extracted/vm/include/common/sqAssert.h:19:23: note: expanded from macro 'assert'
[osx] # define assert(expr) 0 /* hack disabling of asserts.  Better in makefile? */
[osx]                       ^
[osx] /builds/workspace/pharo-vm_headless/generated/vm/src/gcc3x-cointerp.c:2602:51: note: expanded from macro 'stackPageAtpages'
[osx] #define stackPageAtpages(index,pages) ((pages) + (index))
[osx]                                                   ^
[osx] /builds/workspace/pharo-vm_headless/generated/vm/src/gcc3x-cointerp.c:63559:30: warning: expression result unused [-Wunused-value]
[osx]         thePage = stackPageAtpages((assert((((((char *) calleeFP)) >= (GIV(stackBasePlus1) - 1)) && ((((char *) calleeFP)) <= (((char *) GIV(pages)))))),
[osx]                                     ^~~~~~~~~~~~~~~~~~~~~~~~~~~~~~~~~~~~~~~~~~~~~~~~~~~~~~~~~~~~~~~~~~~~~~~~~~~~~~~~~~~~~~~~~~~~~~~~~~~~~~~~~~~~~~~~~~~~
[osx] /builds/workspace/pharo-vm_headless/extracted/vm/include/common/sqAssert.h:19:23: note: expanded from macro 'assert'
[osx] # define assert(expr) 0 /* hack disabling of asserts.  Better in makefile? */
[osx]                       ^
[osx] /builds/workspace/pharo-vm_headless/generated/vm/src/gcc3x-cointerp.c:2602:51: note: expanded from macro 'stackPageAtpages'
[osx] #define stackPageAtpages(index,pages) ((pages) + (index))
[osx]                                                   ^
[osx] /builds/workspace/pharo-vm_headless/generated/vm/src/gcc3x-cointerp.c:63761:31: warning: expression result unused [-Wunused-value]
[osx]                 thePage = stackPageAtpages((assert((((((char *) theFP)) >= (GIV(stackBasePlus1) - 1)) && ((((char *) theFP)) <= (((char *) GIV(pages)))))),
[osx]                                             ^~~~~~~~~~~~~~~~~~~~~~~~~~~~~~~~~~~~~~~~~~~~~~~~~~~~~~~~~~~~~~~~~~~~~~~~~~~~~~~~~~~~~~~~~~~~~~~~~~~~~~~~~~~~~~
[osx] /builds/workspace/pharo-vm_headless/extracted/vm/include/common/sqAssert.h:19:23: note: expanded from macro 'assert'
[osx] # define assert(expr) 0 /* hack disabling of asserts.  Better in makefile? */
[osx]                       ^
[osx] /builds/workspace/pharo-vm_headless/generated/vm/src/gcc3x-cointerp.c:2602:51: note: expanded from macro 'stackPageAtpages'
[osx] #define stackPageAtpages(index,pages) ((pages) + (index))
[osx]                                                   ^
[osx] /builds/workspace/pharo-vm_headless/generated/vm/src/gcc3x-cointerp.c:64176:30: warning: expression result unused [-Wunused-value]
[osx]         thePage = stackPageAtpages((assert((((((char *) theFP)) >= (GIV(stackBasePlus1) - 1)) && ((((char *) theFP)) <= (((char *) GIV(pages)))))),
[osx]                                     ^~~~~~~~~~~~~~~~~~~~~~~~~~~~~~~~~~~~~~~~~~~~~~~~~~~~~~~~~~~~~~~~~~~~~~~~~~~~~~~~~~~~~~~~~~~~~~~~~~~~~~~~~~~~~~
[osx] /builds/workspace/pharo-vm_headless/extracted/vm/include/common/sqAssert.h:19:23: note: expanded from macro 'assert'
[osx] # define assert(expr) 0 /* hack disabling of asserts.  Better in makefile? */
[osx]                       ^
[osx] /builds/workspace/pharo-vm_headless/generated/vm/src/gcc3x-cointerp.c:2602:51: note: expanded from macro 'stackPageAtpages'
[osx] #define stackPageAtpages(index,pages) ((pages) + (index))
[osx]                                                   ^
[osx] /builds/workspace/pharo-vm_headless/generated/vm/src/gcc3x-cointerp.c:64191:32: warning: expression result unused [-Wunused-value]
[osx]                 thePage1 = stackPageAtpages((assert((((((char *) theFP)) >= (GIV(stackBasePlus1) - 1)) && ((((char *) theFP)) <= (((char *) GIV(pages)))))),
[osx]                                              ^~~~~~~~~~~~~~~~~~~~~~~~~~~~~~~~~~~~~~~~~~~~~~~~~~~~~~~~~~~~~~~~~~~~~~~~~~~~~~~~~~~~~~~~~~~~~~~~~~~~~~~~~~~~~~
[osx] /builds/workspace/pharo-vm_headless/extracted/vm/include/common/sqAssert.h:19:23: note: expanded from macro 'assert'
[osx] # define assert(expr) 0 /* hack disabling of asserts.  Better in makefile? */
[osx]                       ^
[osx] /builds/workspace/pharo-vm_headless/generated/vm/src/gcc3x-cointerp.c:2602:51: note: expanded from macro 'stackPageAtpages'
[osx] #define stackPageAtpages(index,pages) ((pages) + (index))
[osx]                                                   ^
[osx] /builds/workspace/pharo-vm_headless/generated/vm/src/gcc3x-cointerp.c:64303:30: warning: expression result unused [-Wunused-value]
[osx]         thePage = stackPageAtpages((assert((((((char *) theFP)) >= (GIV(stackBasePlus1) - 1)) && ((((char *) theFP)) <= (((char *) GIV(pages)))))),
[osx]                                     ^~~~~~~~~~~~~~~~~~~~~~~~~~~~~~~~~~~~~~~~~~~~~~~~~~~~~~~~~~~~~~~~~~~~~~~~~~~~~~~~~~~~~~~~~~~~~~~~~~~~~~~~~~~~~~
[osx] /builds/workspace/pharo-vm_headless/extracted/vm/include/common/sqAssert.h:19:23: note: expanded from macro 'assert'
[osx] # define assert(expr) 0 /* hack disabling of asserts.  Better in makefile? */
[osx]                       ^
[osx] /builds/workspace/pharo-vm_headless/generated/vm/src/gcc3x-cointerp.c:2602:51: note: expanded from macro 'stackPageAtpages'
[osx] #define stackPageAtpages(index,pages) ((pages) + (index))
[osx]                                                   ^
[osx] /builds/workspace/pharo-vm_headless/generated/vm/src/gcc3x-cointerp.c:64376:30: warning: expression result unused [-Wunused-value]
[osx]         thePage = stackPageAtpages((assert((((((char *) theFP)) >= (GIV(stackBasePlus1) - 1)) && ((((char *) theFP)) <= (((char *) GIV(pages)))))),
[osx]                                     ^~~~~~~~~~~~~~~~~~~~~~~~~~~~~~~~~~~~~~~~~~~~~~~~~~~~~~~~~~~~~~~~~~~~~~~~~~~~~~~~~~~~~~~~~~~~~~~~~~~~~~~~~~~~~~
[osx] /builds/workspace/pharo-vm_headless/extracted/vm/include/common/sqAssert.h:19:23: note: expanded from macro 'assert'
[osx] # define assert(expr) 0 /* hack disabling of asserts.  Better in makefile? */
[osx]                       ^
[osx] /builds/workspace/pharo-vm_headless/generated/vm/src/gcc3x-cointerp.c:2602:51: note: expanded from macro 'stackPageAtpages'
[osx] #define stackPageAtpages(index,pages) ((pages) + (index))
[osx]                                                   ^
[osx] /builds/workspace/pharo-vm_headless/generated/vm/src/gcc3x-cointerp.c:64598:33: warning: expression result unused [-Wunused-value]
[osx]                                 thePage = stackPageAtpages((assert((((((char *) spouseFP)) >= (GIV(stackBasePlus1) - 1)) && ((((char *) spouseFP)) <= (((char *) GIV(pages)))))),
[osx]                                                             ^~~~~~~~~~~~~~~~~~~~~~~~~~~~~~~~~~~~~~~~~~~~~~~~~~~~~~~~~~~~~~~~~~~~~~~~~~~~~~~~~~~~~~~~~~~~~~~~~~~~~~~~~~~~~~~~~~~~
[osx] /builds/workspace/pharo-vm_headless/extracted/vm/include/common/sqAssert.h:19:23: note: expanded from macro 'assert'
[osx] # define assert(expr) 0 /* hack disabling of asserts.  Better in makefile? */
[osx]                       ^
[osx] /builds/workspace/pharo-vm_headless/generated/vm/src/gcc3x-cointerp.c:2602:51: note: expanded from macro 'stackPageAtpages'
[osx] #define stackPageAtpages(index,pages) ((pages) + (index))
[osx]                                                   ^
[osx] /builds/workspace/pharo-vm_headless/generated/vm/src/gcc3x-cointerp.c:64939:30: warning: expression result unused [-Wunused-value]
[osx]         thePage = stackPageAtpages((assert((((((char *) theFPAbove)) >= (GIV(stackBasePlus1) - 1)) && ((((char *) theFPAbove)) <= (((char *) GIV(pages)))))),
[osx]                                     ^~~~~~~~~~~~~~~~~~~~~~~~~~~~~~~~~~~~~~~~~~~~~~~~~~~~~~~~~~~~~~~~~~~~~~~~~~~~~~~~~~~~~~~~~~~~~~~~~~~~~~~~~~~~~~~~~~~~~~~~
[osx] /builds/workspace/pharo-vm_headless/extracted/vm/include/common/sqAssert.h:19:23: note: expanded from macro 'assert'
[osx] # define assert(expr) 0 /* hack disabling of asserts.  Better in makefile? */
[osx]                       ^
[osx] /builds/workspace/pharo-vm_headless/generated/vm/src/gcc3x-cointerp.c:2602:51: note: expanded from macro 'stackPageAtpages'
[osx] #define stackPageAtpages(index,pages) ((pages) + (index))
[osx]                                                   ^
[osx] /builds/workspace/pharo-vm_headless/generated/vm/src/gcc3x-cointerp.c:65138:30: warning: expression result unused [-Wunused-value]
[osx]         thePage = stackPageAtpages((assert((((((char *) theFPAbove)) >= (GIV(stackBasePlus1) - 1)) && ((((char *) theFPAbove)) <= (((char *) GIV(pages)))))),
[osx]                                     ^~~~~~~~~~~~~~~~~~~~~~~~~~~~~~~~~~~~~~~~~~~~~~~~~~~~~~~~~~~~~~~~~~~~~~~~~~~~~~~~~~~~~~~~~~~~~~~~~~~~~~~~~~~~~~~~~~~~~~~~
[osx] /builds/workspace/pharo-vm_headless/extracted/vm/include/common/sqAssert.h:19:23: note: expanded from macro 'assert'
[osx] # define assert(expr) 0 /* hack disabling of asserts.  Better in makefile? */
[osx]                       ^
[osx] /builds/workspace/pharo-vm_headless/generated/vm/src/gcc3x-cointerp.c:2602:51: note: expanded from macro 'stackPageAtpages'
[osx] #define stackPageAtpages(index,pages) ((pages) + (index))
[osx]                                                   ^
[osx] /builds/workspace/pharo-vm_headless/generated/vm/src/gcc3x-cointerp.c:65760:31: warning: expression result unused [-Wunused-value]
[osx]                 thePage = stackPageAtpages((assert((((((char *) theFP)) >= (GIV(stackBasePlus1) - 1)) && ((((char *) theFP)) <= (((char *) GIV(pages)))))),
[osx]                                             ^~~~~~~~~~~~~~~~~~~~~~~~~~~~~~~~~~~~~~~~~~~~~~~~~~~~~~~~~~~~~~~~~~~~~~~~~~~~~~~~~~~~~~~~~~~~~~~~~~~~~~~~~~~~~~
[osx] /builds/workspace/pharo-vm_headless/extracted/vm/include/common/sqAssert.h:19:23: note: expanded from macro 'assert'
[osx] # define assert(expr) 0 /* hack disabling of asserts.  Better in makefile? */
[osx]                       ^
[osx] /builds/workspace/pharo-vm_headless/generated/vm/src/gcc3x-cointerp.c:2602:51: note: expanded from macro 'stackPageAtpages'
[osx] #define stackPageAtpages(index,pages) ((pages) + (index))
[osx]                                                   ^
[osx] /builds/workspace/pharo-vm_headless/generated/vm/src/gcc3x-cointerp.c:66226:30: warning: expression result unused [-Wunused-value]
[osx]         thePage = stackPageAtpages((assert((((((char *) maybeFrame)) >= (GIV(stackBasePlus1) - 1)) && ((((char *) maybeFrame)) <= (((char *) GIV(pages)))))),
[osx]                                     ^~~~~~~~~~~~~~~~~~~~~~~~~~~~~~~~~~~~~~~~~~~~~~~~~~~~~~~~~~~~~~~~~~~~~~~~~~~~~~~~~~~~~~~~~~~~~~~~~~~~~~~~~~~~~~~~~~~~~~~~
[osx] /builds/workspace/pharo-vm_headless/extracted/vm/include/common/sqAssert.h:19:23: note: expanded from macro 'assert'
[osx] # define assert(expr) 0 /* hack disabling of asserts.  Better in makefile? */
[osx]                       ^
[osx] /builds/workspace/pharo-vm_headless/generated/vm/src/gcc3x-cointerp.c:2602:51: note: expanded from macro 'stackPageAtpages'
[osx] #define stackPageAtpages(index,pages) ((pages) + (index))
[osx]                                                   ^
[osx] /builds/workspace/pharo-vm_headless/generated/vm/src/gcc3x-cointerp.c:66306:30: warning: expression result unused [-Wunused-value]
[osx]         thePage = stackPageAtpages((assert((((((char *) theFrame)) >= (GIV(stackBasePlus1) - 1)) && ((((char *) theFrame)) <= (((char *) GIV(pages)))))),
[osx]                                     ^~~~~~~~~~~~~~~~~~~~~~~~~~~~~~~~~~~~~~~~~~~~~~~~~~~~~~~~~~~~~~~~~~~~~~~~~~~~~~~~~~~~~~~~~~~~~~~~~~~~~~~~~~~~~~~~~~~~
[osx] /builds/workspace/pharo-vm_headless/extracted/vm/include/common/sqAssert.h:19:23: note: expanded from macro 'assert'
[osx] # define assert(expr) 0 /* hack disabling of asserts.  Better in makefile? */
[osx]                       ^
[osx] /builds/workspace/pharo-vm_headless/generated/vm/src/gcc3x-cointerp.c:2602:51: note: expanded from macro 'stackPageAtpages'
[osx] #define stackPageAtpages(index,pages) ((pages) + (index))
[osx]                                                   ^
[osx] /builds/workspace/pharo-vm_headless/generated/vm/src/gcc3x-cointerp.c:67706:32: warning: expression result unused [-Wunused-value]
[osx]                 thePage2 = stackPageAtpages((assert((((((char *) theFP)) >= (GIV(stackBasePlus1) - 1)) && ((((char *) theFP)) <= (((char *) GIV(pages)))))),
[osx]                                              ^~~~~~~~~~~~~~~~~~~~~~~~~~~~~~~~~~~~~~~~~~~~~~~~~~~~~~~~~~~~~~~~~~~~~~~~~~~~~~~~~~~~~~~~~~~~~~~~~~~~~~~~~~~~~~
[osx] /builds/workspace/pharo-vm_headless/extracted/vm/include/common/sqAssert.h:19:23: note: expanded from macro 'assert'
[osx] # define assert(expr) 0 /* hack disabling of asserts.  Better in makefile? */
[osx]                       ^
[osx] /builds/workspace/pharo-vm_headless/generated/vm/src/gcc3x-cointerp.c:2602:51: note: expanded from macro 'stackPageAtpages'
[osx] #define stackPageAtpages(index,pages) ((pages) + (index))
[osx]                                                   ^
[osx] /builds/workspace/pharo-vm_headless/generated/vm/src/gcc3x-cointerp.c:67723:32: warning: expression result unused [-Wunused-value]
[osx]                         thePage = stackPageAtpages((assert((((((char *) pointer)) >= (GIV(stackBasePlus1) - 1)) && ((((char *) pointer)) <= (((char *) GIV(pages)))))),
[osx]                                                     ^~~~~~~~~~~~~~~~~~~~~~~~~~~~~~~~~~~~~~~~~~~~~~~~~~~~~~~~~~~~~~~~~~~~~~~~~~~~~~~~~~~~~~~~~~~~~~~~~~~~~~~~~~~~~~~~~~
[osx] /builds/workspace/pharo-vm_headless/extracted/vm/include/common/sqAssert.h:19:23: note: expanded from macro 'assert'
[osx] # define assert(expr) 0 /* hack disabling of asserts.  Better in makefile? */
[osx]                       ^
[osx] /builds/workspace/pharo-vm_headless/generated/vm/src/gcc3x-cointerp.c:2602:51: note: expanded from macro 'stackPageAtpages'
[osx] #define stackPageAtpages(index,pages) ((pages) + (index))
[osx]                                                   ^
[osx] /builds/workspace/pharo-vm_headless/generated/vm/src/gcc3x-cointerp.c:67781:31: warning: expression result unused [-Wunused-value]
[osx]                 thePage = stackPageAtpages((assert((((((char *) theFP)) >= (GIV(stackBasePlus1) - 1)) && ((((char *) theFP)) <= (((char *) GIV(pages)))))),
[osx]                                             ^~~~~~~~~~~~~~~~~~~~~~~~~~~~~~~~~~~~~~~~~~~~~~~~~~~~~~~~~~~~~~~~~~~~~~~~~~~~~~~~~~~~~~~~~~~~~~~~~~~~~~~~~~~~~~
[osx] /builds/workspace/pharo-vm_headless/extracted/vm/include/common/sqAssert.h:19:23: note: expanded from macro 'assert'
[osx] # define assert(expr) 0 /* hack disabling of asserts.  Better in makefile? */
[osx]                       ^
[osx] /builds/workspace/pharo-vm_headless/generated/vm/src/gcc3x-cointerp.c:2602:51: note: expanded from macro 'stackPageAtpages'
[osx] #define stackPageAtpages(index,pages) ((pages) + (index))
[osx]                                                   ^
[osx] /builds/workspace/pharo-vm_headless/generated/vm/src/gcc3x-cointerp.c:67956:101: warning: expression result unused [-Wunused-value]
[osx]         longAtput((theContext + BaseHeaderSize) + (((sqInt)((usqInt)(SenderIndex) << (shiftForWord())))), (assert(((oopForPointer(theFP)) & (BytesPerWord - 1)) == 0),
[osx]                                                                                                            ^~~~~~~~~~~~~~~~~~~~~~~~~~~~~~~~~~~~~~~~~~~~~~~~~~~~~~~~~~
[osx] /builds/workspace/pharo-vm_headless/extracted/vm/include/common/sqAssert.h:19:23: note: expanded from macro 'assert'
[osx] # define assert(expr) 0 /* hack disabling of asserts.  Better in makefile? */
[osx]                       ^
[osx] /builds/workspace/pharo-vm_headless/extracted/vm/include/common/sqMemoryAccess.h:230:67: note: expanded from macro 'longAtput'
[osx] # define longAtput(oop,val)                     longAtPointerput(atPointerArg(oop), val)
[osx]                                                                                     ^
[osx] /builds/workspace/pharo-vm_headless/extracted/vm/include/common/sqMemoryAccess.h:205:62: note: expanded from macro 'longAtPointerput'
[osx] # define longAtPointerput(ptr,val)      (*(sqInt *)(ptr)= (sqInt)(val))
[osx]                                                                   ^
[osx] /builds/workspace/pharo-vm_headless/generated/vm/src/gcc3x-cointerp.c:69146:33: warning: expression result unused [-Wunused-value]
[osx]                                 thePage = stackPageAtpages((assert((((((char *) theFP)) >= (GIV(stackBasePlus1) - 1)) && ((((char *) theFP)) <= (((char *) GIV(pages)))))),
[osx]                                                             ^~~~~~~~~~~~~~~~~~~~~~~~~~~~~~~~~~~~~~~~~~~~~~~~~~~~~~~~~~~~~~~~~~~~~~~~~~~~~~~~~~~~~~~~~~~~~~~~~~~~~~~~~~~~~~
[osx] /builds/workspace/pharo-vm_headless/extracted/vm/include/common/sqAssert.h:19:23: note: expanded from macro 'assert'
[osx] # define assert(expr) 0 /* hack disabling of asserts.  Better in makefile? */
[osx]                       ^
[osx] /builds/workspace/pharo-vm_headless/generated/vm/src/gcc3x-cointerp.c:2602:51: note: expanded from macro 'stackPageAtpages'
[osx] #define stackPageAtpages(index,pages) ((pages) + (index))
[osx]                                                   ^
[osx] /builds/workspace/pharo-vm_headless/generated/vm/src/gcc3x-cointerp.c:69161:34: warning: expression result unused [-Wunused-value]
[osx]                                 thePage1 = stackPageAtpages((assert((((((char *) theFP)) >= (GIV(stackBasePlus1) - 1)) && ((((char *) theFP)) <= (((char *) GIV(pages)))))),
[osx]                                                              ^~~~~~~~~~~~~~~~~~~~~~~~~~~~~~~~~~~~~~~~~~~~~~~~~~~~~~~~~~~~~~~~~~~~~~~~~~~~~~~~~~~~~~~~~~~~~~~~~~~~~~~~~~~~~~
[osx] /builds/workspace/pharo-vm_headless/extracted/vm/include/common/sqAssert.h:19:23: note: expanded from macro 'assert'
[osx] # define assert(expr) 0 /* hack disabling of asserts.  Better in makefile? */
[osx]                       ^
[osx] /builds/workspace/pharo-vm_headless/generated/vm/src/gcc3x-cointerp.c:2602:51: note: expanded from macro 'stackPageAtpages'
[osx] #define stackPageAtpages(index,pages) ((pages) + (index))
[osx]                                                   ^
[osx] /builds/workspace/pharo-vm_headless/generated/vm/src/gcc3x-cointerp.c:69260:27: warning: expression result unused [-Wunused-value]
[osx]                 printHex(oopForPointer((assert((((sender) & 7) == 1)),
[osx]                                         ^~~~~~~~~~~~~~~~~~~~~~~~~~~~~
[osx] /builds/workspace/pharo-vm_headless/extracted/vm/include/common/sqAssert.h:19:23: note: expanded from macro 'assert'
[osx] # define assert(expr) 0 /* hack disabling of asserts.  Better in makefile? */
[osx]                       ^
[osx] /builds/workspace/pharo-vm_headless/extracted/vm/include/common/sqMemoryAccess.h:218:40: note: expanded from macro 'oopForPointer'
[osx] #  define oopForPointer(ptr)            ((sqInt)(ptr))
[osx]                                                  ^
[osx] /builds/workspace/pharo-vm_headless/generated/vm/src/gcc3x-cointerp.c:69270:27: warning: expression result unused [-Wunused-value]
[osx]                 printHex(oopForPointer((assert((((ip) & 7) == 1)),
[osx]                                         ^~~~~~~~~~~~~~~~~~~~~~~~~
[osx] /builds/workspace/pharo-vm_headless/extracted/vm/include/common/sqAssert.h:19:23: note: expanded from macro 'assert'
[osx] # define assert(expr) 0 /* hack disabling of asserts.  Better in makefile? */
[osx]                       ^
[osx] /builds/workspace/pharo-vm_headless/extracted/vm/include/common/sqMemoryAccess.h:218:40: note: expanded from macro 'oopForPointer'
[osx] #  define oopForPointer(ptr)            ((sqInt)(ptr))
[osx]                                                  ^
[osx] /builds/workspace/pharo-vm_headless/generated/vm/src/gcc3x-cointerp.c:69601:31: warning: expression result unused [-Wunused-value]
[osx]                 thePage = stackPageAtpages((assert((((((char *) theFP)) >= (GIV(stackBasePlus1) - 1)) && ((((char *) theFP)) <= (((char *) GIV(pages)))))),
[osx]                                             ^~~~~~~~~~~~~~~~~~~~~~~~~~~~~~~~~~~~~~~~~~~~~~~~~~~~~~~~~~~~~~~~~~~~~~~~~~~~~~~~~~~~~~~~~~~~~~~~~~~~~~~~~~~~~~
[osx] /builds/workspace/pharo-vm_headless/extracted/vm/include/common/sqAssert.h:19:23: note: expanded from macro 'assert'
[osx] # define assert(expr) 0 /* hack disabling of asserts.  Better in makefile? */
[osx]                       ^
[osx] /builds/workspace/pharo-vm_headless/generated/vm/src/gcc3x-cointerp.c:2602:51: note: expanded from macro 'stackPageAtpages'
[osx] #define stackPageAtpages(index,pages) ((pages) + (index))
[osx]                                                   ^
[osx] /builds/workspace/pharo-vm_headless/generated/vm/src/gcc3x-cointerp.c:71743:31: warning: expression result unused [-Wunused-value]
[osx]                 thePage = stackPageAtpages((assert((((((char *) theFP)) >= (GIV(stackBasePlus1) - 1)) && ((((char *) theFP)) <= (((char *) GIV(pages)))))),
[osx]                                             ^~~~~~~~~~~~~~~~~~~~~~~~~~~~~~~~~~~~~~~~~~~~~~~~~~~~~~~~~~~~~~~~~~~~~~~~~~~~~~~~~~~~~~~~~~~~~~~~~~~~~~~~~~~~~~
[osx] /builds/workspace/pharo-vm_headless/extracted/vm/include/common/sqAssert.h:19:23: note: expanded from macro 'assert'
[osx] # define assert(expr) 0 /* hack disabling of asserts.  Better in makefile? */
[osx]                       ^
[osx] /builds/workspace/pharo-vm_headless/generated/vm/src/gcc3x-cointerp.c:2602:51: note: expanded from macro 'stackPageAtpages'
[osx] #define stackPageAtpages(index,pages) ((pages) + (index))
[osx]                                                   ^
[osx] /builds/workspace/pharo-vm_headless/generated/vm/src/gcc3x-cointerp.c:72115:31: warning: expression result unused [-Wunused-value]
[osx]                 thePage = stackPageAtpages((assert((((((char *) theFP)) >= (GIV(stackBasePlus1) - 1)) && ((((char *) theFP)) <= (((char *) GIV(pages)))))),
[osx]                                             ^~~~~~~~~~~~~~~~~~~~~~~~~~~~~~~~~~~~~~~~~~~~~~~~~~~~~~~~~~~~~~~~~~~~~~~~~~~~~~~~~~~~~~~~~~~~~~~~~~~~~~~~~~~~~~
[osx] /builds/workspace/pharo-vm_headless/extracted/vm/include/common/sqAssert.h:19:23: note: expanded from macro 'assert'
[osx] # define assert(expr) 0 /* hack disabling of asserts.  Better in makefile? */
[osx]                       ^
[osx] /builds/workspace/pharo-vm_headless/generated/vm/src/gcc3x-cointerp.c:2602:51: note: expanded from macro 'stackPageAtpages'
[osx] #define stackPageAtpages(index,pages) ((pages) + (index))
[osx]                                                   ^
[osx] /builds/workspace/pharo-vm_headless/generated/vm/src/gcc3x-cointerp.c:72419:31: warning: expression result unused [-Wunused-value]
[osx]                 thePage = stackPageAtpages((assert((((((char *) pointer)) >= (GIV(stackBasePlus1) - 1)) && ((((char *) pointer)) <= (((char *) GIV(pages)))))),
[osx]                                             ^~~~~~~~~~~~~~~~~~~~~~~~~~~~~~~~~~~~~~~~~~~~~~~~~~~~~~~~~~~~~~~~~~~~~~~~~~~~~~~~~~~~~~~~~~~~~~~~~~~~~~~~~~~~~~~~~~
[osx] /builds/workspace/pharo-vm_headless/extracted/vm/include/common/sqAssert.h:19:23: note: expanded from macro 'assert'
[osx] # define assert(expr) 0 /* hack disabling of asserts.  Better in makefile? */
[osx]                       ^
[osx] /builds/workspace/pharo-vm_headless/generated/vm/src/gcc3x-cointerp.c:2602:51: note: expanded from macro 'stackPageAtpages'
[osx] #define stackPageAtpages(index,pages) ((pages) + (index))
[osx]                                                   ^
[osx] /builds/workspace/pharo-vm_headless/generated/vm/src/gcc3x-cointerp.c:72607:30: warning: expression result unused [-Wunused-value]
[osx]         thePage = stackPageAtpages((assert((((((char *) theFP)) >= (GIV(stackBasePlus1) - 1)) && ((((char *) theFP)) <= (((char *) GIV(pages)))))),
[osx]                                     ^~~~~~~~~~~~~~~~~~~~~~~~~~~~~~~~~~~~~~~~~~~~~~~~~~~~~~~~~~~~~~~~~~~~~~~~~~~~~~~~~~~~~~~~~~~~~~~~~~~~~~~~~~~~~~
[osx] /builds/workspace/pharo-vm_headless/extracted/vm/include/common/sqAssert.h:19:23: note: expanded from macro 'assert'
[osx] # define assert(expr) 0 /* hack disabling of asserts.  Better in makefile? */
[osx]                       ^
[osx] /builds/workspace/pharo-vm_headless/generated/vm/src/gcc3x-cointerp.c:2602:51: note: expanded from macro 'stackPageAtpages'
[osx] #define stackPageAtpages(index,pages) ((pages) + (index))
[osx]                                                   ^
[osx] /builds/workspace/pharo-vm_headless/generated/vm/src/gcc3x-cointerp.c:73509:30: warning: expression result unused [-Wunused-value]
[osx]         thePage = stackPageAtpages((assert((((((char *) theFP)) >= (GIV(stackBasePlus1) - 1)) && ((((char *) theFP)) <= (((char *) GIV(pages)))))),
[osx]                                     ^~~~~~~~~~~~~~~~~~~~~~~~~~~~~~~~~~~~~~~~~~~~~~~~~~~~~~~~~~~~~~~~~~~~~~~~~~~~~~~~~~~~~~~~~~~~~~~~~~~~~~~~~~~~~~
[osx] /builds/workspace/pharo-vm_headless/extracted/vm/include/common/sqAssert.h:19:23: note: expanded from macro 'assert'
[osx] # define assert(expr) 0 /* hack disabling of asserts.  Better in makefile? */
[osx]                       ^
[osx] /builds/workspace/pharo-vm_headless/generated/vm/src/gcc3x-cointerp.c:2602:51: note: expanded from macro 'stackPageAtpages'
[osx] #define stackPageAtpages(index,pages) ((pages) + (index))
[osx]                                                   ^
[osx] /builds/workspace/pharo-vm_headless/generated/vm/src/gcc3x-cointerp.c:73993:32: warning: expression result unused [-Wunused-value]
[osx]                 thePage1 = stackPageAtpages((assert((((((char *) theFP)) >= (GIV(stackBasePlus1) - 1)) && ((((char *) theFP)) <= (((char *) GIV(pages)))))),
[osx]                                              ^~~~~~~~~~~~~~~~~~~~~~~~~~~~~~~~~~~~~~~~~~~~~~~~~~~~~~~~~~~~~~~~~~~~~~~~~~~~~~~~~~~~~~~~~~~~~~~~~~~~~~~~~~~~~~
[osx] /builds/workspace/pharo-vm_headless/extracted/vm/include/common/sqAssert.h:19:23: note: expanded from macro 'assert'
[osx] # define assert(expr) 0 /* hack disabling of asserts.  Better in makefile? */
[osx]                       ^
[osx] /builds/workspace/pharo-vm_headless/generated/vm/src/gcc3x-cointerp.c:2602:51: note: expanded from macro 'stackPageAtpages'
[osx] #define stackPageAtpages(index,pages) ((pages) + (index))
[osx]                                                   ^
[osx] /builds/workspace/pharo-vm_headless/generated/vm/src/gcc3x-cointerp.c:74013:30: warning: expression result unused [-Wunused-value]
[osx]         thePage = stackPageAtpages((assert((((((char *) theFP)) >= (GIV(stackBasePlus1) - 1)) && ((((char *) theFP)) <= (((char *) GIV(pages)))))),
[osx]                                     ^~~~~~~~~~~~~~~~~~~~~~~~~~~~~~~~~~~~~~~~~~~~~~~~~~~~~~~~~~~~~~~~~~~~~~~~~~~~~~~~~~~~~~~~~~~~~~~~~~~~~~~~~~~~~~
[osx] /builds/workspace/pharo-vm_headless/extracted/vm/include/common/sqAssert.h:19:23: note: expanded from macro 'assert'
[osx] # define assert(expr) 0 /* hack disabling of asserts.  Better in makefile? */
[osx]                       ^
[osx] /builds/workspace/pharo-vm_headless/generated/vm/src/gcc3x-cointerp.c:2602:51: note: expanded from macro 'stackPageAtpages'
[osx] #define stackPageAtpages(index,pages) ((pages) + (index))
[osx]                                                   ^
[osx] /builds/workspace/pharo-vm_headless/generated/vm/src/gcc3x-cointerp.c:74662:34: warning: expression result unused [-Wunused-value]
[osx]                                 (thePage = stackPageAtpages((assert((((((char *) theFP)) >= (GIV(stackBasePlus1) - 1)) && ((((char *) theFP)) <= (((char *) GIV(pages)))))),
[osx]                                                              ^~~~~~~~~~~~~~~~~~~~~~~~~~~~~~~~~~~~~~~~~~~~~~~~~~~~~~~~~~~~~~~~~~~~~~~~~~~~~~~~~~~~~~~~~~~~~~~~~~~~~~~~~~~~~~
[osx] /builds/workspace/pharo-vm_headless/extracted/vm/include/common/sqAssert.h:19:23: note: expanded from macro 'assert'
[osx] # define assert(expr) 0 /* hack disabling of asserts.  Better in makefile? */
[osx]                       ^
[osx] /builds/workspace/pharo-vm_headless/generated/vm/src/gcc3x-cointerp.c:2602:51: note: expanded from macro 'stackPageAtpages'
[osx] #define stackPageAtpages(index,pages) ((pages) + (index))
[osx]                                                   ^
[osx] /builds/workspace/pharo-vm_headless/generated/vm/src/gcc3x-cointerp.c:76478:2: warning: expression result unused [-Wunused-value]
[osx]         !GIV(primFailCode);
[osx]         ^    ~~~~~~~~~~~~
[osx] /builds/workspace/pharo-vm_headless/generated/vm/src/gcc3x-cointerp.c:77057:32: warning: expression result unused [-Wunused-value]
[osx]                         thePage = stackPageAtpages((assert((((((char *) theFPAbove)) >= (GIV(stackBasePlus1) - 1)) && ((((char *) theFPAbove)) <= (((char *) GIV(pages)))))),
[osx]                                                     ^~~~~~~~~~~~~~~~~~~~~~~~~~~~~~~~~~~~~~~~~~~~~~~~~~~~~~~~~~~~~~~~~~~~~~~~~~~~~~~~~~~~~~~~~~~~~~~~~~~~~~~~~~~~~~~~~~~~~~~~
[osx] /builds/workspace/pharo-vm_headless/extracted/vm/include/common/sqAssert.h:19:23: note: expanded from macro 'assert'
[osx] # define assert(expr) 0 /* hack disabling of asserts.  Better in makefile? */
[osx]                       ^
[osx] /builds/workspace/pharo-vm_headless/generated/vm/src/gcc3x-cointerp.c:2602:51: note: expanded from macro 'stackPageAtpages'
[osx] #define stackPageAtpages(index,pages) ((pages) + (index))
[osx]                                                   ^
[osx] /builds/workspace/pharo-vm_headless/generated/vm/src/gcc3x-cointerp.c:78668:31: warning: expression result unused [-Wunused-value]
[osx]                 thePage = stackPageAtpages((assert((((((char *) theFP)) >= (GIV(stackBasePlus1) - 1)) && ((((char *) theFP)) <= (((char *) GIV(pages)))))),
[osx]                                             ^~~~~~~~~~~~~~~~~~~~~~~~~~~~~~~~~~~~~~~~~~~~~~~~~~~~~~~~~~~~~~~~~~~~~~~~~~~~~~~~~~~~~~~~~~~~~~~~~~~~~~~~~~~~~~
[osx] /builds/workspace/pharo-vm_headless/extracted/vm/include/common/sqAssert.h:19:23: note: expanded from macro 'assert'
[osx] # define assert(expr) 0 /* hack disabling of asserts.  Better in makefile? */
[osx]                       ^
[osx] /builds/workspace/pharo-vm_headless/generated/vm/src/gcc3x-cointerp.c:2602:51: note: expanded from macro 'stackPageAtpages'
[osx] #define stackPageAtpages(index,pages) ((pages) + (index))
[osx]                                                   ^
[osx] /builds/workspace/pharo-vm_headless/generated/vm/src/gcc3x-cointerp.c:79169:32: warning: expression result unused [-Wunused-value]
[osx]                         thePage = stackPageAtpages((assert((((((char *) theFP)) >= (GIV(stackBasePlus1) - 1)) && ((((char *) theFP)) <= (((char *) GIV(pages)))))),
[osx]                                                     ^~~~~~~~~~~~~~~~~~~~~~~~~~~~~~~~~~~~~~~~~~~~~~~~~~~~~~~~~~~~~~~~~~~~~~~~~~~~~~~~~~~~~~~~~~~~~~~~~~~~~~~~~~~~~~
[osx] /builds/workspace/pharo-vm_headless/extracted/vm/include/common/sqAssert.h:19:23: note: expanded from macro 'assert'
[osx] # define assert(expr) 0 /* hack disabling of asserts.  Better in makefile? */
[osx]                       ^
[osx] /builds/workspace/pharo-vm_headless/generated/vm/src/gcc3x-cointerp.c:2602:51: note: expanded from macro 'stackPageAtpages'
[osx] #define stackPageAtpages(index,pages) ((pages) + (index))
[osx]                                                   ^
[windows] Running on windows in E:\Builds\workspace\pharo-vm_headless
[Pipeline] [windows] {
[Pipeline] [windows] timeout
[windows] Timeout set to expire in 30 min
[Pipeline] [windows] {
[Pipeline] [windows] cleanWs
[windows] [WS-CLEANUP] Deleting project workspace...
[windows] [WS-CLEANUP] Deferred wipeout is used...
[windows] [WS-CLEANUP] done
[Pipeline] [windows] stage
[Pipeline] [windows] { (Checkout-windows)
[Pipeline] [windows] checkout
[windows] Cloning the remote Git repository
[windows] Using shallow clone
[windows] shallow clone depth 2
[windows] Cloning repository https://github.com/pharo-project/opensmalltalk-vm.git
[windows]  > git init E:\Builds\workspace\pharo-vm_headless # timeout=10
[windows] Fetching upstream changes from https://github.com/pharo-project/opensmalltalk-vm.git
[windows]  > git --version # timeout=10
[windows] using GIT_ASKPASS to set credentials pharo-ci GitHub account
[windows]  > git fetch --tags --progress https://github.com/pharo-project/opensmalltalk-vm.git +refs/heads/*:refs/remotes/origin/* --depth=2
[osx] 81 warnings generated.
[osx] [  9%] Building C object CMakeFiles/PharoVMCore.dir/extracted/vm/src/common/sqHeapMap.c.o
[osx] [ 10%] Building C object CMakeFiles/PharoVMCore.dir/extracted/vm/src/common/sqVirtualMachine.c.o
[osx] /builds/workspace/pharo-vm_headless/extracted/vm/src/common/sqVirtualMachine.c:431:37: warning: incompatible pointer types assigning to 'void *(*)(sqInt, sqInt, sqInt)' from 'void *(sqInt, sqInt, void *)' [-Wincompatible-pointer-types]
[osx]         VM->ioLoadSymbolOfLengthFromModule = ioLoadSymbolOfLengthFromModule;
[osx]                                            ^ ~~~~~~~~~~~~~~~~~~~~~~~~~~~~~~
[osx] /builds/workspace/pharo-vm_headless/extracted/vm/src/common/sqVirtualMachine.c:509:22: warning: incompatible pointer types assigning to 'volatile unsigned long (*)(void)' from 'volatile unsigned long long (void)' [-Wincompatible-pointer-types]
[osx]         VM->utcMicroseconds = ioUTCMicroseconds;
[osx]                             ^ ~~~~~~~~~~~~~~~~~
[osx] 2 warnings generated.
[osx] [ 11%] Building C object CMakeFiles/PharoVMCore.dir/extracted/vm/src/common/sqNamedPrims.c.o
[osx] [ 12%] Building C object CMakeFiles/PharoVMCore.dir/extracted/vm/src/common/sqExternalSemaphores.c.o
[osx] [ 12%] Building C object CMakeFiles/PharoVMCore.dir/extracted/vm/src/common/sqTicker.c.o
[osx] [ 13%] Building C object CMakeFiles/PharoVMCore.dir/extracted/vm/src/unix/aio.c.o
[osx] [ 14%] Building C object CMakeFiles/PharoVMCore.dir/extracted/vm/src/unix/sqUnixHeartbeat.c.o
[osx] [ 15%] Building C object CMakeFiles/PharoVMCore.dir/src/debugUnix.c.o
[osx] /builds/workspace/pharo-vm_headless/src/debugUnix.c:304:2: warning: implicit declaration of function 'dumpPrimTraceLog' is invalid in C99 [-Wimplicit-function-declaration]
[osx]         dumpPrimTraceLog();
[osx]         ^
[osx] 1 warning generated.
[osx] [ 16%] Building CXX object CMakeFiles/PharoVMCore.dir/src/utilsMac.mm.o
[osx] [ 17%] Building C object CMakeFiles/PharoVMCore.dir/src/memoryUnix.c.o
[osx] Linking CXX shared library build/vm/libPharoVMCore.dylib
[osx] [ 17%] Built target PharoVMCore
[osx] Scanning dependencies of target B2DPlugin
[osx] [ 17%] Building C object CMakeFiles/B2DPlugin.dir/extracted/plugins/B2DPlugin/src/common/B2DPlugin.c.o
[osx] /builds/workspace/pharo-vm_headless/extracted/plugins/B2DPlugin/src/common/B2DPlugin.c:13646:18: warning: expression result unused [-Wunused-value]
[osx]                 ((signed)lastX >> 8);
[osx]                  ~~~~~~~~~~~~~ ^  ~
[osx] /builds/workspace/pharo-vm_headless/extracted/plugins/B2DPlugin/src/common/B2DPlugin.c:13676:18: warning: expression result unused [-Wunused-value]
[osx]         ((signed)lastX1 >> 8);
[osx]          ~~~~~~~~~~~~~~ ^  ~
[osx] 2 warnings generated.
[osx] Linking C shared library build/vm/libB2DPlugin.dylib
[osx] [ 17%] Built target B2DPlugin
[osx] Scanning dependencies of target BitBltPlugin
[osx] [ 18%] Building C object CMakeFiles/BitBltPlugin.dir/extracted/plugins/BitBltPlugin/src/common/BitBltPlugin.c.o
[osx] Linking C shared library build/vm/libBitBltPlugin.dylib
[osx] [ 18%] Built target BitBltPlugin
[osx] Scanning dependencies of target DSAPrims
[osx] [ 19%] Building C object CMakeFiles/DSAPrims.dir/extracted/plugins/DSAPrims/src/common/DSAPrims.c.o
[osx] Linking C shared library build/vm/libDSAPrims.dylib
[osx] [ 19%] Built target DSAPrims
[osx] Scanning dependencies of target FilePlugin
[osx] [ 20%] Building C object CMakeFiles/FilePlugin.dir/extracted/plugins/FilePlugin/src/common/FilePlugin.c.o
[osx] /builds/workspace/pharo-vm_headless/extracted/plugins/FilePlugin/src/common/FilePlugin.c:579:10: warning: incompatible integer to pointer conversion returning 'sqInt' (aka 'long') from a function with result type 'void *' [-Wint-conversion]
[osx]                 return primitiveFailFor(PrimErrBadArgument);
[osx]                        ^~~~~~~~~~~~~~~~~~~~~~~~~~~~~~~~~~~~
[osx] /builds/workspace/pharo-vm_headless/extracted/plugins/FilePlugin/src/common/FilePlugin.c:1735:21: warning: incompatible pointer types assigning to 'sqInt (*)(sqInt)' from 'sqInt (*)(int)' [-Wincompatible-pointer-types]
[osx]                 characterObjectOf = interpreterProxy->characterObjectOf;
[osx]                                   ^ ~~~~~~~~~~~~~~~~~~~~~~~~~~~~~~~~~~~
[osx] /builds/workspace/pharo-vm_headless/extracted/plugins/FilePlugin/src/common/FilePlugin.c:1749:10: warning: incompatible pointer types assigning to 'sqInt (*)(void)' from 'void (*)(void)' [-Wincompatible-pointer-types]
[osx]                 fullGC = interpreterProxy->fullGC;
[osx]                        ^ ~~~~~~~~~~~~~~~~~~~~~~~~
[osx] 3 warnings generated.
[osx] [ 21%] Building C object CMakeFiles/FilePlugin.dir/extracted/plugins/FilePlugin/src/common/sqFilePluginBasicPrims.c.o
[osx] [ 22%] Building C object CMakeFiles/FilePlugin.dir/extracted/plugins/FilePlugin/src/unix/sqUnixFile.c.o
[osx] [ 23%] Building C object CMakeFiles/FilePlugin.dir/extracted/vm/src/unix/sqUnixCharConv.c.o
[osx] [ 23%] Building C object CMakeFiles/FilePlugin.dir/src/fileUtils.c.o
[osx] Linking C shared library build/vm/libFilePlugin.dylib
[osx] [ 23%] Built target FilePlugin
[osx] Scanning dependencies of target FileAttributesPlugin
[osx] [ 24%] Building C object CMakeFiles/FileAttributesPlugin.dir/extracted/plugins/FileAttributesPlugin/src/common/faCommon.c.o
[osx] [ 25%] Building C object CMakeFiles/FileAttributesPlugin.dir/extracted/plugins/FileAttributesPlugin/src/common/FileAttributesPlugin.c.o
[osx] [ 25%] Building C object CMakeFiles/FileAttributesPlugin.dir/extracted/plugins/FileAttributesPlugin/src/unix/faSupport.c.o
[osx] Linking C shared library build/vm/libFileAttributesPlugin.dylib
[osx] [ 25%] Built target FileAttributesPlugin
[osx] Scanning dependencies of target IA32ABI
[osx] [ 26%] Building C object CMakeFiles/IA32ABI.dir/extracted/plugins/IA32ABI/src/common/IA32ABI.c.o
[osx] /builds/workspace/pharo-vm_headless/extracted/plugins/IA32ABI/src/common/IA32ABI.c:748:24: warning: incompatible integer to pointer conversion passing 'sqInt' (aka 'long') to parameter of type 'const void *' [-Wint-conversion]
[osx]         memcpy((&floatValue), addr, sizeof(floatValue));
[osx]                               ^~~~
[osx] /usr/include/secure/_string.h:65:33: note: expanded from macro 'memcpy'
[osx]   __builtin___memcpy_chk (dest, src, len, __darwin_obsz0 (dest))
[osx]                                 ^
[osx] /builds/workspace/pharo-vm_headless/extracted/plugins/IA32ABI/src/common/IA32ABI.c:795:9: warning: incompatible integer to pointer conversion passing 'sqInt' (aka 'long') to parameter of type 'const void *' [-Wint-conversion]
[osx]         memcpy(addr, (&floatValue), sizeof(floatValue));
[osx]                ^~~~
[osx] /usr/include/secure/_string.h:65:59: note: expanded from macro 'memcpy'
[osx]   __builtin___memcpy_chk (dest, src, len, __darwin_obsz0 (dest))
[osx]                                                           ^
[osx] /usr/include/secure/_common.h:38:55: note: expanded from macro '__darwin_obsz0'
[osx] #define __darwin_obsz0(object) __builtin_object_size (object, 0)
[osx]                                                       ^
[osx] /builds/workspace/pharo-vm_headless/extracted/plugins/IA32ABI/src/common/IA32ABI.c:795:9: warning: incompatible integer to pointer conversion passing 'sqInt' (aka 'long') to parameter of type 'void *' [-Wint-conversion]
[osx]         memcpy(addr, (&floatValue), sizeof(floatValue));
[osx]                ^~~~
[osx] /usr/include/secure/_string.h:65:27: note: expanded from macro 'memcpy'
[osx]   __builtin___memcpy_chk (dest, src, len, __darwin_obsz0 (dest))
[osx]                           ^
[osx] /builds/workspace/pharo-vm_headless/extracted/plugins/IA32ABI/src/common/IA32ABI.c:840:24: warning: incompatible integer to pointer conversion passing 'sqInt' (aka 'long') to parameter of type 'const void *' [-Wint-conversion]
[osx]         memcpy((&floatValue), addr, sizeof(floatValue));
[osx]                               ^~~~
[osx] /usr/include/secure/_string.h:65:33: note: expanded from macro 'memcpy'
[osx]   __builtin___memcpy_chk (dest, src, len, __darwin_obsz0 (dest))
[osx]                                 ^
[osx] /builds/workspace/pharo-vm_headless/extracted/plugins/IA32ABI/src/common/IA32ABI.c:887:9: warning: incompatible integer to pointer conversion passing 'sqInt' (aka 'long') to parameter of type 'const void *' [-Wint-conversion]
[osx]         memcpy(addr, (&floatValue), sizeof(floatValue));
[osx]                ^~~~
[osx] /usr/include/secure/_string.h:65:59: note: expanded from macro 'memcpy'
[osx]   __builtin___memcpy_chk (dest, src, len, __darwin_obsz0 (dest))
[osx]                                                           ^
[osx] /usr/include/secure/_common.h:38:55: note: expanded from macro '__darwin_obsz0'
[osx] #define __darwin_obsz0(object) __builtin_object_size (object, 0)
[osx]                                                       ^
[osx] /builds/workspace/pharo-vm_headless/extracted/plugins/IA32ABI/src/common/IA32ABI.c:887:9: warning: incompatible integer to pointer conversion passing 'sqInt' (aka 'long') to parameter of type 'void *' [-Wint-conversion]
[osx]         memcpy(addr, (&floatValue), sizeof(floatValue));
[osx]                ^~~~
[osx] /usr/include/secure/_string.h:65:27: note: expanded from macro 'memcpy'
[osx]   __builtin___memcpy_chk (dest, src, len, __darwin_obsz0 (dest))
[osx]                           ^
[osx] /builds/workspace/pharo-vm_headless/extracted/plugins/IA32ABI/src/common/IA32ABI.c:2253:34: warning: incompatible pointer types assigning to 'sqInt (*)(sqInt, VMCallbackContext *, sqInt)' from 'sqInt (*)(int, vmccp, sqInt)' [-Wincompatible-pointer-types]
[osx]                 returnAsThroughCallbackContext = interpreterProxy->returnAsThroughCallbackContext;
[osx]                                                ^ ~~~~~~~~~~~~~~~~~~~~~~~~~~~~~~~~~~~~~~~~~~~~~~~~
[osx] 7 warnings generated.
[osx] [ 27%] Building C object CMakeFiles/IA32ABI.dir/extracted/plugins/IA32ABI/src/common/AlienSUnitTestProcedures.c.o
[osx] [ 28%] Building C object CMakeFiles/IA32ABI.dir/extracted/plugins/IA32ABI/src/common/xabicc.c.o
[osx] In file included from /builds/workspace/pharo-vm_headless/extracted/plugins/IA32ABI/src/common/xabicc.c:16:
[osx] /builds/workspace/pharo-vm_headless/extracted/plugins/IA32ABI/src/common/x64sysvabicc.c:283:18: warning: implicit declaration of function 'getpagesize' is invalid in C99 [-Wimplicit-function-declaration]
[osx]         long pagesize = getpagesize();
[osx]                         ^
[osx] 1 warning generated.
[osx] Linking C shared library build/vm/libIA32ABI.dylib
[osx] [ 28%] Built target IA32ABI
[osx] Scanning dependencies of target JPEGReadWriter2Plugin
[osx] [ 29%] Building C object CMakeFiles/JPEGReadWriter2Plugin.dir/extracted/plugins/JPEGReadWriter2Plugin/src/common/Error.c.o
[osx] [ 29%] Building C object CMakeFiles/JPEGReadWriter2Plugin.dir/extracted/plugins/JPEGReadWriter2Plugin/src/common/jcapimin.c.o
[osx] [ 30%] Building C object CMakeFiles/JPEGReadWriter2Plugin.dir/extracted/plugins/JPEGReadWriter2Plugin/src/common/jcapistd.c.o
[osx] [ 31%] Building C object CMakeFiles/JPEGReadWriter2Plugin.dir/extracted/plugins/JPEGReadWriter2Plugin/src/common/jccoefct.c.o
[osx] [ 32%] Building C object CMakeFiles/JPEGReadWriter2Plugin.dir/extracted/plugins/JPEGReadWriter2Plugin/src/common/jccolor.c.o
[osx] [ 33%] Building C object CMakeFiles/JPEGReadWriter2Plugin.dir/extracted/plugins/JPEGReadWriter2Plugin/src/common/jcdctmgr.c.o
[osx] [ 33%] Building C object CMakeFiles/JPEGReadWriter2Plugin.dir/extracted/plugins/JPEGReadWriter2Plugin/src/common/jchuff.c.o
[osx] [ 34%] Building C object CMakeFiles/JPEGReadWriter2Plugin.dir/extracted/plugins/JPEGReadWriter2Plugin/src/common/jcinit.c.o
[osx] [ 35%] Building C object CMakeFiles/JPEGReadWriter2Plugin.dir/extracted/plugins/JPEGReadWriter2Plugin/src/common/jcmainct.c.o
[osx] [ 36%] Building C object CMakeFiles/JPEGReadWriter2Plugin.dir/extracted/plugins/JPEGReadWriter2Plugin/src/common/jcmarker.c.o
[osx] [ 37%] Building C object CMakeFiles/JPEGReadWriter2Plugin.dir/extracted/plugins/JPEGReadWriter2Plugin/src/common/jcmaster.c.o
[osx] [ 37%] Building C object CMakeFiles/JPEGReadWriter2Plugin.dir/extracted/plugins/JPEGReadWriter2Plugin/src/common/jcomapi.c.o
[osx] [ 38%] Building C object CMakeFiles/JPEGReadWriter2Plugin.dir/extracted/plugins/JPEGReadWriter2Plugin/src/common/jcparam.c.o
[osx] [ 39%] Building C object CMakeFiles/JPEGReadWriter2Plugin.dir/extracted/plugins/JPEGReadWriter2Plugin/src/common/jcphuff.c.o
[osx] [ 40%] Building C object CMakeFiles/JPEGReadWriter2Plugin.dir/extracted/plugins/JPEGReadWriter2Plugin/src/common/jcprepct.c.o
[osx] [ 41%] Building C object CMakeFiles/JPEGReadWriter2Plugin.dir/extracted/plugins/JPEGReadWriter2Plugin/src/common/jcsample.c.o
[osx] [ 42%] Building C object CMakeFiles/JPEGReadWriter2Plugin.dir/extracted/plugins/JPEGReadWriter2Plugin/src/common/jctrans.c.o
[osx] [ 42%] Building C object CMakeFiles/JPEGReadWriter2Plugin.dir/extracted/plugins/JPEGReadWriter2Plugin/src/common/jdapimin.c.o
[osx] [ 43%] Building C object CMakeFiles/JPEGReadWriter2Plugin.dir/extracted/plugins/JPEGReadWriter2Plugin/src/common/jdapistd.c.o
[osx] [ 44%] Building C object CMakeFiles/JPEGReadWriter2Plugin.dir/extracted/plugins/JPEGReadWriter2Plugin/src/common/jdatadst.c.o
[osx] [ 45%] Building C object CMakeFiles/JPEGReadWriter2Plugin.dir/extracted/plugins/JPEGReadWriter2Plugin/src/common/jdatasrc.c.o
[osx] [ 46%] Building C object CMakeFiles/JPEGReadWriter2Plugin.dir/extracted/plugins/JPEGReadWriter2Plugin/src/common/jdcoefct.c.o
[osx] [ 46%] Building C object CMakeFiles/JPEGReadWriter2Plugin.dir/extracted/plugins/JPEGReadWriter2Plugin/src/common/jdcolor.c.o
[osx] [ 47%] Building C object CMakeFiles/JPEGReadWriter2Plugin.dir/extracted/plugins/JPEGReadWriter2Plugin/src/common/jddctmgr.c.o
[osx] [ 48%] Building C object CMakeFiles/JPEGReadWriter2Plugin.dir/extracted/plugins/JPEGReadWriter2Plugin/src/common/jdhuff.c.o
[osx] [ 49%] Building C object CMakeFiles/JPEGReadWriter2Plugin.dir/extracted/plugins/JPEGReadWriter2Plugin/src/common/jdinput.c.o
[osx] [ 50%] Building C object CMakeFiles/JPEGReadWriter2Plugin.dir/extracted/plugins/JPEGReadWriter2Plugin/src/common/jdmainct.c.o
[osx] [ 50%] Building C object CMakeFiles/JPEGReadWriter2Plugin.dir/extracted/plugins/JPEGReadWriter2Plugin/src/common/jdmarker.c.o
[osx] [ 51%] Building C object CMakeFiles/JPEGReadWriter2Plugin.dir/extracted/plugins/JPEGReadWriter2Plugin/src/common/jdmaster.c.o
[osx] [ 52%] Building C object CMakeFiles/JPEGReadWriter2Plugin.dir/extracted/plugins/JPEGReadWriter2Plugin/src/common/jdmerge.c.o
[osx] [ 53%] Building C object CMakeFiles/JPEGReadWriter2Plugin.dir/extracted/plugins/JPEGReadWriter2Plugin/src/common/jdphuff.c.o
[osx] [ 54%] Building C object CMakeFiles/JPEGReadWriter2Plugin.dir/extracted/plugins/JPEGReadWriter2Plugin/src/common/jdpostct.c.o
[osx] [ 54%] Building C object CMakeFiles/JPEGReadWriter2Plugin.dir/extracted/plugins/JPEGReadWriter2Plugin/src/common/jdsample.c.o
[osx] [ 55%] Building C object CMakeFiles/JPEGReadWriter2Plugin.dir/extracted/plugins/JPEGReadWriter2Plugin/src/common/jdtrans.c.o
[osx] [ 56%] Building C object CMakeFiles/JPEGReadWriter2Plugin.dir/extracted/plugins/JPEGReadWriter2Plugin/src/common/jerror.c.o
[osx] [ 57%] Building C object CMakeFiles/JPEGReadWriter2Plugin.dir/extracted/plugins/JPEGReadWriter2Plugin/src/common/jfdctflt.c.o
[osx] [ 58%] Building C object CMakeFiles/JPEGReadWriter2Plugin.dir/extracted/plugins/JPEGReadWriter2Plugin/src/common/jfdctfst.c.o
[osx] [ 58%] Building C object CMakeFiles/JPEGReadWriter2Plugin.dir/extracted/plugins/JPEGReadWriter2Plugin/src/common/jfdctint.c.o
[osx] [ 59%] Building C object CMakeFiles/JPEGReadWriter2Plugin.dir/extracted/plugins/JPEGReadWriter2Plugin/src/common/jidctflt.c.o
[osx] [ 60%] Building C object CMakeFiles/JPEGReadWriter2Plugin.dir/extracted/plugins/JPEGReadWriter2Plugin/src/common/jidctfst.c.o
[osx] [ 61%] Building C object CMakeFiles/JPEGReadWriter2Plugin.dir/extracted/plugins/JPEGReadWriter2Plugin/src/common/jidctint.c.o
[osx] [ 62%] Building C object CMakeFiles/JPEGReadWriter2Plugin.dir/extracted/plugins/JPEGReadWriter2Plugin/src/common/jidctred.c.o
[osx] [ 62%] Building C object CMakeFiles/JPEGReadWriter2Plugin.dir/extracted/plugins/JPEGReadWriter2Plugin/src/common/jmemdatadst.c.o
[osx] [ 63%] Building C object CMakeFiles/JPEGReadWriter2Plugin.dir/extracted/plugins/JPEGReadWriter2Plugin/src/common/jmemdatasrc.c.o
[osx] [ 64%] Building C object CMakeFiles/JPEGReadWriter2Plugin.dir/extracted/plugins/JPEGReadWriter2Plugin/src/common/jmemmgr.c.o
[osx] [ 65%] Building C object CMakeFiles/JPEGReadWriter2Plugin.dir/extracted/plugins/JPEGReadWriter2Plugin/src/common/jmemnobs.c.o
[osx] [ 66%] Building C object CMakeFiles/JPEGReadWriter2Plugin.dir/extracted/plugins/JPEGReadWriter2Plugin/src/common/JPEGReadWriter2Plugin.c.o
[osx] [ 67%] Building C object CMakeFiles/JPEGReadWriter2Plugin.dir/extracted/plugins/JPEGReadWriter2Plugin/src/common/jquant1.c.o
[osx] [ 67%] Building C object CMakeFiles/JPEGReadWriter2Plugin.dir/extracted/plugins/JPEGReadWriter2Plugin/src/common/jquant2.c.o
[osx] [ 68%] Building C object CMakeFiles/JPEGReadWriter2Plugin.dir/extracted/plugins/JPEGReadWriter2Plugin/src/common/jutils.c.o
[osx] [ 69%] Building C object CMakeFiles/JPEGReadWriter2Plugin.dir/extracted/plugins/JPEGReadWriter2Plugin/src/common/sqJPEGReadWriter2Plugin.c.o
[osx] Linking C shared library build/vm/libJPEGReadWriter2Plugin.dylib
[osx] [ 69%] Built target JPEGReadWriter2Plugin
[osx] Scanning dependencies of target JPEGReaderPlugin
[osx] [ 70%] Building C object CMakeFiles/JPEGReaderPlugin.dir/extracted/plugins/JPEGReaderPlugin/src/common/JPEGReaderPlugin.c.o
[osx] Linking C shared library build/vm/libJPEGReaderPlugin.dylib
[osx] [ 70%] Built target JPEGReaderPlugin
[osx] Scanning dependencies of target LargeIntegers
[osx] [ 71%] Building C object CMakeFiles/LargeIntegers.dir/extracted/plugins/LargeIntegers/src/common/LargeIntegers.c.o
[osx] Linking C shared library build/vm/libLargeIntegers.dylib
[osx] [ 71%] Built target LargeIntegers
[osx] Scanning dependencies of target LocalePlugin
[osx] [ 71%] Building C object CMakeFiles/LocalePlugin.dir/extracted/plugins/LocalePlugin/src/common/LocalePlugin.c.o
[osx] [ 72%] Building C object CMakeFiles/LocalePlugin.dir/extracted/plugins/LocalePlugin/src/osx/sqIOSLocale.c.o
[osx] /builds/workspace/pharo-vm_headless/extracted/plugins/LocalePlugin/src/osx/sqIOSLocale.c:133:17: warning: incompatible integer to pointer conversion passing 'time_t' (aka 'long') to parameter of type 'time_t *' (aka 'long *') [-Wint-conversion]
[osx]         theTime = time((time_t)NULL);
[osx]                        ^~~~~~~~~~~~
[osx] /usr/include/time.h:118:21: note: passing argument to parameter here
[osx] time_t time(time_t *);
[osx]                     ^
[osx] 1 warning generated.
[osx] Linking C shared library build/vm/libLocalePlugin.dylib
[osx] [ 72%] Built target LocalePlugin
[osx] Scanning dependencies of target MiscPrimitivePlugin
[osx] [ 73%] Building C object CMakeFiles/MiscPrimitivePlugin.dir/extracted/plugins/MiscPrimitivePlugin/src/common/MiscPrimitivePlugin.c.o
[osx] Linking C shared library build/vm/libMiscPrimitivePlugin.dylib
[osx] [ 73%] Built target MiscPrimitivePlugin
[osx] Scanning dependencies of target Pharo
[osx] [ 74%] Building C object CMakeFiles/Pharo.dir/src/main.c.o
[osx] [ 75%] Building C object CMakeFiles/Pharo.dir/src/parameters.c.o
[osx] [ 75%] Building CXX object CMakeFiles/Pharo.dir/src/macOpenFileDialog.mm.o
[windows]  > git config remote.origin.url https://github.com/pharo-project/opensmalltalk-vm.git # timeout=10
[windows]  > git config --add remote.origin.fetch +refs/heads/*:refs/remotes/origin/* # timeout=10
[windows]  > git config remote.origin.url https://github.com/pharo-project/opensmalltalk-vm.git # timeout=10
[windows] Fetching upstream changes from https://github.com/pharo-project/opensmalltalk-vm.git
[windows] using GIT_ASKPASS to set credentials pharo-ci GitHub account
[windows]  > git fetch --tags --progress https://github.com/pharo-project/opensmalltalk-vm.git +refs/heads/headless:refs/remotes/origin/headless --depth=2
[osx] Linking CXX executable build/vm/Pharo
[osx] [ 75%] Built target Pharo
[osx] Scanning dependencies of target SDL2-2.0.7
[osx] [ 76%] Generating build/third-party/SDL2-2.0.7.zip
[osx] --2019-08-12 23:33:52--  https://files.pharo.org/vm/pharo-spur64/mac/third-party/SDL2-2.0.7.zip
[osx] Resolving files.pharo.org... 164.132.235.17, 2001:41d0:301::23
[osx] Connecting to files.pharo.org|164.132.235.17|:443... connected.
[osx] HTTP request sent, awaiting response... 200 OK
[osx] Length: 961356 (939K) [application/zip]
[osx] Saving to: 'SDL2-2.0.7.zip'
[osx] 
[osx]      0K .......... .......... .......... .......... ..........  5% 2.26M 0s
[osx]     50K .......... .......... .......... .......... .......... 10% 7.21M 0s
[osx]    100K .......... .......... .......... .......... .......... 15% 45.9M 0s
[osx]    150K .......... .......... .......... .......... .......... 21% 11.7M 0s
[osx]    200K .......... .......... .......... .......... .......... 26% 15.7M 0s
[osx]    250K .......... .......... .......... .......... .......... 31% 16.0M 0s
[osx]    300K .......... .......... .......... .......... .......... 37% 14.6M 0s
[osx]    350K .......... .......... .......... .......... .......... 42% 13.8M 0s
[osx]    400K .......... .......... .......... .......... .......... 47% 10.6M 0s
[osx]    450K .......... .......... .......... .......... .......... 53% 8.43M 0s
[osx]    500K .......... .......... .......... .......... .......... 58% 20.6M 0s
[osx]    550K .......... .......... .......... .......... .......... 63% 18.1M 0s
[osx]    600K .......... .......... .......... .......... .......... 69% 17.6M 0s
[osx]    650K .......... .......... .......... .......... .......... 74% 19.8M 0s
[osx]    700K .......... .......... .......... .......... .......... 79% 37.2M 0s
[osx]    750K .......... .......... .......... .......... .......... 85% 16.9M 0s
[osx]    800K .......... .......... .......... .......... .......... 90% 21.1M 0s
[osx]    850K .......... .......... .......... .......... .......... 95% 14.7M 0s
[osx]    900K .......... .......... .......... ........             100% 25.0M=0.08s
[osx] 
[osx] 2019-08-12 23:33:53 (11.7 MB/s) - 'SDL2-2.0.7.zip' saved [961356/961356]
[osx] 
[osx] [ 76%] Generating build/third-party/SDL2-2.0.7.done
[osx] Archive:  SDL2-2.0.7.zip
[osx]   inflating: /builds/workspace/pharo-vm_headless/build/vm/libSDL2-2.0.0.dylib  
[osx]   inflating: /builds/workspace/pharo-vm_headless/build/vm/libSDL2.dylib  
[osx] [ 76%] Built target SDL2-2.0.7
[osx] Scanning dependencies of target SecurityPlugin
[osx] [ 77%] Building C object CMakeFiles/SecurityPlugin.dir/plugins/SecurityPlugin/common/DummySecurityPlugin.c.o
[osx] Linking C shared library build/vm/libSecurityPlugin.dylib
[osx] [ 77%] Built target SecurityPlugin
[osx] Scanning dependencies of target SocketPlugin
[osx] [ 78%] Building C object CMakeFiles/SocketPlugin.dir/extracted/plugins/SocketPlugin/src/common/SocketPlugin.c.o
[osx] /builds/workspace/pharo-vm_headless/extracted/plugins/SocketPlugin/src/common/SocketPlugin.c:2399:3: warning: pointer/integer type mismatch in conditional expression ('SocketPtr' (aka 'SQSocket *') and 'int') [-Wconditional-type-mismatch]
[osx]                 ? ((SocketPtr) (firstIndexableField(socketOop)))
[osx]                 ^ ~~~~~~~~~~~~~~~~~~~~~~~~~~~~~~~~~~~~~~~~~~~~~~
[osx] 1 warning generated.
[osx] [ 79%] Building C object CMakeFiles/SocketPlugin.dir/extracted/plugins/SocketPlugin/src/unix/sqUnixSocket.c.o
[windows] Checking out Revision 674b4bbf9cae0390f9e7dede34b29f9e25034d6c (headless)
[windows]  > git config core.sparsecheckout # timeout=10
[windows]  > git checkout -f 674b4bbf9cae0390f9e7dede34b29f9e25034d6c
[windows] Commit message: "Cleaning unused macros"
[Pipeline] [windows] }
[Pipeline] [windows] // stage
[osx] Linking C shared library build/vm/libSocketPlugin.dylib
[osx] [ 79%] Built target SocketPlugin
[Pipeline] [windows] stage
[Pipeline] [windows] { (Build-windows)
[osx] Scanning dependencies of target SqueakFFIPrims
[osx] [ 79%] Building C object CMakeFiles/SqueakFFIPrims.dir/extracted/plugins/SqueakFFIPrims/src/common/SqueakFFIPrims.c.o
[osx] In file included from /builds/workspace/pharo-vm_headless/extracted/plugins/SqueakFFIPrims/src/common/SqueakFFIPrims.c:23:
[osx] /builds/workspace/pharo-vm_headless/extracted/plugins/SqueakFFIPrims/src/common/X64SysVFFIPlugin.c:903:19: warning: incompatible pointer to integer conversion passing 'void *' to parameter of type 'sqInt' (aka 'long') [-Wint-conversion]
[osx]                         if (isInMemory(ptrAddress)) {
[osx]                                        ^~~~~~~~~~
[osx] /builds/workspace/pharo-vm_headless/extracted/plugins/SqueakFFIPrims/src/common/X64SysVFFIPlugin.c:1156:19: warning: incompatible pointer to integer conversion passing 'void *' to parameter of type 'sqInt' (aka 'long') [-Wint-conversion]
[osx]                         if (isInMemory(ptrAddress)) {
[osx]                                        ^~~~~~~~~~
[Pipeline] [windows] echo
[windows] Executing: #!c:\cygwin64\bin\bash --login
[windows]     cd `cygpath "E:\Builds\workspace\pharo-vm_headless"`
[windows]     set -ex
[windows]     cmake . -DWIN=1
[windows]     
[Pipeline] [windows] withEnv
[Pipeline] [windows] {
[osx] /builds/workspace/pharo-vm_headless/extracted/plugins/SqueakFFIPrims/src/common/X64SysVFFIPlugin.c:2984:18: warning: incompatible pointer to integer conversion passing 'void *' to parameter of type 'sqInt' (aka 'long') [-Wint-conversion]
[osx]                 if (isInMemory(ptrAddress)) {
[osx]                                ^~~~~~~~~~
[osx] /builds/workspace/pharo-vm_headless/extracted/plugins/SqueakFFIPrims/src/common/X64SysVFFIPlugin.c:3037:14: warning: incompatible integer to pointer conversion assigning to 'void *' from 'long' [-Wint-conversion]
[osx]                 ptrAddress = ((longAt(oop + BaseHeaderSize)) > 0
[osx]                            ^ ~~~~~~~~~~~~~~~~~~~~~~~~~~~~~~~~~~~
[osx] /builds/workspace/pharo-vm_headless/extracted/plugins/SqueakFFIPrims/src/common/X64SysVFFIPlugin.c:3277:18: warning: incompatible pointer to integer conversion passing 'void *' to parameter of type 'sqInt' (aka 'long') [-Wint-conversion]
[osx]                 if (isInMemory(ptrAddress)) {
[osx]                                ^~~~~~~~~~
[osx] /builds/workspace/pharo-vm_headless/extracted/plugins/SqueakFFIPrims/src/common/X64SysVFFIPlugin.c:3530:18: warning: incompatible pointer to integer conversion passing 'void *' to parameter of type 'sqInt' (aka 'long') [-Wint-conversion]
[osx]                 if (isInMemory(ptrAddress)) {
[osx]                                ^~~~~~~~~~
[osx] /builds/workspace/pharo-vm_headless/extracted/plugins/SqueakFFIPrims/src/common/X64SysVFFIPlugin.c:6596:21: warning: incompatible pointer types assigning to 'sqInt (*)(sqInt)' from 'sqInt (*)(int)' [-Wincompatible-pointer-types]
[osx]                 characterObjectOf = interpreterProxy->characterObjectOf;
[osx]                                   ^ ~~~~~~~~~~~~~~~~~~~~~~~~~~~~~~~~~~~
[Pipeline] [windows] sh
[osx] 7 warnings generated.
[osx] [ 80%] Building C object CMakeFiles/SqueakFFIPrims.dir/extracted/plugins/SqueakFFIPrims/src/common/sqManualSurface.c.o
[osx] [ 81%] Building C object CMakeFiles/SqueakFFIPrims.dir/extracted/plugins/SqueakFFIPrims/src/common/sqFFIPlugin.c.o
[windows] + cmake . -DWIN=1
[osx] [ 82%] Building C object CMakeFiles/SqueakFFIPrims.dir/extracted/plugins/SqueakFFIPrims/src/common/sqFFITestFuncs.c.o
[osx] Linking C shared library build/vm/libSqueakFFIPrims.dylib
[osx] [ 82%] Built target SqueakFFIPrims
[osx] Scanning dependencies of target SqueakSSL
[osx] [ 83%] Building C object CMakeFiles/SqueakSSL.dir/extracted/plugins/SqueakSSL/src/common/SqueakSSL.c.o
[osx] [ 83%] Building C object CMakeFiles/SqueakSSL.dir/extracted/plugins/SqueakSSL/src/osx/sqMacSSL.c.o
[osx] Linking C shared library build/vm/libSqueakSSL.dylib
[osx] [ 83%] Built target SqueakSSL
[osx] Scanning dependencies of target SurfacePlugin
[osx] [ 84%] Building C object CMakeFiles/SurfacePlugin.dir/extracted/plugins/SurfacePlugin/src/common/SurfacePlugin.c.o
[osx] /builds/workspace/pharo-vm_headless/extracted/plugins/SurfacePlugin/src/common/SurfacePlugin.c:135:3: warning: expression result unused [-Wunused-value]
[osx]                 -1;
[osx]                 ^~
[windows] -- 674b4bbf - Commit: 674b4bbf - Date: 2019-08-12 23:26:11 +0200
[windows] -- The C compiler identification is Clang 5.0.1
[windows] -- The CXX compiler identification is Clang 5.0.1
[windows] -- Check for working C compiler: /usr/bin/x86_64-w64-mingw32-clang
[osx] 1 warning generated.
[osx] Linking C shared library build/vm/libSurfacePlugin.dylib
[osx] [ 84%] Built target SurfacePlugin
[osx] Scanning dependencies of target UUIDPlugin
[osx] [ 85%] Building C object CMakeFiles/UUIDPlugin.dir/plugins/UUIDPlugin/common/UUIDPlugin.c.o
[osx] /builds/workspace/pharo-vm_headless/plugins/UUIDPlugin/common/UUIDPlugin.c:110:1: warning: control reaches end of non-void function [-Wreturn-type]
[osx] }
[osx] ^
[osx] 1 warning generated.
[osx] Linking C shared library build/vm/libUUIDPlugin.dylib
[osx] [ 85%] Built target UUIDPlugin
[osx] Scanning dependencies of target cairo-1.15.4
[osx] [ 86%] Generating build/third-party/cairo-1.15.4.zip
[osx] --2019-08-12 23:33:56--  https://files.pharo.org/vm/pharo-spur64/mac/third-party/cairo-1.15.4.zip
[osx] Resolving files.pharo.org... 164.132.235.17, 2001:41d0:301::23
[osx] Connecting to files.pharo.org|164.132.235.17|:443... connected.
[osx] HTTP request sent, awaiting response... 200 OK
[osx] Length: 1017920 (994K) [application/zip]
[osx] Saving to: 'cairo-1.15.4.zip'
[osx] 
[osx]      0K .......... .......... .......... .......... ..........  5% 4.05M 0s
[osx]     50K .......... .......... .......... .......... .......... 10% 7.90M 0s
[osx]    100K .......... .......... .......... .......... .......... 15% 32.8M 0s
[osx]    150K .......... .......... .......... .......... .......... 20% 12.2M 0s
[osx]    200K .......... .......... .......... .......... .......... 25% 18.5M 0s
[osx]    250K .......... .......... .......... .......... .......... 30% 9.57M 0s
[osx]    300K .......... .......... .......... .......... .......... 35% 27.2M 0s
[osx]    350K .......... .......... .......... .......... .......... 40% 23.4M 0s
[osx]    400K .......... .......... .......... .......... .......... 45% 12.3M 0s
[osx]    450K .......... .......... .......... .......... .......... 50% 20.9M 0s
[osx]    500K .......... .......... .......... .......... .......... 55% 34.1M 0s
[osx]    550K .......... .......... .......... .......... .......... 60% 14.0M 0s
[osx]    600K .......... .......... .......... .......... .......... 65% 27.3M 0s
[osx]    650K .......... .......... .......... .......... .......... 70% 17.7M 0s
[osx]    700K .......... .......... .......... .......... .......... 75% 26.8M 0s
[osx]    750K .......... .......... .......... .......... .......... 80% 12.3M 0s
[osx]    800K .......... .......... .......... .......... .......... 85% 19.3M 0s
[osx]    850K .......... .......... .......... .......... .......... 90%  101M 0s
[osx]    900K .......... .......... .......... .......... .......... 95% 29.5M 0s
[osx]    950K .......... .......... .......... .......... ....      100% 13.2M=0.06s
[osx] 
[osx] 2019-08-12 23:33:56 (15.0 MB/s) - 'cairo-1.15.4.zip' saved [1017920/1017920]
[osx] 
[osx] [ 87%] Generating build/third-party/cairo-1.15.4.done
[osx] Archive:  cairo-1.15.4.zip
[osx]   inflating: /builds/workspace/pharo-vm_headless/build/vm/libcairo.2.dylib  
[osx]   inflating: /builds/workspace/pharo-vm_headless/build/vm/libcairo.dylib  
[osx] [ 87%] Built target cairo-1.15.4
[osx] Scanning dependencies of target freetype-2.9.1
[osx] [ 88%] Generating build/third-party/freetype-2.9.1.zip
[osx] --2019-08-12 23:33:56--  https://files.pharo.org/vm/pharo-spur64/mac/third-party/freetype-2.9.1.zip
[osx] Resolving files.pharo.org... 164.132.235.17, 2001:41d0:301::23
[osx] Connecting to files.pharo.org|164.132.235.17|:443... connected.
[osx] HTTP request sent, awaiting response... 200 OK
[osx] Length: 744194 (727K) [application/zip]
[osx] Saving to: 'freetype-2.9.1.zip'
[osx] 
[osx]      0K .......... .......... .......... .......... ..........  6% 7.94M 0s
[osx]     50K .......... .......... .......... .......... .......... 13% 9.30M 0s
[osx]    100K .......... .......... .......... .......... .......... 20% 23.7M 0s
[osx]    150K .......... .......... .......... .......... .......... 27% 11.0M 0s
[osx]    200K .......... .......... .......... .......... .......... 34% 23.3M 0s
[osx]    250K .......... .......... .......... .......... .......... 41% 55.5M 0s
[osx]    300K .......... .......... .......... .......... .......... 48% 10.8M 0s
[osx]    350K .......... .......... .......... .......... .......... 55% 29.6M 0s
[osx]    400K .......... .......... .......... .......... .......... 61% 18.6M 0s
[osx]    450K .......... .......... .......... .......... .......... 68% 12.0M 0s
[osx]    500K .......... .......... .......... .......... .......... 75% 55.2M 0s
[osx]    550K .......... .......... .......... .......... .......... 82% 40.1M 0s
[osx]    600K .......... .......... .......... .......... .......... 89% 13.0M 0s
[osx]    650K .......... .......... .......... .......... .......... 96% 38.6M 0s
[osx]    700K .......... .......... ......                          100%  129M=0.04s
[osx] 
[osx] 2019-08-12 23:33:56 (17.3 MB/s) - 'freetype-2.9.1.zip' saved [744194/744194]
[osx] 
[osx] [ 88%] Generating build/third-party/freetype-2.9.1.done
[osx] Archive:  freetype-2.9.1.zip
[osx]   inflating: /builds/workspace/pharo-vm_headless/build/vm/libfreetype.6.dylib  
[osx]   inflating: /builds/workspace/pharo-vm_headless/build/vm/libfreetype.dylib  
[osx] [ 88%] Built target freetype-2.9.1
[osx] Scanning dependencies of target libffi-3.3-rc0
[osx] [ 89%] Generating build/third-party/libffi-3.3-rc0.zip
[osx] --2019-08-12 23:33:56--  https://files.pharo.org/vm/pharo-spur64/mac/third-party/libffi-3.3-rc0.zip
[osx] Resolving files.pharo.org... 164.132.235.17, 2001:41d0:301::23
[osx] Connecting to files.pharo.org|164.132.235.17|:443... connected.
[windows] -- Check for working C compiler: /usr/bin/x86_64-w64-mingw32-clang -- works
[windows] -- Detecting C compiler ABI info
[osx] HTTP request sent, awaiting response... 200 OK
[osx] Length: 16182 (16K) [application/zip]
[osx] Saving to: 'libffi-3.3-rc0.zip'
[osx] 
[osx]      0K .......... .....                                      100% 3.06M=0.005s
[osx] 
[osx] 2019-08-12 23:33:56 (3.06 MB/s) - 'libffi-3.3-rc0.zip' saved [16182/16182]
[osx] 
[osx] [ 90%] Generating build/third-party/libffi-3.3-rc0.done
[osx] Archive:  libffi-3.3-rc0.zip
[osx]   inflating: /builds/workspace/pharo-vm_headless/build/vm/libffi.7.dylib  
[osx] [ 90%] Built target libffi-3.3-rc0
[osx] Scanning dependencies of target libgit2-0.25.1
[osx] [ 90%] Generating build/third-party/libgit2-0.25.1.zip
[osx] --2019-08-12 23:33:57--  https://files.pharo.org/vm/pharo-spur64/mac/third-party/libgit2-0.25.1.zip
[osx] Resolving files.pharo.org... 164.132.235.17, 2001:41d0:301::23
[osx] Connecting to files.pharo.org|164.132.235.17|:443... connected.
[osx] HTTP request sent, awaiting response... 200 OK
[osx] Length: 1846137 (1.8M) [application/zip]
[osx] Saving to: 'libgit2-0.25.1.zip'
[osx] 
[osx]      0K .......... .......... .......... .......... ..........  2% 4.77M 0s
[osx]     50K .......... .......... .......... .......... ..........  5% 11.5M 0s
[osx]    100K .......... .......... .......... .......... ..........  8% 7.81M 0s
[osx]    150K .......... .......... .......... .......... .......... 11% 8.00M 0s
[osx]    200K .......... .......... .......... .......... .......... 13% 29.5M 0s
[osx]    250K .......... .......... .......... .......... .......... 16% 15.4M 0s
[osx]    300K .......... .......... .......... .......... .......... 19% 20.3M 0s
[osx]    350K .......... .......... .......... .......... .......... 22% 23.5M 0s
[osx]    400K .......... .......... .......... .......... .......... 24% 14.3M 0s
[osx]    450K .......... .......... .......... .......... .......... 27% 19.0M 0s
[osx]    500K .......... .......... .......... .......... .......... 30% 15.7M 0s
[osx]    550K .......... .......... .......... .......... .......... 33% 20.9M 0s
[osx]    600K .......... .......... .......... .......... .......... 36% 24.2M 0s
[osx]    650K .......... .......... .......... .......... .......... 38% 27.9M 0s
[osx]    700K .......... .......... .......... .......... .......... 41% 20.1M 0s
[osx]    750K .......... .......... .......... .......... .......... 44% 15.8M 0s
[osx]    800K .......... .......... .......... .......... .......... 47% 14.0M 0s
[osx]    850K .......... .......... .......... .......... .......... 49% 46.5M 0s
[osx]    900K .......... .......... .......... .......... .......... 52% 11.0M 0s
[osx]    950K .......... .......... .......... .......... .......... 55% 8.01M 0s
[osx]   1000K .......... .......... .......... .......... .......... 58% 3.88M 0s
[osx]   1050K .......... .......... .......... .......... .......... 61% 32.7M 0s
[osx]   1100K .......... .......... .......... .......... .......... 63% 59.8M 0s
[osx]   1150K .......... .......... .......... .......... .......... 66% 61.1M 0s
[osx]   1200K .......... .......... .......... .......... .......... 69% 61.9M 0s
[osx]   1250K .......... .......... .......... .......... .......... 72% 9.80M 0s
[osx]   1300K .......... .......... .......... .......... .......... 74% 46.5M 0s
[osx]   1350K .......... .......... .......... .......... .......... 77% 53.4M 0s
[osx]   1400K .......... .......... .......... .......... .......... 80% 16.5M 0s
[osx]   1450K .......... .......... .......... .......... .......... 83% 46.8M 0s
[osx]   1500K .......... .......... .......... .......... .......... 85% 18.4M 0s
[osx]   1550K .......... .......... .......... .......... .......... 88% 53.9M 0s
[osx]   1600K .......... .......... .......... .......... .......... 91% 14.2M 0s
[osx]   1650K .......... .......... .......... .......... .......... 94% 40.3M 0s
[osx]   1700K .......... .......... .......... .......... .......... 97% 51.0M 0s
[osx]   1750K .......... .......... .......... .......... .......... 99% 18.3M 0s
[osx]   1800K ..                                                    100% 51.9M=0.1s
[osx] 
[osx] 2019-08-12 23:33:57 (15.8 MB/s) - 'libgit2-0.25.1.zip' saved [1846137/1846137]
[osx] 
[osx] [ 91%] Generating build/third-party/libgit2-0.25.1.done
[osx] Archive:  libgit2-0.25.1.zip
[osx]   inflating: /builds/workspace/pharo-vm_headless/build/vm/libgit2.0.25.1.dylib  
[osx]   inflating: /builds/workspace/pharo-vm_headless/build/vm/libgit2.25.dylib  
[osx]   inflating: /builds/workspace/pharo-vm_headless/build/vm/libgit2.dylib  
[osx] [ 91%] Built target libgit2-0.25.1
[osx] Scanning dependencies of target libpng-1.2.49
[osx] [ 92%] Generating build/third-party/libpng-1.2.49.zip
[osx] --2019-08-12 23:33:57--  https://files.pharo.org/vm/pharo-spur64/mac/third-party/libpng-1.2.49.zip
[osx] Resolving files.pharo.org... 164.132.235.17, 2001:41d0:301::23
[osx] Connecting to files.pharo.org|164.132.235.17|:443... connected.
[osx] HTTP request sent, awaiting response... 200 OK
[osx] Length: 148996 (146K) [application/zip]
[osx] Saving to: 'libpng-1.2.49.zip'
[osx] 
[osx]      0K .......... .......... .......... .......... .......... 34% 4.33M 0s
[osx]     50K .......... .......... .......... .......... .......... 68% 9.41M 0s
[osx]    100K .......... .......... .......... .......... .....     100% 14.6M=0.02s
[osx] 
[osx] 2019-08-12 23:33:57 (7.29 MB/s) - 'libpng-1.2.49.zip' saved [148996/148996]
[osx] 
[osx] [ 93%] Generating build/third-party/libpng-1.2.49.done
[osx] Archive:  libpng-1.2.49.zip
[osx]   inflating: /builds/workspace/pharo-vm_headless/build/vm/libpng12.0.dylib  
[osx]   inflating: /builds/workspace/pharo-vm_headless/build/vm/libpng12.dylib  
[osx] [ 93%] Built target libpng-1.2.49
[osx] Scanning dependencies of target libssh2-1.7.0
[osx] [ 94%] Generating build/third-party/libssh2-1.7.0.zip
[osx] --2019-08-12 23:33:57--  https://files.pharo.org/vm/pharo-spur64/mac/third-party/libssh2-1.7.0.zip
[osx] Resolving files.pharo.org... 164.132.235.17, 2001:41d0:301::23
[osx] Connecting to files.pharo.org|164.132.235.17|:443... connected.
[osx] HTTP request sent, awaiting response... 200 OK
[osx] Length: 184746 (180K) [application/zip]
[osx] Saving to: 'libssh2-1.7.0.zip'
[osx] 
[osx]      0K .......... .......... .......... .......... .......... 27% 5.13M 0s
[osx]     50K .......... .......... .......... .......... .......... 55% 7.01M 0s
[osx]    100K .......... .......... .......... .......... .......... 83% 21.2M 0s
[osx]    150K .......... .......... ..........                      100% 21.3M=0.02s
[osx] 
[osx] 2019-08-12 23:33:57 (8.73 MB/s) - 'libssh2-1.7.0.zip' saved [184746/184746]
[osx] 
[osx] [ 95%] Generating build/third-party/libssh2-1.7.0.done
[osx] Archive:  libssh2-1.7.0.zip
[osx]   inflating: /builds/workspace/pharo-vm_headless/build/vm/libssh2.1.dylib  
[osx]   inflating: /builds/workspace/pharo-vm_headless/build/vm/libssh2.dylib  
[osx] [ 95%] Built target libssh2-1.7.0
[osx] Scanning dependencies of target openssl-1.0.2q
[osx] [ 96%] Generating build/third-party/openssl-1.0.2q.zip
[osx] --2019-08-12 23:33:57--  https://files.pharo.org/vm/pharo-spur64/mac/third-party/openssl-1.0.2q.zip
[osx] Resolving files.pharo.org... 164.132.235.17, 2001:41d0:301::23
[osx] Connecting to files.pharo.org|164.132.235.17|:443... connected.
[osx] HTTP request sent, awaiting response... 200 OK
[osx] Length: 1343688 (1.3M) [application/zip]
[osx] Saving to: 'openssl-1.0.2q.zip'
[osx] 
[osx]      0K .......... .......... .......... .......... ..........  3% 4.22M 0s
[windows] -- Detecting C compiler ABI info - done
[windows] -- Detecting C compile features
[osx]     50K .......... .......... .......... .......... ..........  7% 7.60M 0s
[osx]    100K .......... .......... .......... .......... .......... 11% 30.1M 0s
[osx]    150K .......... .......... .......... .......... .......... 15% 12.6M 0s
[osx]    200K .......... .......... .......... .......... .......... 19% 16.0M 0s
[osx]    250K .......... .......... .......... .......... .......... 22% 17.9M 0s
[osx]    300K .......... .......... .......... .......... .......... 26% 13.0M 0s
[osx]    350K .......... .......... .......... .......... .......... 30% 8.77M 0s
[osx]    400K .......... .......... .......... .......... .......... 34% 36.3M 0s
[osx]    450K .......... .......... .......... .......... .......... 38% 14.0M 0s
[osx]    500K .......... .......... .......... .......... .......... 41% 19.0M 0s
[osx]    550K .......... .......... .......... .......... .......... 45% 16.9M 0s
[osx]    600K .......... .......... .......... .......... .......... 49% 18.8M 0s
[osx]    650K .......... .......... .......... .......... .......... 53% 70.8M 0s
[osx]    700K .......... .......... .......... .......... .......... 57% 24.1M 0s
[osx]    750K .......... .......... .......... .......... .......... 60% 12.5M 0s
[osx]    800K .......... .......... .......... .......... .......... 64% 18.8M 0s
[osx]    850K .......... .......... .......... .......... .......... 68% 7.84M 0s
[osx]    900K .......... .......... .......... .......... .......... 72% 6.51M 0s
[osx]    950K .......... .......... .......... .......... .......... 76% 5.63M 0s
[osx]   1000K .......... .......... .......... .......... .......... 80% 20.4M 0s
[osx]   1050K .......... .......... .......... .......... .......... 83% 64.0M 0s
[osx]   1100K .......... .......... .......... .......... .......... 87% 11.1M 0s
[osx]   1150K .......... .......... .......... .......... .......... 91% 8.81M 0s
[osx]   1200K .......... .......... .......... .......... .......... 95% 36.6M 0s
[osx]   1250K .......... .......... .......... .......... .......... 99% 23.6M 0s
[osx]   1300K .......... ..                                         100% 22.6M=0.1s
[osx] 
[osx] 2019-08-12 23:33:58 (12.8 MB/s) - 'openssl-1.0.2q.zip' saved [1343688/1343688]
[osx] 
[osx] [ 96%] Generating build/third-party/openssl-1.0.2q.done
[osx] Archive:  openssl-1.0.2q.zip
[osx]   inflating: /builds/workspace/pharo-vm_headless/build/vm/libssl.1.0.0.dylib  
[osx]   inflating: /builds/workspace/pharo-vm_headless/build/vm/libssl.dylib  
[osx]   inflating: /builds/workspace/pharo-vm_headless/build/vm/libcrypto.1.0.0.dylib  
[osx] [ 96%] Built target openssl-1.0.2q
[osx] Scanning dependencies of target pixman-0.34.0
[osx] [ 97%] Generating build/third-party/pixman-0.34.0.zip
[osx] --2019-08-12 23:33:58--  https://files.pharo.org/vm/pharo-spur64/mac/third-party/pixman-0.34.0.zip
[osx] Resolving files.pharo.org... 164.132.235.17, 2001:41d0:301::23
[osx] Connecting to files.pharo.org|164.132.235.17|:443... connected.
[osx] HTTP request sent, awaiting response... 200 OK
[osx] Length: 1343558 (1.3M) [application/zip]
[osx] Saving to: 'pixman-0.34.0.zip'
[osx] 
[osx]      0K .......... .......... .......... .......... ..........  3% 3.87M 0s
[osx]     50K .......... .......... .......... .......... ..........  7% 9.72M 0s
[osx]    100K .......... .......... .......... .......... .......... 11% 6.78M 0s
[osx]    150K .......... .......... .......... .......... .......... 15% 13.4M 0s
[osx]    200K .......... .......... .......... .......... .......... 19% 24.8M 0s
[osx]    250K .......... .......... .......... .......... .......... 22% 14.7M 0s
[osx]    300K .......... .......... .......... .......... .......... 26% 10.8M 0s
[osx]    350K .......... .......... .......... .......... .......... 30% 26.8M 0s
[osx]    400K .......... .......... .......... .......... .......... 34% 6.68M 0s
[osx]    450K .......... .......... .......... .......... .......... 38% 8.30M 0s
[osx]    500K .......... .......... .......... .......... .......... 41% 13.2M 0s
[osx]    550K .......... .......... .......... .......... .......... 45% 15.6M 0s
[osx]    600K .......... .......... .......... .......... .......... 49% 24.4M 0s
[osx]    650K .......... .......... .......... .......... .......... 53% 25.3M 0s
[osx]    700K .......... .......... .......... .......... .......... 57% 22.0M 0s
[osx]    750K .......... .......... .......... .......... .......... 60% 29.5M 0s
[osx]    800K .......... .......... .......... .......... .......... 64% 13.6M 0s
[osx]    850K .......... .......... .......... .......... .......... 68% 20.4M 0s
[osx]    900K .......... .......... .......... .......... .......... 72% 32.8M 0s
[osx]    950K .......... .......... .......... .......... .......... 76% 27.4M 0s
[osx]   1000K .......... .......... .......... .......... .......... 80% 14.2M 0s
[osx]   1050K .......... .......... .......... .......... .......... 83% 17.9M 0s
[osx]   1100K .......... .......... .......... .......... .......... 87% 30.2M 0s
[osx]   1150K .......... .......... .......... .......... .......... 91% 19.8M 0s
[osx]   1200K .......... .......... .......... .......... .......... 95% 16.1M 0s
[osx]   1250K .......... .......... .......... .......... .......... 99% 22.5M 0s
[osx]   1300K .......... ..                                         100% 3.80M=0.1s
[osx] 
[osx] 2019-08-12 23:33:58 (13.4 MB/s) - 'pixman-0.34.0.zip' saved [1343558/1343558]
[osx] 
[osx] [ 98%] Generating build/third-party/pixman-0.34.0.done
[osx] Archive:  pixman-0.34.0.zip
[osx]   inflating: /builds/workspace/pharo-vm_headless/build/vm/libpixman-1.0.dylib  
[osx]   inflating: /builds/workspace/pharo-vm_headless/build/vm/libpixman-1.dylib  
[osx] [ 98%] Built target pixman-0.34.0
[osx] Scanning dependencies of target pthreadedPlugin-0.0.1
[osx] [ 99%] Generating build/third-party/pthreadedPlugin-0.0.1.zip
[osx] --2019-08-12 23:33:58--  https://files.pharo.org/vm/pharo-spur64/mac/third-party/pthreadedPlugin-0.0.1.zip
[osx] Resolving files.pharo.org... 164.132.235.17, 2001:41d0:301::23
[osx] Connecting to files.pharo.org|164.132.235.17|:443... connected.
[osx] HTTP request sent, awaiting response... 200 OK
[osx] Length: 438839 (429K) [application/zip]
[osx] Saving to: 'pthreadedPlugin-0.0.1.zip'
[osx] 
[osx]      0K .......... .......... .......... .......... .......... 11% 4.85M 0s
[osx]     50K .......... .......... .......... .......... .......... 23% 7.38M 0s
[osx]    100K .......... .......... .......... .......... .......... 35% 15.0M 0s
[osx]    150K .......... .......... .......... .......... .......... 46% 20.9M 0s
[osx]    200K .......... .......... .......... .......... .......... 58% 14.2M 0s
[osx]    250K .......... .......... .......... .......... .......... 70% 21.7M 0s
[osx]    300K .......... .......... .......... .......... .......... 81% 16.4M 0s
[osx]    350K .......... .......... .......... .......... .......... 93% 16.1M 0s
[osx]    400K .......... .......... ........                        100% 36.5M=0.03s
[osx] 
[osx] 2019-08-12 23:33:58 (12.0 MB/s) - 'pthreadedPlugin-0.0.1.zip' saved [438839/438839]
[osx] 
[osx] [100%] Generating build/third-party/pthreadedPlugin-0.0.1.done
[osx] Archive:  pthreadedPlugin-0.0.1.zip
[osx]   inflating: /builds/workspace/pharo-vm_headless/build/vm/cygffi-7.dll  
[osx]   inflating: /builds/workspace/pharo-vm_headless/build/vm/PThreadedPlugin.dll  
[osx]   inflating: /builds/workspace/pharo-vm_headless/build/vm/libPThreadedPlugin.dylib  
[osx] [100%] Built target pthreadedPlugin-0.0.1
[osx] Install the project...
[osx] -- Install configuration: ""
[osx] -- Installing: /builds/workspace/pharo-vm_headless/build/dist/Pharo.app/Contents/MacOS
[osx] -- Installing: /builds/workspace/pharo-vm_headless/build/dist/Pharo.app/Contents/MacOS/Pharo
[osx] -- Installing: /builds/workspace/pharo-vm_headless/build/dist/Pharo.app/Contents/MacOS/Plugins
[osx] -- Installing: /builds/workspace/pharo-vm_headless/build/dist/Pharo.app/Contents/MacOS/Plugins/libB2DPlugin.dylib
[osx] -- Installing: /builds/workspace/pharo-vm_headless/build/dist/Pharo.app/Contents/MacOS/Plugins/libBitBltPlugin.dylib
[osx] -- Installing: /builds/workspace/pharo-vm_headless/build/dist/Pharo.app/Contents/MacOS/Plugins/libcairo.2.dylib
[osx] -- Installing: /builds/workspace/pharo-vm_headless/build/dist/Pharo.app/Contents/MacOS/Plugins/libcairo.dylib
[osx] -- Installing: /builds/workspace/pharo-vm_headless/build/dist/Pharo.app/Contents/MacOS/Plugins/libcrypto.1.0.0.dylib
[osx] -- Installing: /builds/workspace/pharo-vm_headless/build/dist/Pharo.app/Contents/MacOS/Plugins/libDSAPrims.dylib
[osx] -- Installing: /builds/workspace/pharo-vm_headless/build/dist/Pharo.app/Contents/MacOS/Plugins/libffi.7.dylib
[osx] -- Installing: /builds/workspace/pharo-vm_headless/build/dist/Pharo.app/Contents/MacOS/Plugins/libFileAttributesPlugin.dylib
[osx] -- Installing: /builds/workspace/pharo-vm_headless/build/dist/Pharo.app/Contents/MacOS/Plugins/libFilePlugin.dylib
[osx] -- Installing: /builds/workspace/pharo-vm_headless/build/dist/Pharo.app/Contents/MacOS/Plugins/libfreetype.6.dylib
[osx] -- Installing: /builds/workspace/pharo-vm_headless/build/dist/Pharo.app/Contents/MacOS/Plugins/libfreetype.dylib
[osx] -- Installing: /builds/workspace/pharo-vm_headless/build/dist/Pharo.app/Contents/MacOS/Plugins/libgit2.0.25.1.dylib
[osx] -- Installing: /builds/workspace/pharo-vm_headless/build/dist/Pharo.app/Contents/MacOS/Plugins/libgit2.25.dylib
[osx] -- Installing: /builds/workspace/pharo-vm_headless/build/dist/Pharo.app/Contents/MacOS/Plugins/libgit2.dylib
[osx] -- Installing: /builds/workspace/pharo-vm_headless/build/dist/Pharo.app/Contents/MacOS/Plugins/libIA32ABI.dylib
[osx] -- Installing: /builds/workspace/pharo-vm_headless/build/dist/Pharo.app/Contents/MacOS/Plugins/libJPEGReaderPlugin.dylib
[osx] -- Installing: /builds/workspace/pharo-vm_headless/build/dist/Pharo.app/Contents/MacOS/Plugins/libJPEGReadWriter2Plugin.dylib
[osx] -- Installing: /builds/workspace/pharo-vm_headless/build/dist/Pharo.app/Contents/MacOS/Plugins/libLargeIntegers.dylib
[windows] -- Detecting C compile features - done
[windows] -- Check for working CXX compiler: /usr/bin/x86_64-w64-mingw32-clang++
[osx] -- Installing: /builds/workspace/pharo-vm_headless/build/dist/Pharo.app/Contents/MacOS/Plugins/libLocalePlugin.dylib
[osx] -- Installing: /builds/workspace/pharo-vm_headless/build/dist/Pharo.app/Contents/MacOS/Plugins/libMiscPrimitivePlugin.dylib
[osx] -- Installing: /builds/workspace/pharo-vm_headless/build/dist/Pharo.app/Contents/MacOS/Plugins/libPharoVMCore.dylib
[osx] -- Installing: /builds/workspace/pharo-vm_headless/build/dist/Pharo.app/Contents/MacOS/Plugins/libpixman-1.0.dylib
[osx] -- Installing: /builds/workspace/pharo-vm_headless/build/dist/Pharo.app/Contents/MacOS/Plugins/libpixman-1.dylib
[osx] -- Installing: /builds/workspace/pharo-vm_headless/build/dist/Pharo.app/Contents/MacOS/Plugins/libpng12.0.dylib
[osx] -- Installing: /builds/workspace/pharo-vm_headless/build/dist/Pharo.app/Contents/MacOS/Plugins/libpng12.dylib
[osx] -- Installing: /builds/workspace/pharo-vm_headless/build/dist/Pharo.app/Contents/MacOS/Plugins/libPThreadedPlugin.dylib
[osx] -- Installing: /builds/workspace/pharo-vm_headless/build/dist/Pharo.app/Contents/MacOS/Plugins/libSDL2-2.0.0.dylib
[osx] -- Installing: /builds/workspace/pharo-vm_headless/build/dist/Pharo.app/Contents/MacOS/Plugins/libSDL2.dylib
[osx] -- Installing: /builds/workspace/pharo-vm_headless/build/dist/Pharo.app/Contents/MacOS/Plugins/libSecurityPlugin.dylib
[osx] -- Installing: /builds/workspace/pharo-vm_headless/build/dist/Pharo.app/Contents/MacOS/Plugins/libSocketPlugin.dylib
[osx] -- Installing: /builds/workspace/pharo-vm_headless/build/dist/Pharo.app/Contents/MacOS/Plugins/libSqueakFFIPrims.dylib
[osx] -- Installing: /builds/workspace/pharo-vm_headless/build/dist/Pharo.app/Contents/MacOS/Plugins/libSqueakSSL.dylib
[osx] -- Installing: /builds/workspace/pharo-vm_headless/build/dist/Pharo.app/Contents/MacOS/Plugins/libssh2.1.dylib
[osx] -- Installing: /builds/workspace/pharo-vm_headless/build/dist/Pharo.app/Contents/MacOS/Plugins/libssh2.dylib
[osx] -- Installing: /builds/workspace/pharo-vm_headless/build/dist/Pharo.app/Contents/MacOS/Plugins/libssl.1.0.0.dylib
[osx] -- Installing: /builds/workspace/pharo-vm_headless/build/dist/Pharo.app/Contents/MacOS/Plugins/libssl.dylib
[osx] -- Installing: /builds/workspace/pharo-vm_headless/build/dist/Pharo.app/Contents/MacOS/Plugins/libSurfacePlugin.dylib
[osx] -- Installing: /builds/workspace/pharo-vm_headless/build/dist/Pharo.app/Contents/MacOS/Plugins/libUUIDPlugin.dylib
[osx] -- Installing: /builds/workspace/pharo-vm_headless/build/dist/Pharo.app/Contents/Info.plist
[osx] -- Installing: /builds/workspace/pharo-vm_headless/build/dist/Pharo.app/Contents/Resources/Pharo.icns
[osx] -- Installing: /builds/workspace/pharo-vm_headless/build/dist/include/sq.h
[osx] -- Installing: /builds/workspace/pharo-vm_headless/build/dist/include/sqMemoryAccess.h
[osx] -- Installing: /builds/workspace/pharo-vm_headless/build/dist/include/sqVirtualMachine.h
[osx] -- Installing: /builds/workspace/pharo-vm_headless/build/dist/include/interp.h
[osx] -- Installing: /builds/workspace/pharo-vm_headless/build/dist/include/vmCallback.h
[osx] -- Up-to-date: /builds/workspace/pharo-vm_headless/build/dist/include/interp.h
[windows] -- Check for working CXX compiler: /usr/bin/x86_64-w64-mingw32-clang++ -- works
[windows] -- Detecting CXX compiler ABI info
[Pipeline] [osx] sh
[windows] -- Detecting CXX compiler ABI info - done
[windows] -- Detecting CXX compile features
[osx] + make package
[osx] [ 17%] Built target PharoVMCore
[osx] [ 17%] Built target B2DPlugin
[osx] [ 18%] Built target BitBltPlugin
[osx] [ 19%] Built target DSAPrims
[osx] [ 23%] Built target FilePlugin
[osx] [ 25%] Built target FileAttributesPlugin
[osx] [ 28%] Built target IA32ABI
[osx] [ 69%] Built target JPEGReadWriter2Plugin
[osx] [ 70%] Built target JPEGReaderPlugin
[osx] [ 71%] Built target LargeIntegers
[osx] [ 72%] Built target LocalePlugin
[osx] [ 73%] Built target MiscPrimitivePlugin
[osx] [ 75%] Built target Pharo
[osx] [ 76%] Built target SDL2-2.0.7
[osx] [ 77%] Built target SecurityPlugin
[osx] [ 79%] Built target SocketPlugin
[osx] [ 82%] Built target SqueakFFIPrims
[osx] [ 83%] Built target SqueakSSL
[osx] [ 84%] Built target SurfacePlugin
[osx] [ 85%] Built target UUIDPlugin
[osx] [ 87%] Built target cairo-1.15.4
[osx] [ 88%] Built target freetype-2.9.1
[osx] [ 90%] Built target libffi-3.3-rc0
[osx] [ 91%] Built target libgit2-0.25.1
[osx] [ 93%] Built target libpng-1.2.49
[osx] [ 95%] Built target libssh2-1.7.0
[osx] [ 96%] Built target openssl-1.0.2q
[osx] [ 98%] Built target pixman-0.34.0
[osx] [100%] Built target pthreadedPlugin-0.0.1
[osx] Run CPack packaging tool...
[osx] CPack: Create package using ZIP
[osx] CPack: Install projects
[osx] CPack: - Run preinstall target for: PharoVM
[windows] -- Detecting CXX compile features - done
[windows] -- Building for WINDOWS
[windows] -- Looking for sys/types.h
[windows] -- Looking for sys/types.h - found
[windows] -- Looking for stdint.h
[osx] CPack: - Install project: PharoVM
[osx] CPack: -   Install component: bin
[windows] -- Looking for stdint.h - found
[windows] -- Looking for stddef.h
[osx] CPack: -   Install component: include
[osx] CPack: Create package
[windows] -- Looking for stddef.h - found
[windows] -- Check size of int
[windows] -- Check size of int - done
[windows] -- Check size of long
[windows] -- Check size of long - done
[windows] -- Check size of long long
[windows] -- Check size of long long - done
[windows] -- Check size of void*
[osx] CPack: - package: /builds/workspace/pharo-vm_headless/build/packages/PharoVM-8.1.0-674b4bb-mac64-bin.zip generated.
[osx] CPack: - package: /builds/workspace/pharo-vm_headless/build/packages/PharoVM-8.1.0-674b4bb-mac64-include.zip generated.
[Pipeline] [osx] stash
[windows] -- Check size of void* - done
[windows] -- int 4
[windows] -- long 4
[windows] -- long long 8
[windows] -- void* 8
[windows] -- Looking for include file dirent.h
[windows] -- Looking for include file dirent.h - found
[windows] -- Looking for include file features.h
[windows] -- Looking for include file features.h - not found
[windows] -- Looking for include file unistd.h
[osx] Stashed 2 file(s)
[Pipeline] [osx] archiveArtifacts
[windows] -- Looking for include file unistd.h - found
[windows] -- Looking for include file ndir.h
[windows] -- Looking for include file ndir.h - not found
[windows] -- Looking for include file sys/ndir.h
[windows] -- Looking for include file sys/ndir.h - not found
[windows] -- Looking for include file sys/dir.h
[osx] Archiving artifacts
[windows] -- Looking for include file sys/dir.h - not found
[windows] -- Looking for include file sys/filio.h
[Pipeline] [osx] }
[Pipeline] [osx] // stage
[Pipeline] [osx] }
[Pipeline] [osx] // timeout
[windows] -- Looking for include file sys/filio.h - not found
[windows] -- Looking for include file sys/time.h
[Pipeline] [osx] }
[Pipeline] [osx] // node
[Pipeline] [osx] }
[windows] -- Looking for include file sys/time.h - found
[windows] -- Looking for include file dlfcn.h
[windows] -- Looking for include file dlfcn.h - not found
[windows] -- Looking for dlopen in dl
[windows] -- Looking for dlopen in dl - not found
[windows] -- Looking for dlopen in dyld
[windows] -- Looking for dlopen in dyld - not found
[windows] -- Performing Test HAVE_TM_GMTOFF
[windows] -- Performing Test HAVE_TM_GMTOFF - Failed
[windows] -- Looking for include file sys/uuid.h
[windows] -- Looking for include file sys/uuid.h - not found
[windows] -- Looking for include file uuid/uuid.h
[windows] -- Looking for include file uuid/uuid.h - not found
[windows] -- Looking for include file uuid.h
[windows] -- Looking for include file uuid.h - not found
[windows] -- Looking for uuidgen in uuid
[windows] -- Looking for uuidgen in uuid - not found
[windows] -- Looking for uuid_generate in uuid
[windows] -- Looking for uuid_generate in uuid - not found
[windows] -- C Compiler: /usr/bin/x86_64-w64-mingw32-clang
[windows] -- C++ Compiler: /usr/bin/x86_64-w64-mingw32-clang++
[windows] -- Resource Compiler: x86_64-w64-mingw32-windres
[windows] -- Adding plugin: SecurityPlugin
[windows] -- Adding plugin: FilePlugin
[windows] -- Adding plugin: FileAttributesPlugin
[windows] -- Adding plugin: UUIDPlugin
[windows] -- Adding plugin: SocketPlugin
[windows] -- Adding plugin: SurfacePlugin
[windows] -- Adding plugin: LargeIntegers
[windows] -- Adding plugin: JPEGReaderPlugin
[windows] -- Adding plugin: JPEGReadWriter2Plugin
[windows] -- Adding plugin: MiscPrimitivePlugin
[windows] -- Adding plugin: B2DPlugin
[windows] -- Adding plugin: LocalePlugin
[windows] -- Adding plugin: SqueakSSL
[windows] -- Adding plugin: DSAPrims
[windows] Adding third-party libraries for win: pixman-0.34.0
[windows] Adding third-party libraries for win: cairo-1.15.4
[windows] Adding third-party libraries for win: freetype-2.9.1
[windows] Adding third-party libraries for win: libffi-3.3-rc0
[windows] Adding third-party libraries for win: libgit2-0.25.1
[windows] Adding third-party libraries for win: libpng-1.6.34
[windows] Adding third-party libraries for win: libssh2-1.7.0
[windows] Adding third-party libraries for win: openssl-1.0.2q
[windows] Adding third-party libraries for win: gcc-runtime-3.4
[windows] Adding third-party libraries for win: zlib-1.2.11
[windows] Adding third-party libraries for win: SDL2-2.0.5
[windows] Adding third-party libraries for win: pthreadedPlugin-0.0.1
[windows] -- Configuring done
[windows] -- Generating done
[windows] -- Build files have been written to: /cygdrive/e/Builds/workspace/pharo-vm_headless
[Pipeline] [windows] }
[Pipeline] [windows] // withEnv
[Pipeline] [windows] echo
[windows] Executing: #!c:\cygwin64\bin\bash --login
[windows]     cd `cygpath "E:\Builds\workspace\pharo-vm_headless"`
[windows]     set -ex
[windows]     make install
[windows]     
[Pipeline] [windows] withEnv
[Pipeline] [windows] {
[Pipeline] [windows] sh
[windows] + make install
[windows] [  0%] Downloading Pharo 70
[windows] --2019-08-12 21:34:22--  http://get.pharo.org/64/70
[windows] Resolving get.pharo.org... 164.132.235.17
[windows] Connecting to get.pharo.org|164.132.235.17|:80... connected.
[windows] HTTP request sent, awaiting response... 200 OK
[windows] Length: 3244 (3.2K) [application/octet-stream]
[windows] Saving to: “STDOUT�
[windows] 
[windows]      0K ...                                                   100% 7.65M=0s
[windows] 
[windows] 2019-08-12 21:34:22 (7.65 MB/s) - written to stdout [3244/3244]
[windows] 
[windows] Downloading the latest 70 Image:
[windows]     http://files.pharo.org/get-files/70/pharo64.zip
[windows] Pharo.image
[windows] --2019-08-12 21:34:25--  http://get.pharo.org/64/vm70
[windows] Resolving get.pharo.org... 164.132.235.17
[windows] Connecting to get.pharo.org|164.132.235.17|:80... connected.
[windows] HTTP request sent, awaiting response... 200 OK
[windows] Length: 5320 (5.2K) [application/octet-stream]
[windows] Saving to: “STDOUT�
[windows] 
[windows]      0K .....                                                 100% 12.1M=0s
[windows] 
[windows] 2019-08-12 21:34:25 (12.1 MB/s) - written to stdout [5320/5320]
[windows] 
[windows] Downloading the latest pharoVM:
[windows] 	http://files.pharo.org/get-files/70/pharo64-win-stable.zip
[windows] pharo-vm/PharoConsole.exe
[windows] Creating starter scripts pharo and pharo-ui
[windows] [  1%] Generating VMMaker image
[windows] FileDoesNotExistException: '/cygdrive/e/Builds/workspace/pharo-vm_headless/scripts/installVMMaker.st'
[windows] File>>openForWrite:
[windows] File>>openForRead
[windows] File>>readStream
[windows] File>>readStreamDo:
[windows] STCommandLineHandler>>installSourceFile:
[windows] [ :reference | self installSourceFile: reference ] in [ sourceFiles do: [ :reference | self installSourceFile: reference ] ] in STCommandLineHandler>>installSourceFiles in Block: [ :reference | self installSourceFile: reference ]...etc...
[windows] OrderedCollection>>do:
[windows] [ sourceFiles do: [ :reference | self installSourceFile: reference ] ] in STCommandLineHandler>>installSourceFiles in Block: [ sourceFiles do: [ :reference | self installSourc...etc...
[windows] BlockClosure>>ensure:
[windows] STCommandLineHandler>>installSourceFiles
[windows] STCommandLineHandler>>activate
[windows] STCommandLineHandler class(CommandLineHandler class)>>activateWith:
[windows] [ aCommandLinehandler activateWith: commandLine ] in PharoCommandLineHandler(BasicCommandLineHandler)>>activateSubCommand: in Block: [ aCommandLinehandler activateWith: commandLine ]
[windows] BlockClosure>>on:do:
[windows] PharoCommandLineHandler(BasicCommandLineHandler)>>activateSubCommand:
[windows] PharoCommandLineHandler(BasicCommandLineHandler)>>handleSubcommand
[windows] PharoCommandLineHandler(BasicCommandLineHandler)>>handleArgument:
[windows] [ self
[windows] 	handleArgument:
[windows] 		(self arguments
[windows] 			ifEmpty: [ '' ]
[windows] 			ifNotEmpty: [ :arguments | arguments first ]) ] in [ [ self
[windows] 	handleArgument:
[windows] 		(self arguments
[windows] 			ifEmpty: [ '' ]
[windows] 			ifNotEmpty: [ :arguments | arguments first ]) ]
[windows] 	on: Exit
[windows] 	do: [ :exit | 
[windows] 		"If the command line is protected by password, we just exit the image because in non-headless mode the handleExit will let the image open. If the password protection is enabled, it is to avoid to let the access to the image."
[windows] 		self class commandLinePasswordManager hasPasswordSet
[windows] 			ifTrue: [ Smalltalk snapshot: false andQuit: true ].
[windows] 		^ self handleExit: exit ] ] in PharoCommandLineHandler(BasicCommandLineHandler)>>activate in Block: [ self...
[windows] BlockClosure>>on:do:
[windows] [ [ self
[windows] 	handleArgument:
[windows] 		(self arguments
[windows] 			ifEmpty: [ '' ]
[windows] 			ifNotEmpty: [ :arguments | arguments first ]) ]
[windows] 	on: Exit
[windows] 	do: [ :exit | 
[windows] 		"If the command line is protected by password, we just exit the image because in non-headless mode the handleExit will let the image open. If the password protection is enabled, it is to avoid to let the access to the image."
[windows] 		self class commandLinePasswordManager hasPasswordSet
[windows] 			ifTrue: [ Smalltalk snapshot: false andQuit: true ].
[windows] 		^ self handleExit: exit ] ] in PharoCommandLineHandler(BasicCommandLineHandler)>>activate in Block: [ [ self...
[windows] [ self value.
[windows] Processor terminateActive ] in BlockClosure>>newProcess in Block: [ self value....
[windows] make[2]: *** [CMakeFiles/PharoVMCore.dir/build.make:72: build/vmmaker/VMMaker.image] Error 1
[windows] make[1]: *** [CMakeFiles/Makefile2:474: CMakeFiles/PharoVMCore.dir/all] Error 2
[windows] make: *** [Makefile:150: all] Error 2
[Pipeline] [windows] }
[Pipeline] [windows] // withEnv
[Pipeline] [windows] }
[Pipeline] [windows] // stage
[Pipeline] [windows] }
[Pipeline] [windows] // timeout
[Pipeline] [windows] }
[Pipeline] [windows] // node
[Pipeline] [windows] }
[windows] Failed in branch windows
[Pipeline] // parallel
[Pipeline] End of Pipeline

GitHub has been notified of this commit’s build result

ERROR: cmake exited with error code 1

Finished: FAILURE