FailedConsole Output

Skipping 787 KB.. Full Log
(sqInt value)
[windows] ^
[windows] /cygdrive/e/Builds/workspace/pharo-vm_headless/repository/extracted/plugins/B2DPlugin/src/common/B2DPlugin.c:2700:1: warning: unused function 'destOffsetXGet' [-Wunused-function]
[windows] destOffsetXGet(void)
[windows] ^
[windows] /cygdrive/e/Builds/workspace/pharo-vm_headless/repository/extracted/plugins/B2DPlugin/src/common/B2DPlugin.c:2707:1: warning: unused function 'destOffsetXPut' [-Wunused-function]
[windows] destOffsetXPut(sqInt value)
[windows] ^
[windows] /cygdrive/e/Builds/workspace/pharo-vm_headless/repository/extracted/plugins/B2DPlugin/src/common/B2DPlugin.c:2714:1: warning: unused function 'destOffsetYGet' [-Wunused-function]
[windows] destOffsetYGet(void)
[windows] ^
[windows] /cygdrive/e/Builds/workspace/pharo-vm_headless/repository/extracted/plugins/B2DPlugin/src/common/B2DPlugin.c:2721:1: warning: unused function 'destOffsetYPut' [-Wunused-function]
[windows] destOffsetYPut(sqInt value)
[windows] ^
[windows] /cygdrive/e/Builds/workspace/pharo-vm_headless/repository/extracted/plugins/B2DPlugin/src/common/B2DPlugin.c:2766:1: warning: unused function 'drawWideEdgefrom' [-Wunused-function]
[windows] drawWideEdgefrom(sqInt edge, sqInt leftX)
[windows] ^
[windows] /cygdrive/e/Builds/workspace/pharo-vm_headless/repository/extracted/plugins/B2DPlugin/src/common/B2DPlugin.c:2813:1: warning: unused function 'edgeFillsInvalidate' [-Wunused-function]
[windows] edgeFillsInvalidate(sqInt edge)
[windows] ^
[windows] /cygdrive/e/Builds/workspace/pharo-vm_headless/repository/extracted/plugins/B2DPlugin/src/common/B2DPlugin.c:2824:1: warning: unused function 'edgeFillsValidate' [-Wunused-function]
[windows] edgeFillsValidate(sqInt edge)
[windows] ^
[windows] /cygdrive/e/Builds/workspace/pharo-vm_headless/repository/extracted/plugins/B2DPlugin/src/common/B2DPlugin.c:2835:1: warning: unused function 'edgeLeftFillOf' [-Wunused-function]
[windows] edgeLeftFillOf(sqInt edge)
[windows] ^
[windows] /cygdrive/e/Builds/workspace/pharo-vm_headless/repository/extracted/plugins/B2DPlugin/src/common/B2DPlugin.c:2842:1: warning: unused function 'edgeLeftFillOfput' [-Wunused-function]
[windows] edgeLeftFillOfput(sqInt edge, sqInt value)
[windows] ^
[windows] /cygdrive/e/Builds/workspace/pharo-vm_headless/repository/extracted/plugins/B2DPlugin/src/common/B2DPlugin.c:2849:1: warning: unused function 'edgeNumLinesOf' [-Wunused-function]
[windows] edgeNumLinesOf(sqInt edge)
[windows] ^
[windows] /cygdrive/e/Builds/workspace/pharo-vm_headless/repository/extracted/plugins/B2DPlugin/src/common/B2DPlugin.c:2856:1: warning: unused function 'edgeNumLinesOfput' [-Wunused-function]
[windows] edgeNumLinesOfput(sqInt edge, sqInt value)
[windows] ^
[windows] /cygdrive/e/Builds/workspace/pharo-vm_headless/repository/extracted/plugins/B2DPlugin/src/common/B2DPlugin.c:2863:1: warning: unused function 'edgeRightFillOf' [-Wunused-function]
[windows] edgeRightFillOf(sqInt edge)
[windows] ^
[windows] /cygdrive/e/Builds/workspace/pharo-vm_headless/repository/extracted/plugins/B2DPlugin/src/common/B2DPlugin.c:2870:1: warning: unused function 'edgeRightFillOfput' [-Wunused-function]
[windows] edgeRightFillOfput(sqInt edge, sqInt value)
[windows] ^
[windows] /cygdrive/e/Builds/workspace/pharo-vm_headless/repository/extracted/plugins/B2DPlugin/src/common/B2DPlugin.c:2877:1: warning: unused function 'edgeTransform' [-Wunused-function]
[windows] edgeTransform(void)
[windows] ^
[windows] /cygdrive/e/Builds/workspace/pharo-vm_headless/repository/extracted/plugins/B2DPlugin/src/common/B2DPlugin.c:2887:1: warning: unused function 'edgeTypeOf' [-Wunused-function]
[windows] edgeTypeOf(sqInt edge)
[windows] ^
[windows] /cygdrive/e/Builds/workspace/pharo-vm_headless/repository/extracted/plugins/B2DPlugin/src/common/B2DPlugin.c:2894:1: warning: unused function 'edgeXValueOf' [-Wunused-function]
[windows] edgeXValueOf(sqInt edge)
[windows] ^
[windows] /cygdrive/e/Builds/workspace/pharo-vm_headless/repository/extracted/plugins/B2DPlugin/src/common/B2DPlugin.c:2901:1: warning: unused function 'edgeXValueOfput' [-Wunused-function]
[windows] edgeXValueOfput(sqInt edge, sqInt value)
[windows] ^
[windows] /cygdrive/e/Builds/workspace/pharo-vm_headless/repository/extracted/plugins/B2DPlugin/src/common/B2DPlugin.c:2908:1: warning: unused function 'edgeYValueOf' [-Wunused-function]
[windows] edgeYValueOf(sqInt edge)
[windows] ^
[windows] /cygdrive/e/Builds/workspace/pharo-vm_headless/repository/extracted/plugins/B2DPlugin/src/common/B2DPlugin.c:2915:1: warning: unused function 'edgeYValueOfput' [-Wunused-function]
[windows] edgeYValueOfput(sqInt edge, sqInt value)
[windows] ^
[windows] /cygdrive/e/Builds/workspace/pharo-vm_headless/repository/extracted/plugins/B2DPlugin/src/common/B2DPlugin.c:2922:1: warning: unused function 'edgeZValueOf' [-Wunused-function]
[windows] edgeZValueOf(sqInt edge)
[windows] ^
[windows] /cygdrive/e/Builds/workspace/pharo-vm_headless/repository/extracted/plugins/B2DPlugin/src/common/B2DPlugin.c:2929:1: warning: unused function 'edgeZValueOfput' [-Wunused-function]
[windows] edgeZValueOfput(sqInt edge, sqInt value)
[windows] ^
[windows] /cygdrive/e/Builds/workspace/pharo-vm_headless/repository/extracted/plugins/B2DPlugin/src/common/B2DPlugin.c:2953:1: warning: unused function 'estimatedLengthOfwith' [-Wunused-function]
[windows] estimatedLengthOfwith(sqInt deltaX, sqInt deltaY)
[windows] ^
[windows] /cygdrive/e/Builds/workspace/pharo-vm_headless/repository/extracted/plugins/B2DPlugin/src/common/B2DPlugin.c:2983:1: warning: unused function 'fillAllFromto' [-Wunused-function]
[windows] fillAllFromto(sqInt leftX, sqInt rightX)
[windows] ^
[windows] /cygdrive/e/Builds/workspace/pharo-vm_headless/repository/extracted/plugins/B2DPlugin/src/common/B2DPlugin.c:3086:1: warning: unused function 'fillBitmapSpan' [-Wunused-function]
[windows] fillBitmapSpan(void)
[windows] ^
[windows] /cygdrive/e/Builds/workspace/pharo-vm_headless/repository/extracted/plugins/B2DPlugin/src/common/B2DPlugin.c:3866:1: warning: unused function 'fillColorSpanfromto' [-Wunused-function]
[windows] fillColorSpanfromto(sqInt pixelValue32, sqInt leftX, sqInt rightX)
[windows] ^
[windows] /cygdrive/e/Builds/workspace/pharo-vm_headless/repository/extracted/plugins/B2DPlugin/src/common/B2DPlugin.c:3896:1: warning: unused function 'fillDirectionXOf' [-Wunused-function]
[windows] fillDirectionXOf(sqInt fill)
[windows] ^
[windows] /cygdrive/e/Builds/workspace/pharo-vm_headless/repository/extracted/plugins/B2DPlugin/src/common/B2DPlugin.c:3903:1: warning: unused function 'fillDirectionXOfput' [-Wunused-function]
[windows] fillDirectionXOfput(sqInt fill, sqInt value)
[windows] ^
[windows] /cygdrive/e/Builds/workspace/pharo-vm_headless/repository/extracted/plugins/B2DPlugin/src/common/B2DPlugin.c:3910:1: warning: unused function 'fillDirectionYOf' [-Wunused-function]
[windows] fillDirectionYOf(sqInt fill)
[windows] ^
[windows] /cygdrive/e/Builds/workspace/pharo-vm_headless/repository/extracted/plugins/B2DPlugin/src/common/B2DPlugin.c:3917:1: warning: unused function 'fillDirectionYOfput' [-Wunused-function]
[windows] fillDirectionYOfput(sqInt fill, sqInt value)
[windows] ^
[windows] /cygdrive/e/Builds/workspace/pharo-vm_headless/repository/extracted/plugins/B2DPlugin/src/common/B2DPlugin.c:3924:1: warning: unused function 'fillLinearGradient' [-Wunused-function]
[windows] fillLinearGradient(void)
[windows] ^
[windows] /cygdrive/e/Builds/workspace/pharo-vm_headless/repository/extracted/plugins/B2DPlugin/src/common/B2DPlugin.c:4152:1: warning: unused function 'fillMaxXGet' [-Wunused-function]
[windows] fillMaxXGet(void)
[windows] ^
[windows] /cygdrive/e/Builds/workspace/pharo-vm_headless/repository/extracted/plugins/B2DPlugin/src/common/B2DPlugin.c:4159:1: warning: unused function 'fillMaxXPut' [-Wunused-function]
[windows] fillMaxXPut(sqInt value)
[windows] ^
[windows] /cygdrive/e/Builds/workspace/pharo-vm_headless/repository/extracted/plugins/B2DPlugin/src/common/B2DPlugin.c:4166:1: warning: unused function 'fillMaxYGet' [-Wunused-function]
[windows] fillMaxYGet(void)
[windows] ^
[windows] /cygdrive/e/Builds/workspace/pharo-vm_headless/repository/extracted/plugins/B2DPlugin/src/common/B2DPlugin.c:4173:1: warning: unused function 'fillMaxYPut' [-Wunused-function]
[windows] fillMaxYPut(sqInt value)
[windows] ^
[windows] /cygdrive/e/Builds/workspace/pharo-vm_headless/repository/extracted/plugins/B2DPlugin/src/common/B2DPlugin.c:4180:1: warning: unused function 'fillMinXGet' [-Wunused-function]
[windows] fillMinXGet(void)
[windows] ^
[windows] /cygdrive/e/Builds/workspace/pharo-vm_headless/repository/extracted/plugins/B2DPlugin/src/common/B2DPlugin.c:4187:1: warning: unused function 'fillMinXPut' [-Wunused-function]
[windows] fillMinXPut(sqInt value)
[windows] ^
[windows] /cygdrive/e/Builds/workspace/pharo-vm_headless/repository/extracted/plugins/B2DPlugin/src/common/B2DPlugin.c:4194:1: warning: unused function 'fillMinYGet' [-Wunused-function]
[windows] fillMinYGet(void)
[windows] ^
[windows] /cygdrive/e/Builds/workspace/pharo-vm_headless/repository/extracted/plugins/B2DPlugin/src/common/B2DPlugin.c:4201:1: warning: unused function 'fillMinYPut' [-Wunused-function]
[windows] fillMinYPut(sqInt value)
[windows] ^
[windows] /cygdrive/e/Builds/workspace/pharo-vm_headless/repository/extracted/plugins/B2DPlugin/src/common/B2DPlugin.c:4208:1: warning: unused function 'fillNormalXOf' [-Wunused-function]
[windows] fillNormalXOf(sqInt fill)
[windows] ^
[windows] /cygdrive/e/Builds/workspace/pharo-vm_headless/repository/extracted/plugins/B2DPlugin/src/common/B2DPlugin.c:4215:1: warning: unused function 'fillNormalXOfput' [-Wunused-function]
[windows] fillNormalXOfput(sqInt fill, sqInt value)
[windows] ^
[windows] /cygdrive/e/Builds/workspace/pharo-vm_headless/repository/extracted/plugins/B2DPlugin/src/common/B2DPlugin.c:4222:1: warning: unused function 'fillNormalYOf' [-Wunused-function]
[windows] fillNormalYOf(sqInt fill)
[windows] ^
[windows] /cygdrive/e/Builds/workspace/pharo-vm_headless/repository/extracted/plugins/B2DPlugin/src/common/B2DPlugin.c:4229:1: warning: unused function 'fillNormalYOfput' [-Wunused-function]
[windows] fillNormalYOfput(sqInt fill, sqInt value)
[windows] ^
[windows] /cygdrive/e/Builds/workspace/pharo-vm_headless/repository/extracted/plugins/B2DPlugin/src/common/B2DPlugin.c:4236:1: warning: unused function 'fillOffsetXGet' [-Wunused-function]
[windows] fillOffsetXGet(void)
[windows] ^
[windows] /cygdrive/e/Builds/workspace/pharo-vm_headless/repository/extracted/plugins/B2DPlugin/src/common/B2DPlugin.c:4243:1: warning: unused function 'fillOffsetXPut' [-Wunused-function]
[windows] fillOffsetXPut(sqInt value)
[windows] ^
[windows] /cygdrive/e/Builds/workspace/pharo-vm_headless/repository/extracted/plugins/B2DPlugin/src/common/B2DPlugin.c:4250:1: warning: unused function 'fillOffsetYGet' [-Wunused-function]
[windows] fillOffsetYGet(void)
[windows] ^
[windows] /cygdrive/e/Builds/workspace/pharo-vm_headless/repository/extracted/plugins/B2DPlugin/src/common/B2DPlugin.c:4257:1: warning: unused function 'fillOffsetYPut' [-Wunused-function]
[windows] fillOffsetYPut(sqInt value)
[windows] ^
[windows] /cygdrive/e/Builds/workspace/pharo-vm_headless/repository/extracted/plugins/B2DPlugin/src/common/B2DPlugin.c:4264:1: warning: unused function 'fillOriginXOf' [-Wunused-function]
[windows] fillOriginXOf(sqInt fill)
[windows] ^
[windows] /cygdrive/e/Builds/workspace/pharo-vm_headless/repository/extracted/plugins/B2DPlugin/src/common/B2DPlugin.c:4271:1: warning: unused function 'fillOriginXOfput' [-Wunused-function]
[windows] fillOriginXOfput(sqInt fill, sqInt value)
[windows] ^
[windows] /cygdrive/e/Builds/workspace/pharo-vm_headless/repository/extracted/plugins/B2DPlugin/src/common/B2DPlugin.c:4278:1: warning: unused function 'fillOriginYOf' [-Wunused-function]
[windows] fillOriginYOf(sqInt fill)
[windows] ^
[windows] /cygdrive/e/Builds/workspace/pharo-vm_headless/repository/extracted/plugins/B2DPlugin/src/common/B2DPlugin.c:4285:1: warning: unused function 'fillOriginYOfput' [-Wunused-function]
[windows] fillOriginYOfput(sqInt fill, sqInt value)
[windows] ^
[windows] /cygdrive/e/Builds/workspace/pharo-vm_headless/repository/extracted/plugins/B2DPlugin/src/common/B2DPlugin.c:4431:1: warning: unused function 'fillRadialDecreasingrampdeltaSTdsXdtXfromto' [-Wunused-function]
[windows] fillRadialDecreasingrampdeltaSTdsXdtXfromto(sqInt fill, sqInt ramp, sqInt deltaST, sqInt dsX, sqInt dtX, sqInt leftX, sqInt rightX)
[windows] ^
[windows] /cygdrive/e/Builds/workspace/pharo-vm_headless/repository/extracted/plugins/B2DPlugin/src/common/B2DPlugin.c:4477:1: warning: unused function 'fillRadialGradient' [-Wunused-function]
[windows] fillRadialGradient(void)
[windows] ^
[windows] /cygdrive/e/Builds/workspace/pharo-vm_headless/repository/extracted/plugins/B2DPlugin/src/common/B2DPlugin.c:4839:1: warning: unused function 'fillRadialIncreasingrampdeltaSTdsXdtXfromto' [-Wunused-function]
[windows] fillRadialIncreasingrampdeltaSTdsXdtXfromto(sqInt fill, sqInt ramp, sqInt deltaST, sqInt dsX, sqInt dtX, sqInt leftX, sqInt rightX)
[windows] ^
[windows] /cygdrive/e/Builds/workspace/pharo-vm_headless/repository/extracted/plugins/B2DPlugin/src/common/B2DPlugin.c:5011:1: warning: unused function 'fillTypeOf' [-Wunused-function]
[windows] fillTypeOf(sqInt fill)
[windows] ^
[windows] /cygdrive/e/Builds/workspace/pharo-vm_headless/repository/extracted/plugins/B2DPlugin/src/common/B2DPlugin.c:5018:1: warning: unused function 'findNextAETEdgeFrom' [-Wunused-function]
[windows] findNextAETEdgeFrom(sqInt leftEdge)
[windows] ^
[windows] /cygdrive/e/Builds/workspace/pharo-vm_headless/repository/extracted/plugins/B2DPlugin/src/common/B2DPlugin.c:5446:1: warning: unused function 'finishedProcessing' [-Wunused-function]
[windows] finishedProcessing(void)
[windows] ^
[windows] /cygdrive/e/Builds/workspace/pharo-vm_headless/repository/extracted/plugins/B2DPlugin/src/common/B2DPlugin.c:5453:1: warning: unused function 'firstPointListGet' [-Wunused-function]
[windows] firstPointListGet(void)
[windows] ^
[windows] /cygdrive/e/Builds/workspace/pharo-vm_headless/repository/extracted/plugins/B2DPlugin/src/common/B2DPlugin.c:5460:1: warning: unused function 'firstPointListPut' [-Wunused-function]
[windows] firstPointListPut(sqInt value)
[windows] ^
[windows] /cygdrive/e/Builds/workspace/pharo-vm_headless/repository/extracted/plugins/B2DPlugin/src/common/B2DPlugin.c:5467:1: warning: unused function 'freeStackFillEntry' [-Wunused-function]
[windows] freeStackFillEntry(void)
[windows] ^
[windows] /cygdrive/e/Builds/workspace/pharo-vm_headless/repository/extracted/plugins/B2DPlugin/src/common/B2DPlugin.c:5509:1: warning: unused function 'getStartGet' [-Wunused-function]
[windows] getStartGet(void)
[windows] ^
[windows] /cygdrive/e/Builds/workspace/pharo-vm_headless/repository/extracted/plugins/B2DPlugin/src/common/B2DPlugin.c:5516:1: warning: unused function 'getStartPut' [-Wunused-function]
[windows] getStartPut(sqInt value)
[windows] ^
[windows] /cygdrive/e/Builds/workspace/pharo-vm_headless/repository/extracted/plugins/B2DPlugin/src/common/B2DPlugin.c:5523:1: warning: unused function 'getUsedGet' [-Wunused-function]
[windows] getUsedGet(void)
[windows] ^
[windows] /cygdrive/e/Builds/workspace/pharo-vm_headless/repository/extracted/plugins/B2DPlugin/src/common/B2DPlugin.c:5530:1: warning: unused function 'getUsedPut' [-Wunused-function]
[windows] getUsedPut(sqInt value)
[windows] ^
[windows] /cygdrive/e/Builds/workspace/pharo-vm_headless/repository/extracted/plugins/B2DPlugin/src/common/B2DPlugin.c:5537:1: warning: unused function 'gradientRampLengthOf' [-Wunused-function]
[windows] gradientRampLengthOf(sqInt fill)
[windows] ^
[windows] /cygdrive/e/Builds/workspace/pharo-vm_headless/repository/extracted/plugins/B2DPlugin/src/common/B2DPlugin.c:5544:1: warning: unused function 'gradientRampLengthOfput' [-Wunused-function]
[windows] gradientRampLengthOfput(sqInt fill, sqInt value)
[windows] ^
[windows] /cygdrive/e/Builds/workspace/pharo-vm_headless/repository/extracted/plugins/B2DPlugin/src/common/B2DPlugin.c:5551:1: warning: unused function 'gradientRampOf' [-Wunused-function]
[windows] gradientRampOf(sqInt fill)
[windows] ^
[windows] /cygdrive/e/Builds/workspace/pharo-vm_headless/repository/extracted/plugins/B2DPlugin/src/common/B2DPlugin.c:5558:1: warning: unused function 'hasColorTransform' [-Wunused-function]
[windows] hasColorTransform(void)
[windows] ^
[windows] /cygdrive/e/Builds/workspace/pharo-vm_headless/repository/extracted/plugins/B2DPlugin/src/common/B2DPlugin.c:5565:1: warning: unused function 'hasColorTransformGet' [-Wunused-function]
[windows] hasColorTransformGet(void)
[windows] ^
[windows] /cygdrive/e/Builds/workspace/pharo-vm_headless/repository/extracted/plugins/B2DPlugin/src/common/B2DPlugin.c:5572:1: warning: unused function 'hasColorTransformPut' [-Wunused-function]
[windows] hasColorTransformPut(sqInt value)
[windows] ^
[windows] /cygdrive/e/Builds/workspace/pharo-vm_headless/repository/extracted/plugins/B2DPlugin/src/common/B2DPlugin.c:5579:1: warning: unused function 'hasEdgeTransform' [-Wunused-function]
[windows] hasEdgeTransform(void)
[windows] ^
[windows] /cygdrive/e/Builds/workspace/pharo-vm_headless/repository/extracted/plugins/B2DPlugin/src/common/B2DPlugin.c:5586:1: warning: unused function 'hasEdgeTransformGet' [-Wunused-function]
[windows] hasEdgeTransformGet(void)
[windows] ^
[windows] /cygdrive/e/Builds/workspace/pharo-vm_headless/repository/extracted/plugins/B2DPlugin/src/common/B2DPlugin.c:5593:1: warning: unused function 'hasEdgeTransformPut' [-Wunused-function]
[windows] hasEdgeTransformPut(sqInt value)
[windows] ^
[windows] /cygdrive/e/Builds/workspace/pharo-vm_headless/repository/extracted/plugins/B2DPlugin/src/common/B2DPlugin.c:5677:1: warning: unused function 'incrementPointby' [-Wunused-function]
[windows] incrementPointby(int *point, sqInt delta)
[windows] ^
[windows] /cygdrive/e/Builds/workspace/pharo-vm_headless/repository/extracted/plugins/B2DPlugin/src/common/B2DPlugin.c:5686:1: warning: unused function 'incrementStatby' [-Wunused-function]
[windows] incrementStatby(sqInt statIndex, sqInt value)
[windows] ^
[windows] /cygdrive/e/Builds/workspace/pharo-vm_headless/repository/extracted/plugins/B2DPlugin/src/common/B2DPlugin.c:5899:1: warning: unused function 'isBezier' [-Wunused-function]
[windows] isBezier(sqInt bezier)
[windows] ^
[windows] /cygdrive/e/Builds/workspace/pharo-vm_headless/repository/extracted/plugins/B2DPlugin/src/common/B2DPlugin.c:5919:1: warning: unused function 'isFillColor' [-Wunused-function]
[windows] isFillColor(sqInt fill)
[windows] ^
[windows] /cygdrive/e/Builds/workspace/pharo-vm_headless/repository/extracted/plugins/B2DPlugin/src/common/B2DPlugin.c:5938:1: warning: unused function 'isFill' [-Wunused-function]
[windows] isFill(sqInt fill)
[windows] ^
[windows] /cygdrive/e/Builds/workspace/pharo-vm_headless/repository/extracted/plugins/B2DPlugin/src/common/B2DPlugin.c:5946:1: warning: unused function 'isLine' [-Wunused-function]
[windows] isLine(sqInt line)
[windows] ^
[windows] /cygdrive/e/Builds/workspace/pharo-vm_headless/repository/extracted/plugins/B2DPlugin/src/common/B2DPlugin.c:5953:1: warning: unused function 'isObject' [-Wunused-function]
[windows] isObject(sqInt obj)
[windows] ^
[windows] /cygdrive/e/Builds/workspace/pharo-vm_headless/repository/extracted/plugins/B2DPlugin/src/common/B2DPlugin.c:5961:1: warning: unused function 'isRealFill' [-Wunused-function]
[windows] isRealFill(sqInt fill)
[windows] ^
[windows] /cygdrive/e/Builds/workspace/pharo-vm_headless/repository/extracted/plugins/B2DPlugin/src/common/B2DPlugin.c:5968:1: warning: unused function 'isStackEntry' [-Wunused-function]
[windows] isStackEntry(sqInt entry)
[windows] ^
[windows] /cygdrive/e/Builds/workspace/pharo-vm_headless/repository/extracted/plugins/B2DPlugin/src/common/B2DPlugin.c:5976:1: warning: unused function 'isStackIndex' [-Wunused-function]
[windows] isStackIndex(sqInt index)
[windows] ^
[windows] /cygdrive/e/Builds/workspace/pharo-vm_headless/repository/extracted/plugins/B2DPlugin/src/common/B2DPlugin.c:5984:1: warning: unused function 'isWideBezier' [-Wunused-function]
[windows] isWideBezier(sqInt bezier)
[windows] ^
[windows] /cygdrive/e/Builds/workspace/pharo-vm_headless/repository/extracted/plugins/B2DPlugin/src/common/B2DPlugin.c:5992:1: warning: unused function 'isWideLine' [-Wunused-function]
[windows] isWideLine(sqInt line)
[windows] ^
[windows] /cygdrive/e/Builds/workspace/pharo-vm_headless/repository/extracted/plugins/B2DPlugin/src/common/B2DPlugin.c:6000:1: warning: unused function 'isWide' [-Wunused-function]
[windows] isWide(sqInt object)
[windows] ^
[windows] /cygdrive/e/Builds/workspace/pharo-vm_headless/repository/extracted/plugins/B2DPlugin/src/common/B2DPlugin.c:6007:1: warning: unused function 'lastExportedEdgeGet' [-Wunused-function]
[windows] lastExportedEdgeGet(void)
[windows] ^
[windows] /cygdrive/e/Builds/workspace/pharo-vm_headless/repository/extracted/plugins/B2DPlugin/src/common/B2DPlugin.c:6014:1: warning: unused function 'lastExportedEdgePut' [-Wunused-function]
[windows] lastExportedEdgePut(sqInt value)
[windows] ^
[windows] /cygdrive/e/Builds/workspace/pharo-vm_headless/repository/extracted/plugins/B2DPlugin/src/common/B2DPlugin.c:6021:1: warning: unused function 'lastExportedFillGet' [-Wunused-function]
[windows] lastExportedFillGet(void)
[windows] ^
[windows] /cygdrive/e/Builds/workspace/pharo-vm_headless/repository/extracted/plugins/B2DPlugin/src/common/B2DPlugin.c:6028:1: warning: unused function 'lastExportedFillPut' [-Wunused-function]
[windows] lastExportedFillPut(sqInt value)
[windows] ^
[windows] /cygdrive/e/Builds/workspace/pharo-vm_headless/repository/extracted/plugins/B2DPlugin/src/common/B2DPlugin.c:6035:1: warning: unused function 'lastExportedLeftXGet' [-Wunused-function]
[windows] lastExportedLeftXGet(void)
[windows] ^
[windows] /cygdrive/e/Builds/workspace/pharo-vm_headless/repository/extracted/plugins/B2DPlugin/src/common/B2DPlugin.c:6042:1: warning: unused function 'lastExportedLeftXPut' [-Wunused-function]
[windows] lastExportedLeftXPut(sqInt value)
[windows] ^
[windows] /cygdrive/e/Builds/workspace/pharo-vm_headless/repository/extracted/plugins/B2DPlugin/src/common/B2DPlugin.c:6049:1: warning: unused function 'lastExportedRightXGet' [-Wunused-function]
[windows] lastExportedRightXGet(void)
[windows] ^
[windows] /cygdrive/e/Builds/workspace/pharo-vm_headless/repository/extracted/plugins/B2DPlugin/src/common/B2DPlugin.c:6056:1: warning: unused function 'lastExportedRightXPut' [-Wunused-function]
[windows] lastExportedRightXPut(sqInt value)
[windows] ^
[windows] /cygdrive/e/Builds/workspace/pharo-vm_headless/repository/extracted/plugins/B2DPlugin/src/common/B2DPlugin.c:6063:1: warning: unused function 'lineEndXOf' [-Wunused-function]
[windows] lineEndXOf(sqInt line)
[windows] ^
[windows] /cygdrive/e/Builds/workspace/pharo-vm_headless/repository/extracted/plugins/B2DPlugin/src/common/B2DPlugin.c:6070:1: warning: unused function 'lineEndXOfput' [-Wunused-function]
[windows] lineEndXOfput(sqInt line, sqInt value)
[windows] ^
[windows] /cygdrive/e/Builds/workspace/pharo-vm_headless/repository/extracted/plugins/B2DPlugin/src/common/B2DPlugin.c:6077:1: warning: unused function 'lineEndYOf' [-Wunused-function]
[windows] lineEndYOf(sqInt line)
[windows] ^
[windows] /cygdrive/e/Builds/workspace/pharo-vm_headless/repository/extracted/plugins/B2DPlugin/src/common/B2DPlugin.c:6084:1: warning: unused function 'lineEndYOfput' [-Wunused-function]
[windows] lineEndYOfput(sqInt line, sqInt value)
[windows] ^
[windows] /cygdrive/e/Builds/workspace/pharo-vm_headless/repository/extracted/plugins/B2DPlugin/src/common/B2DPlugin.c:6091:1: warning: unused function 'lineErrorAdjDownOf' [-Wunused-function]
[windows] lineErrorAdjDownOf(sqInt line)
[windows] ^
[windows] /cygdrive/e/Builds/workspace/pharo-vm_headless/repository/extracted/plugins/B2DPlugin/src/common/B2DPlugin.c:6098:1: warning: unused function 'lineErrorAdjDownOfput' [-Wunused-function]
[windows] lineErrorAdjDownOfput(sqInt line, sqInt value)
[windows] ^
[windows] /cygdrive/e/Builds/workspace/pharo-vm_headless/repository/extracted/plugins/B2DPlugin/src/common/B2DPlugin.c:6105:1: warning: unused function 'lineErrorAdjUpOf' [-Wunused-function]
[windows] lineErrorAdjUpOf(sqInt line)
[windows] ^
[windows] /cygdrive/e/Builds/workspace/pharo-vm_headless/repository/extracted/plugins/B2DPlugin/src/common/B2DPlugin.c:6112:1: warning: unused function 'lineErrorAdjUpOfput' [-Wunused-function]
[windows] lineErrorAdjUpOfput(sqInt line, sqInt value)
[windows] ^
[windows] /cygdrive/e/Builds/workspace/pharo-vm_headless/repository/extracted/plugins/B2DPlugin/src/common/B2DPlugin.c:6119:1: warning: unused function 'lineErrorOf' [-Wunused-function]
[windows] lineErrorOf(sqInt line)
[windows] ^
[windows] /cygdrive/e/Builds/workspace/pharo-vm_headless/repository/extracted/plugins/B2DPlugin/src/common/B2DPlugin.c:6126:1: warning: unused function 'lineErrorOfput' [-Wunused-function]
[windows] lineErrorOfput(sqInt line, sqInt value)
[windows] ^
[windows] /cygdrive/e/Builds/workspace/pharo-vm_headless/repository/extracted/plugins/B2DPlugin/src/common/B2DPlugin.c:6133:1: warning: unused function 'lineXDirectionOf' [-Wunused-function]
[windows] lineXDirectionOf(sqInt line)
[windows] ^
[windows] /cygdrive/e/Builds/workspace/pharo-vm_headless/repository/extracted/plugins/B2DPlugin/src/common/B2DPlugin.c:6140:1: warning: unused function 'lineXDirectionOfput' [-Wunused-function]
[windows] lineXDirectionOfput(sqInt line, sqInt value)
[windows] ^
[windows] /cygdrive/e/Builds/workspace/pharo-vm_headless/repository/extracted/plugins/B2DPlugin/src/common/B2DPlugin.c:6147:1: warning: unused function 'lineXIncrementOf' [-Wunused-function]
[windows] lineXIncrementOf(sqInt line)
[windows] ^
[windows] /cygdrive/e/Builds/workspace/pharo-vm_headless/repository/extracted/plugins/B2DPlugin/src/common/B2DPlugin.c:6154:1: warning: unused function 'lineXIncrementOfput' [-Wunused-function]
[windows] lineXIncrementOfput(sqInt line, sqInt value)
[windows] ^
[windows] /cygdrive/e/Builds/workspace/pharo-vm_headless/repository/extracted/plugins/B2DPlugin/src/common/B2DPlugin.c:6161:1: warning: unused function 'lineYDirectionOf' [-Wunused-function]
[windows] lineYDirectionOf(sqInt line)
[windows] ^
[windows] /cygdrive/e/Builds/workspace/pharo-vm_headless/repository/extracted/plugins/B2DPlugin/src/common/B2DPlugin.c:6168:1: warning: unused function 'lineYDirectionOfput' [-Wunused-function]
[windows] lineYDirectionOfput(sqInt line, sqInt value)
[windows] ^
[windows] /cygdrive/e/Builds/workspace/pharo-vm_headless/repository/extracted/plugins/B2DPlugin/src/common/B2DPlugin.c:6237:1: warning: unused function 'loadArrayPolygonnPointsfilllineWidthlineFill' [-Wunused-function]
[windows] loadArrayPolygonnPointsfilllineWidthlineFill(sqInt points, sqInt nPoints, sqInt fillIndex, sqInt lineWidth, sqInt lineFill)
[windows] ^
[windows] /cygdrive/e/Builds/workspace/pharo-vm_headless/repository/extracted/plugins/B2DPlugin/src/common/B2DPlugin.c:6691:1: warning: unused function 'loadBitmapFillcolormaptilefromalongnormalxIndex' [-Wunused-function]
[windows] loadBitmapFillcolormaptilefromalongnormalxIndex(sqInt formOop, sqInt cmOop, sqInt tileFlag, int *point1, int *point2, int *point3, sqInt xIndex)
[windows] ^
[windows] /cygdrive/e/Builds/workspace/pharo-vm_headless/repository/extracted/plugins/B2DPlugin/src/common/B2DPlugin.c:6834:1: warning: unused function 'loadColorTransformFrom' [-Wunused-function]
[windows] loadColorTransformFrom(sqInt transformOop)
[windows] ^
[windows] /cygdrive/e/Builds/workspace/pharo-vm_headless/repository/extracted/plugins/B2DPlugin/src/common/B2DPlugin.c:6861:1: warning: unused function 'loadCompressedSegmentfromshortleftFillrightFilllineWidthlineColor' [-Wunused-function]
[windows] loadCompressedSegmentfromshortleftFillrightFilllineWidthlineColor(sqInt segmentIndex, sqInt points, sqInt pointsShort, sqInt leftFill, sqInt rightFill, sqInt lineWidth, sqInt lineFill)
[windows] ^
[windows] /cygdrive/e/Builds/workspace/pharo-vm_headless/repository/extracted/plugins/B2DPlugin/src/common/B2DPlugin.c:7868:1: warning: unused function 'loadLinefromtooffsetleftFillrightFill' [-Wunused-function]
[windows] loadLinefromtooffsetleftFillrightFill(sqInt line, int *point1, int *point2, sqInt yOffset, sqInt leftFill, sqInt rightFill)
[windows] ^
[windows] /cygdrive/e/Builds/workspace/pharo-vm_headless/repository/extracted/plugins/B2DPlugin/src/common/B2DPlugin.c:8093:1: warning: unused function 'loadPointIntAtfrom' [-Wunused-function]
[windows] loadPointIntAtfrom(sqInt index, sqInt intArray)
[windows] ^
[windows] /cygdrive/e/Builds/workspace/pharo-vm_headless/repository/extracted/plugins/B2DPlugin/src/common/B2DPlugin.c:8103:1: warning: unused function 'loadPointShortAtfrom' [-Wunused-function]
[windows] loadPointShortAtfrom(sqInt index, sqInt shortArray)
[windows] ^
[windows] /cygdrive/e/Builds/workspace/pharo-vm_headless/repository/extracted/plugins/B2DPlugin/src/common/B2DPlugin.c:8147:1: warning: unused function 'loadPolygonnPointsfilllineWidthlineFillpointsShort' [-Wunused-function]
[windows] loadPolygonnPointsfilllineWidthlineFillpointsShort(int *points, sqInt nPoints, sqInt fillIndex, sqInt lineWidth, sqInt lineFill, sqInt isShort)
[windows] ^
[windows] /cygdrive/e/Builds/workspace/pharo-vm_headless/repository/extracted/plugins/B2DPlugin/src/common/B2DPlugin.c:8316:1: warning: unused function 'loadRectanglelineFillleftFillrightFill' [-Wunused-function]
[windows] loadRectanglelineFillleftFillrightFill(sqInt lineWidth, sqInt lineFill, sqInt leftFill, sqInt rightFill)
[windows] ^
[windows] /cygdrive/e/Builds/workspace/pharo-vm_headless/repository/extracted/plugins/B2DPlugin/src/common/B2DPlugin.c:8973:1: warning: unused function 'magicNumberGet' [-Wunused-function]
[windows] magicNumberGet(void)
[windows] ^
[windows] /cygdrive/e/Builds/workspace/pharo-vm_headless/repository/extracted/plugins/B2DPlugin/src/common/B2DPlugin.c:8980:1: warning: unused function 'magicNumberPut' [-Wunused-function]
[windows] magicNumberPut(sqInt value)
[windows] ^
[windows] /cygdrive/e/Builds/workspace/pharo-vm_headless/repository/extracted/plugins/B2DPlugin/src/common/B2DPlugin.c:8987:1: warning: unused function 'makeRectFromPoints' [-Wunused-function]
[windows] makeRectFromPoints(void)
[windows] ^
[windows] /cygdrive/e/Builds/workspace/pharo-vm_headless/repository/extracted/plugins/B2DPlugin/src/common/B2DPlugin.c:8998:1: warning: unused function 'makeUnsignedFrom' [-Wunused-function]
[windows] makeUnsignedFrom(sqInt someIntegerValue)
[windows] ^
[windows] /cygdrive/e/Builds/workspace/pharo-vm_headless/repository/extracted/plugins/B2DPlugin/src/common/B2DPlugin.c:9058:1: warning: unused function 'needsFlush' [-Wunused-function]
[windows] needsFlush(void)
[windows] ^
[windows] /cygdrive/e/Builds/workspace/pharo-vm_headless/repository/extracted/plugins/B2DPlugin/src/common/B2DPlugin.c:9065:1: warning: unused function 'needsFlushGet' [-Wunused-function]
[windows] needsFlushGet(void)
[windows] ^
[windows] /cygdrive/e/Builds/workspace/pharo-vm_headless/repository/extracted/plugins/B2DPlugin/src/common/B2DPlugin.c:9072:1: warning: unused function 'needsFlushPut' [-Wunused-function]
[windows] needsFlushPut(sqInt value)
[windows] ^
[windows] /cygdrive/e/Builds/workspace/pharo-vm_headless/repository/extracted/plugins/B2DPlugin/src/common/B2DPlugin.c:9079:1: warning: unused function 'objectHeaderOf' [-Wunused-function]
[windows] objectHeaderOf(sqInt obj)
[windows] ^
[windows] /cygdrive/e/Builds/workspace/pharo-vm_headless/repository/extracted/plugins/B2DPlugin/src/common/B2DPlugin.c:9090:1: warning: unused function 'objectIndexOf' [-Wunused-function]
[windows] objectIndexOf(sqInt obj)
[windows] ^
[windows] /cygdrive/e/Builds/workspace/pharo-vm_headless/repository/extracted/plugins/B2DPlugin/src/common/B2DPlugin.c:9097:1: warning: unused function 'objectIndexOfput' [-Wunused-function]
[windows] objectIndexOfput(sqInt obj, sqInt value)
[windows] ^
[windows] /cygdrive/e/Builds/workspace/pharo-vm_headless/repository/extracted/plugins/B2DPlugin/src/common/B2DPlugin.c:9104:1: warning: unused function 'objectLengthOf' [-Wunused-function]
[windows] objectLengthOf(sqInt obj)
[windows] ^
[windows] /cygdrive/e/Builds/workspace/pharo-vm_headless/repository/extracted/plugins/B2DPlugin/src/common/B2DPlugin.c:9111:1: warning: unused function 'objectLengthOfput' [-Wunused-function]
[windows] objectLengthOfput(sqInt obj, sqInt value)
[windows] ^
[windows] /cygdrive/e/Builds/workspace/pharo-vm_headless/repository/extracted/plugins/B2DPlugin/src/common/B2DPlugin.c:9118:1: warning: unused function 'objectTypeOf' [-Wunused-function]
[windows] objectTypeOf(sqInt obj)
[windows] ^
[windows] /cygdrive/e/Builds/workspace/pharo-vm_headless/repository/extracted/plugins/B2DPlugin/src/common/B2DPlugin.c:9125:1: warning: unused function 'objectTypeOfput' [-Wunused-function]
[windows] objectTypeOfput(sqInt obj, sqInt value)
[windows] ^
[windows] /cygdrive/e/Builds/workspace/pharo-vm_headless/repository/extracted/plugins/B2DPlugin/src/common/B2DPlugin.c:9132:1: warning: unused function 'objStartGet' [-Wunused-function]
[windows] objStartGet(void)
[windows] ^
[windows] /cygdrive/e/Builds/workspace/pharo-vm_headless/repository/extracted/plugins/B2DPlugin/src/common/B2DPlugin.c:9139:1: warning: unused function 'objStartPut' [-Wunused-function]
[windows] objStartPut(sqInt value)
[windows] ^
[windows] /cygdrive/e/Builds/workspace/pharo-vm_headless/repository/extracted/plugins/B2DPlugin/src/common/B2DPlugin.c:9146:1: warning: unused function 'objUsedGet' [-Wunused-function]
[windows] objUsedGet(void)
[windows] ^
[windows] /cygdrive/e/Builds/workspace/pharo-vm_headless/repository/extracted/plugins/B2DPlugin/src/common/B2DPlugin.c:9153:1: warning: unused function 'objUsedPut' [-Wunused-function]
[windows] objUsedPut(sqInt value)
[windows] ^
[windows] /cygdrive/e/Builds/workspace/pharo-vm_headless/repository/extracted/plugins/B2DPlugin/src/common/B2DPlugin.c:9160:1: warning: unused function 'objat' [-Wunused-function]
[windows] objat(sqInt object, sqInt index)
[windows] ^
[windows] /cygdrive/e/Builds/workspace/pharo-vm_headless/repository/extracted/plugins/B2DPlugin/src/common/B2DPlugin.c:9167:1: warning: unused function 'objatput' [-Wunused-function]
[windows] objatput(sqInt object, sqInt index, sqInt value)
[windows] ^
[windows] /cygdrive/e/Builds/workspace/pharo-vm_headless/repository/extracted/plugins/B2DPlugin/src/common/B2DPlugin.c:9178:1: warning: unused function 'offsetFromWidth' [-Wunused-function]
[windows] offsetFromWidth(sqInt lineWidth)
[windows] ^
[windows] /cygdrive/e/Builds/workspace/pharo-vm_headless/repository/extracted/plugins/B2DPlugin/src/common/B2DPlugin.c:9185:1: warning: unused function 'point1Get' [-Wunused-function]
[windows] point1Get(void)
[windows] ^
[windows] /cygdrive/e/Builds/workspace/pharo-vm_headless/repository/extracted/plugins/B2DPlugin/src/common/B2DPlugin.c:9192:1: warning: unused function 'point2Get' [-Wunused-function]
[windows] point2Get(void)
[windows] ^
[windows] /cygdrive/e/Builds/workspace/pharo-vm_headless/repository/extracted/plugins/B2DPlugin/src/common/B2DPlugin.c:9199:1: warning: unused function 'point3Get' [-Wunused-function]
[windows] point3Get(void)
[windows] ^
[windows] /cygdrive/e/Builds/workspace/pharo-vm_headless/repository/extracted/plugins/B2DPlugin/src/common/B2DPlugin.c:9206:1: warning: unused function 'point4Get' [-Wunused-function]
[windows] point4Get(void)
[windows] ^
[windows] /cygdrive/e/Builds/workspace/pharo-vm_headless/repository/extracted/plugins/B2DPlugin/src/common/B2DPlugin.c:12282:1: warning: unused function 'quickRemoveInvalidFillsAt' [-Wunused-function]
[windows] quickRemoveInvalidFillsAt(sqInt leftX)
[windows] ^
[windows] /cygdrive/e/Builds/workspace/pharo-vm_headless/repository/extracted/plugins/B2DPlugin/src/common/B2DPlugin.c:12428:1: warning: unused function 'repeatValuemax' [-Wunused-function]
[windows] repeatValuemax(sqInt delta, sqInt maxValue)
[windows] ^
[windows] /cygdrive/e/Builds/workspace/pharo-vm_headless/repository/extracted/plugins/B2DPlugin/src/common/B2DPlugin.c:12495:1: warning: unused function 'returnWideBezierFill' [-Wunused-function]
[windows] returnWideBezierFill(void)
[windows] ^
[windows] /cygdrive/e/Builds/workspace/pharo-vm_headless/repository/extracted/plugins/B2DPlugin/src/common/B2DPlugin.c:12502:1: warning: unused function 'returnWideBezierWidth' [-Wunused-function]
[windows] returnWideBezierWidth(void)
[windows] ^
[windows] /cygdrive/e/Builds/workspace/pharo-vm_headless/repository/extracted/plugins/B2DPlugin/src/common/B2DPlugin.c:12512:1: warning: unused function 'returnWideLineFill' [-Wunused-function]
[windows] returnWideLineFill(void)
[windows] ^
[windows] /cygdrive/e/Builds/workspace/pharo-vm_headless/repository/extracted/plugins/B2DPlugin/src/common/B2DPlugin.c:12522:1: warning: unused function 'returnWideLineWidth' [-Wunused-function]
[windows] returnWideLineWidth(void)
[windows] ^
[windows] /cygdrive/e/Builds/workspace/pharo-vm_headless/repository/extracted/plugins/B2DPlugin/src/common/B2DPlugin.c:12668:1: warning: unused function 'shortRunLengthAtfrom' [-Wunused-function]
[windows] shortRunLengthAtfrom(sqInt i, sqInt runArray)
[windows] ^
[windows] /cygdrive/e/Builds/workspace/pharo-vm_headless/repository/extracted/plugins/B2DPlugin/src/common/B2DPlugin.c:12680:1: warning: unused function 'shortRunValueAtfrom' [-Wunused-function]
[windows] shortRunValueAtfrom(sqInt i, sqInt runArray)
[windows] ^
[windows] /cygdrive/e/Builds/workspace/pharo-vm_headless/repository/extracted/plugins/B2DPlugin/src/common/B2DPlugin.c:12748:1: warning: unused function 'sortGlobalEdgeTable' [-Wunused-function]
[windows] sortGlobalEdgeTable(void)
[windows] ^
[windows] /cygdrive/e/Builds/workspace/pharo-vm_headless/repository/extracted/plugins/B2DPlugin/src/common/B2DPlugin.c:12756:1: warning: unused function 'spanEndAAGet' [-Wunused-function]
[windows] spanEndAAGet(void)
[windows] ^
[windows] /cygdrive/e/Builds/workspace/pharo-vm_headless/repository/extracted/plugins/B2DPlugin/src/common/B2DPlugin.c:12763:1: warning: unused function 'spanEndAAPut' [-Wunused-function]
[windows] spanEndAAPut(sqInt value)
[windows] ^
[windows] /cygdrive/e/Builds/workspace/pharo-vm_headless/repository/extracted/plugins/B2DPlugin/src/common/B2DPlugin.c:12770:1: warning: unused function 'spanEndGet' [-Wunused-function]
[windows] spanEndGet(void)
[windows] ^
[windows] /cygdrive/e/Builds/workspace/pharo-vm_headless/repository/extracted/plugins/B2DPlugin/src/common/B2DPlugin.c:12777:1: warning: unused function 'spanEndPut' [-Wunused-function]
[windows] spanEndPut(sqInt value)
[windows] ^
[windows] /cygdrive/e/Builds/workspace/pharo-vm_headless/repository/extracted/plugins/B2DPlugin/src/common/B2DPlugin.c:12784:1: warning: unused function 'spanSizeGet' [-Wunused-function]
[windows] spanSizeGet(void)
[windows] ^
[windows] /cygdrive/e/Builds/workspace/pharo-vm_headless/repository/extracted/plugins/B2DPlugin/src/common/B2DPlugin.c:12791:1: warning: unused function 'spanSizePut' [-Wunused-function]
[windows] spanSizePut(sqInt value)
[windows] ^
[windows] /cygdrive/e/Builds/workspace/pharo-vm_headless/repository/extracted/plugins/B2DPlugin/src/common/B2DPlugin.c:12798:1: warning: unused function 'spanStartGet' [-Wunused-function]
[windows] spanStartGet(void)
[windows] ^
[windows] /cygdrive/e/Builds/workspace/pharo-vm_headless/repository/extracted/plugins/B2DPlugin/src/common/B2DPlugin.c:12805:1: warning: unused function 'spanStartPut' [-Wunused-function]
[windows] spanStartPut(sqInt value)
[windows] ^
[windows] /cygdrive/e/Builds/workspace/pharo-vm_headless/repository/extracted/plugins/B2DPlugin/src/common/B2DPlugin.c:12812:1: warning: unused function 'squaredLengthOfwith' [-Wunused-function]
[windows] squaredLengthOfwith(sqInt deltaX, sqInt deltaY)
[windows] ^
[windows] /cygdrive/e/Builds/workspace/pharo-vm_headless/repository/extracted/plugins/B2DPlugin/src/common/B2DPlugin.c:12819:1: warning: unused function 'stackFillDepth' [-Wunused-function]
[windows] stackFillDepth(sqInt index)
[windows] ^
[windows] /cygdrive/e/Builds/workspace/pharo-vm_headless/repository/extracted/plugins/B2DPlugin/src/common/B2DPlugin.c:12826:1: warning: unused function 'stackFillDepthput' [-Wunused-function]
[windows] stackFillDepthput(sqInt index, sqInt value)
[windows] ^
[windows] /cygdrive/e/Builds/workspace/pharo-vm_headless/repository/extracted/plugins/B2DPlugin/src/common/B2DPlugin.c:12833:1: warning: unused function 'stackFillEntryLength' [-Wunused-function]
[windows] stackFillEntryLength(void)
[windows] ^
[windows] /cygdrive/e/Builds/workspace/pharo-vm_headless/repository/extracted/plugins/B2DPlugin/src/common/B2DPlugin.c:12840:1: warning: unused function 'stackFillRightX' [-Wunused-function]
[windows] stackFillRightX(sqInt index)
[windows] ^
[windows] /cygdrive/e/Builds/workspace/pharo-vm_headless/repository/extracted/plugins/B2DPlugin/src/common/B2DPlugin.c:12847:1: warning: unused function 'stackFillRightXput' [-Wunused-function]
[windows] stackFillRightXput(sqInt index, sqInt value)
[windows] ^
[windows] /cygdrive/e/Builds/workspace/pharo-vm_headless/repository/extracted/plugins/B2DPlugin/src/common/B2DPlugin.c:12854:1: warning: unused function 'stackFillSize' [-Wunused-function]
[windows] stackFillSize(void)
[windows] ^
[windows] /cygdrive/e/Builds/workspace/pharo-vm_headless/repository/extracted/plugins/B2DPlugin/src/common/B2DPlugin.c:12861:1: warning: unused function 'stackFillValue' [-Wunused-function]
[windows] stackFillValue(sqInt index)
[windows] ^
[windows] /cygdrive/e/Builds/workspace/pharo-vm_headless/repository/extracted/plugins/B2DPlugin/src/common/B2DPlugin.c:12868:1: warning: unused function 'stackFillValueput' [-Wunused-function]
[windows] stackFillValueput(sqInt index, sqInt value)
[windows] ^
[windows] /cygdrive/e/Builds/workspace/pharo-vm_headless/repository/extracted/plugins/B2DPlugin/src/common/B2DPlugin.c:12875:1: warning: unused function 'stateGet' [-Wunused-function]
[windows] stateGet(void)
[windows] ^
[windows] /cygdrive/e/Builds/workspace/pharo-vm_headless/repository/extracted/plugins/B2DPlugin/src/common/B2DPlugin.c:12882:1: warning: unused function 'statePut' [-Wunused-function]
[windows] statePut(sqInt value)
[windows] ^
[windows] /cygdrive/e/Builds/workspace/pharo-vm_headless/repository/extracted/plugins/B2DPlugin/src/common/B2DPlugin.c:12894:1: warning: unused function 'stepToFirstBezier' [-Wunused-function]
[windows] stepToFirstBezier(void)
[windows] ^
[windows] /cygdrive/e/Builds/workspace/pharo-vm_headless/repository/extracted/plugins/B2DPlugin/src/common/B2DPlugin.c:13033:1: warning: unused function 'stepToFirstLine' [-Wunused-function]
[windows] stepToFirstLine(void)
[windows] ^
[windows] /cygdrive/e/Builds/workspace/pharo-vm_headless/repository/extracted/plugins/B2DPlugin/src/common/B2DPlugin.c:13140:1: warning: unused function 'stepToFirstWideBezier' [-Wunused-function]
[windows] stepToFirstWideBezier(void)
[windows] ^
[windows] /cygdrive/e/Builds/workspace/pharo-vm_headless/repository/extracted/plugins/B2DPlugin/src/common/B2DPlugin.c:13244:1: warning: unused function 'stepToFirstWideLine' [-Wunused-function]
[windows] stepToFirstWideLine(void)
[windows] ^
[windows] /cygdrive/e/Builds/workspace/pharo-vm_headless/repository/extracted/plugins/B2DPlugin/src/common/B2DPlugin.c:13388:1: warning: unused function 'stepToNextBezier' [-Wunused-function]
[windows] stepToNextBezier(void)
[windows] ^
[windows] /cygdrive/e/Builds/workspace/pharo-vm_headless/repository/extracted/plugins/B2DPlugin/src/common/B2DPlugin.c:13434:1: warning: unused function 'stepToNextBezierForwardat' [-Wunused-function]
[windows] stepToNextBezierForwardat(int *updateData, sqInt yValue)
[windows] ^
[windows] /cygdrive/e/Builds/workspace/pharo-vm_headless/repository/extracted/plugins/B2DPlugin/src/common/B2DPlugin.c:13515:1: warning: unused function 'stepToNextLine' [-Wunused-function]
[windows] stepToNextLine(void)
[windows] ^
[windows] /cygdrive/e/Builds/workspace/pharo-vm_headless/repository/extracted/plugins/B2DPlugin/src/common/B2DPlugin.c:13686:1: warning: unused function 'stepToNextWideLine' [-Wunused-function]
[windows] stepToNextWideLine(void)
[windows] ^
[windows] /cygdrive/e/Builds/workspace/pharo-vm_headless/repository/extracted/plugins/B2DPlugin/src/common/B2DPlugin.c:13814:1: warning: unused function 'stopBecauseOf' [-Wunused-function]
[windows] stopBecauseOf(sqInt stopReason)
[windows] ^
[windows] /cygdrive/e/Builds/workspace/pharo-vm_headless/repository/extracted/plugins/B2DPlugin/src/common/B2DPlugin.c:13823:1: warning: unused function 'stopReasonGet' [-Wunused-function]
[windows] stopReasonGet(void)
[windows] ^
[windows] /cygdrive/e/Builds/workspace/pharo-vm_headless/repository/extracted/plugins/B2DPlugin/src/common/B2DPlugin.c:13830:1: warning: unused function 'stopReasonPut' [-Wunused-function]
[windows] stopReasonPut(sqInt value)
[windows] ^
[windows] /cygdrive/e/Builds/workspace/pharo-vm_headless/repository/extracted/plugins/B2DPlugin/src/common/B2DPlugin.c:13854:1: warning: unused function 'storeEngineStateInto' [-Wunused-function]
[windows] storeEngineStateInto(sqInt oop)
[windows] ^
[windows] /cygdrive/e/Builds/workspace/pharo-vm_headless/repository/extracted/plugins/B2DPlugin/src/common/B2DPlugin.c:13930:1: warning: unused function 'storeStopStateIntoEdgefill' [-Wunused-function]
[windows] storeStopStateIntoEdgefill(sqInt edgeOop, sqInt fillOop)
[windows] ^
[windows] /cygdrive/e/Builds/workspace/pharo-vm_headless/repository/extracted/plugins/B2DPlugin/src/common/B2DPlugin.c:14334:1: warning: unused function 'topFillDepth' [-Wunused-function]
[windows] topFillDepth(void)
[windows] ^
[windows] /cygdrive/e/Builds/workspace/pharo-vm_headless/repository/extracted/plugins/B2DPlugin/src/common/B2DPlugin.c:14345:1: warning: unused function 'topFillDepthPut' [-Wunused-function]
[windows] topFillDepthPut(sqInt value)
[windows] ^
[windows] /cygdrive/e/Builds/workspace/pharo-vm_headless/repository/extracted/plugins/B2DPlugin/src/common/B2DPlugin.c:14356:1: warning: unused function 'topFillRightX' [-Wunused-function]
[windows] topFillRightX(void)
[windows] ^
[windows] /cygdrive/e/Builds/workspace/pharo-vm_headless/repository/extracted/plugins/B2DPlugin/src/common/B2DPlugin.c:14367:1: warning: unused function 'topFillRightXPut' [-Wunused-function]
[windows] topFillRightXPut(sqInt value)
[windows] ^
[windows] /cygdrive/e/Builds/workspace/pharo-vm_headless/repository/extracted/plugins/B2DPlugin/src/common/B2DPlugin.c:14378:1: warning: unused function 'topFillValue' [-Wunused-function]
[windows] topFillValue(void)
[windows] ^
[windows] /cygdrive/e/Builds/workspace/pharo-vm_headless/repository/extracted/plugins/B2DPlugin/src/common/B2DPlugin.c:14389:1: warning: unused function 'topFillValuePut' [-Wunused-function]
[windows] topFillValuePut(sqInt value)
[windows] ^
[windows] /cygdrive/e/Builds/workspace/pharo-vm_headless/repository/extracted/plugins/B2DPlugin/src/common/B2DPlugin.c:14468:1: warning: unused function 'transformPoints' [-Wunused-function]
[windows] transformPoints(sqInt n)
[windows] ^
[windows] /cygdrive/e/Builds/workspace/pharo-vm_headless/repository/extracted/plugins/B2DPlugin/src/common/B2DPlugin.c:14597:1: warning: unused function 'transformPointXyinto' [-Wunused-function]
[windows] transformPointXyinto(double xValue, double yValue, int *dstPoint)
[windows] ^
[windows] /cygdrive/e/Builds/workspace/pharo-vm_headless/repository/extracted/plugins/B2DPlugin/src/common/B2DPlugin.c:14619:1: warning: unused function 'transformPoint' [-Wunused-function]
[windows] transformPoint(int *point)
[windows] ^
[windows] /cygdrive/e/Builds/workspace/pharo-vm_headless/repository/extracted/plugins/B2DPlugin/src/common/B2DPlugin.c:14658:1: warning: unused function 'transformPointinto' [-Wunused-function]
[windows] transformPointinto(sqInt srcPoint, sqInt dstPoint)
[windows] ^
[windows] /cygdrive/e/Builds/workspace/pharo-vm_headless/repository/extracted/plugins/B2DPlugin/src/common/B2DPlugin.c:14872:1: warning: unused function 'wbSizeGet' [-Wunused-function]
[windows] wbSizeGet(void)
[windows] ^
[windows] /cygdrive/e/Builds/workspace/pharo-vm_headless/repository/extracted/plugins/B2DPlugin/src/common/B2DPlugin.c:14879:1: warning: unused function 'wbSizePut' [-Wunused-function]
[windows] wbSizePut(sqInt value)
[windows] ^
[windows] /cygdrive/e/Builds/workspace/pharo-vm_headless/repository/extracted/plugins/B2DPlugin/src/common/B2DPlugin.c:14886:1: warning: unused function 'wbStackClear' [-Wunused-function]
[windows] wbStackClear(void)
[windows] ^
[windows] /cygdrive/e/Builds/workspace/pharo-vm_headless/repository/extracted/plugins/B2DPlugin/src/common/B2DPlugin.c:14895:1: warning: unused function 'wbStackPop' [-Wunused-function]
[windows] wbStackPop(sqInt nItems)
[windows] ^
[windows] /cygdrive/e/Builds/workspace/pharo-vm_headless/repository/extracted/plugins/B2DPlugin/src/common/B2DPlugin.c:14916:1: warning: unused function 'wbStackSize' [-Wunused-function]
[windows] wbStackSize(void)
[windows] ^
[windows] /cygdrive/e/Builds/workspace/pharo-vm_headless/repository/extracted/plugins/B2DPlugin/src/common/B2DPlugin.c:14923:1: warning: unused function 'wbStackValue' [-Wunused-function]
[windows] wbStackValue(sqInt index)
[windows] ^
[windows] /cygdrive/e/Builds/workspace/pharo-vm_headless/repository/extracted/plugins/B2DPlugin/src/common/B2DPlugin.c:14930:1: warning: unused function 'wbStackValueput' [-Wunused-function]
[windows] wbStackValueput(sqInt index, sqInt value)
[windows] ^
[windows] /cygdrive/e/Builds/workspace/pharo-vm_headless/repository/extracted/plugins/B2DPlugin/src/common/B2DPlugin.c:14937:1: warning: unused function 'wbTopGet' [-Wunused-function]
[windows] wbTopGet(void)
[windows] ^
[windows] /cygdrive/e/Builds/workspace/pharo-vm_headless/repository/extracted/plugins/B2DPlugin/src/common/B2DPlugin.c:14944:1: warning: unused function 'wbTopPut' [-Wunused-function]
[windows] wbTopPut(sqInt value)
[windows] ^
[windows] /cygdrive/e/Builds/workspace/pharo-vm_headless/repository/extracted/plugins/B2DPlugin/src/common/B2DPlugin.c:14951:1: warning: unused function 'wideBezierEntryOf' [-Wunused-function]
[windows] wideBezierEntryOf(sqInt line)
[windows] ^
[windows] /cygdrive/e/Builds/workspace/pharo-vm_headless/repository/extracted/plugins/B2DPlugin/src/common/B2DPlugin.c:14959:1: warning: unused function 'wideBezierEntryOfput' [-Wunused-function]
[windows] wideBezierEntryOfput(sqInt line, sqInt value)
[windows] ^
[windows] /cygdrive/e/Builds/workspace/pharo-vm_headless/repository/extracted/plugins/B2DPlugin/src/common/B2DPlugin.c:14967:1: warning: unused function 'wideBezierExitOf' [-Wunused-function]
[windows] wideBezierExitOf(sqInt line)
[windows] ^
[windows] /cygdrive/e/Builds/workspace/pharo-vm_headless/repository/extracted/plugins/B2DPlugin/src/common/B2DPlugin.c:14975:1: warning: unused function 'wideBezierExitOfput' [-Wunused-function]
[windows] wideBezierExitOfput(sqInt line, sqInt value)
[windows] ^
[windows] /cygdrive/e/Builds/workspace/pharo-vm_headless/repository/extracted/plugins/B2DPlugin/src/common/B2DPlugin.c:14983:1: warning: unused function 'wideBezierExtentOf' [-Wunused-function]
[windows] wideBezierExtentOf(sqInt bezier)
[windows] ^
[windows] /cygdrive/e/Builds/workspace/pharo-vm_headless/repository/extracted/plugins/B2DPlugin/src/common/B2DPlugin.c:14991:1: warning: unused function 'wideBezierExtentOfput' [-Wunused-function]
[windows] wideBezierExtentOfput(sqInt bezier, sqInt value)
[windows] ^
[windows] /cygdrive/e/Builds/workspace/pharo-vm_headless/repository/extracted/plugins/B2DPlugin/src/common/B2DPlugin.c:15007:1: warning: unused function 'wideBezierFillOfput' [-Wunused-function]
[windows] wideBezierFillOfput(sqInt bezier, sqInt value)
[windows] ^
[windows] /cygdrive/e/Builds/workspace/pharo-vm_headless/repository/extracted/plugins/B2DPlugin/src/common/B2DPlugin.c:15015:1: warning: unused function 'wideBezierUpdateDataOf' [-Wunused-function]
[windows] wideBezierUpdateDataOf(sqInt bezier)
[windows] ^
[windows] /cygdrive/e/Builds/workspace/pharo-vm_headless/repository/extracted/plugins/B2DPlugin/src/common/B2DPlugin.c:15030:1: warning: unused function 'wideBezierWidthOfput' [-Wunused-function]
[windows] wideBezierWidthOfput(sqInt line, sqInt value)
[windows] ^
[windows] /cygdrive/e/Builds/workspace/pharo-vm_headless/repository/extracted/plugins/B2DPlugin/src/common/B2DPlugin.c:15038:1: warning: unused function 'wideLineEntryOf' [-Wunused-function]
[windows] wideLineEntryOf(sqInt line)
[windows] ^
[windows] /cygdrive/e/Builds/workspace/pharo-vm_headless/repository/extracted/plugins/B2DPlugin/src/common/B2DPlugin.c:15046:1: warning: unused function 'wideLineEntryOfput' [-Wunused-function]
[windows] wideLineEntryOfput(sqInt line, sqInt value)
[windows] ^
[windows] /cygdrive/e/Builds/workspace/pharo-vm_headless/repository/extracted/plugins/B2DPlugin/src/common/B2DPlugin.c:15054:1: warning: unused function 'wideLineExitOf' [-Wunused-function]
[windows] wideLineExitOf(sqInt line)
[windows] ^
[windows] /cygdrive/e/Builds/workspace/pharo-vm_headless/repository/extracted/plugins/B2DPlugin/src/common/B2DPlugin.c:15062:1: warning: unused function 'wideLineExitOfput' [-Wunused-function]
[windows] wideLineExitOfput(sqInt line, sqInt value)
[windows] ^
[windows] /cygdrive/e/Builds/workspace/pharo-vm_headless/repository/extracted/plugins/B2DPlugin/src/common/B2DPlugin.c:15070:1: warning: unused function 'wideLineExtentOf' [-Wunused-function]
[windows] wideLineExtentOf(sqInt line)
[windows] ^
[windows] /cygdrive/e/Builds/workspace/pharo-vm_headless/repository/extracted/plugins/B2DPlugin/src/common/B2DPlugin.c:15078:1: warning: unused function 'wideLineExtentOfput' [-Wunused-function]
[windows] wideLineExtentOfput(sqInt line, sqInt value)
[windows] ^
[windows] /cygdrive/e/Builds/workspace/pharo-vm_headless/repository/extracted/plugins/B2DPlugin/src/common/B2DPlugin.c:15094:1: warning: unused function 'wideLineFillOfput' [-Wunused-function]
[windows] wideLineFillOfput(sqInt line, sqInt value)
[windows] ^
[windows] /cygdrive/e/Builds/workspace/pharo-vm_headless/repository/extracted/plugins/B2DPlugin/src/common/B2DPlugin.c:15110:1: warning: unused function 'wideLineWidthOfput' [-Wunused-function]
[windows] wideLineWidthOfput(sqInt line, sqInt value)
[windows] ^
[windows] /cygdrive/e/Builds/workspace/pharo-vm_headless/repository/extracted/plugins/B2DPlugin/src/common/B2DPlugin.c:15118:1: warning: unused function 'workBufferPut' [-Wunused-function]
[windows] workBufferPut(sqInt wbOop)
[windows] ^
[osx] [ 62%] Building C object CMakeFiles/JPEGReadWriter2Plugin.dir/extracted/plugins/JPEGReadWriter2Plugin/src/common/jdcolor.c.o
[osx] [ 63%] Building C object CMakeFiles/JPEGReadWriter2Plugin.dir/extracted/plugins/JPEGReadWriter2Plugin/src/common/jddctmgr.c.o
[osx] [ 63%] Building C object CMakeFiles/JPEGReadWriter2Plugin.dir/extracted/plugins/JPEGReadWriter2Plugin/src/common/jdhuff.c.o
[osx] [ 64%] Building C object CMakeFiles/JPEGReadWriter2Plugin.dir/extracted/plugins/JPEGReadWriter2Plugin/src/common/jdinput.c.o
[osx] [ 65%] Building C object CMakeFiles/JPEGReadWriter2Plugin.dir/extracted/plugins/JPEGReadWriter2Plugin/src/common/jdmainct.c.o
[osx] [ 65%] Building C object CMakeFiles/JPEGReadWriter2Plugin.dir/extracted/plugins/JPEGReadWriter2Plugin/src/common/jdmarker.c.o
[osx] [ 66%] Building C object CMakeFiles/JPEGReadWriter2Plugin.dir/extracted/plugins/JPEGReadWriter2Plugin/src/common/jdmaster.c.o
[osx] [ 67%] Building C object CMakeFiles/JPEGReadWriter2Plugin.dir/extracted/plugins/JPEGReadWriter2Plugin/src/common/jdmerge.c.o
[osx] [ 67%] Building C object CMakeFiles/JPEGReadWriter2Plugin.dir/extracted/plugins/JPEGReadWriter2Plugin/src/common/jdphuff.c.o
[osx] [ 68%] Building C object CMakeFiles/JPEGReadWriter2Plugin.dir/extracted/plugins/JPEGReadWriter2Plugin/src/common/jdpostct.c.o
[osx] [ 69%] Building C object CMakeFiles/JPEGReadWriter2Plugin.dir/extracted/plugins/JPEGReadWriter2Plugin/src/common/jdsample.c.o
[osx] [ 69%] Building C object CMakeFiles/JPEGReadWriter2Plugin.dir/extracted/plugins/JPEGReadWriter2Plugin/src/common/jdtrans.c.o
[osx] [ 70%] Building C object CMakeFiles/JPEGReadWriter2Plugin.dir/extracted/plugins/JPEGReadWriter2Plugin/src/common/jerror.c.o
[osx] [ 71%] Building C object CMakeFiles/JPEGReadWriter2Plugin.dir/extracted/plugins/JPEGReadWriter2Plugin/src/common/jfdctflt.c.o
[osx] [ 72%] Building C object CMakeFiles/JPEGReadWriter2Plugin.dir/extracted/plugins/JPEGReadWriter2Plugin/src/common/jfdctfst.c.o
[osx] [ 72%] Building C object CMakeFiles/JPEGReadWriter2Plugin.dir/extracted/plugins/JPEGReadWriter2Plugin/src/common/jfdctint.c.o
[osx] [ 73%] Building C object CMakeFiles/JPEGReadWriter2Plugin.dir/extracted/plugins/JPEGReadWriter2Plugin/src/common/jidctflt.c.o
[osx] [ 74%] Building C object CMakeFiles/JPEGReadWriter2Plugin.dir/extracted/plugins/JPEGReadWriter2Plugin/src/common/jidctfst.c.o
[windows] 325 warnings generated.
[windows] [ 87%] Linking C shared library build/vm/B2DPlugin.dll
[osx] [ 74%] Building C object CMakeFiles/JPEGReadWriter2Plugin.dir/extracted/plugins/JPEGReadWriter2Plugin/src/common/jidctint.c.o
[osx] [ 75%] Building C object CMakeFiles/JPEGReadWriter2Plugin.dir/extracted/plugins/JPEGReadWriter2Plugin/src/common/jidctred.c.o
[osx] [ 76%] Building C object CMakeFiles/JPEGReadWriter2Plugin.dir/extracted/plugins/JPEGReadWriter2Plugin/src/common/jmemdatadst.c.o
[osx] [ 76%] Building C object CMakeFiles/JPEGReadWriter2Plugin.dir/extracted/plugins/JPEGReadWriter2Plugin/src/common/jmemdatasrc.c.o
[osx] [ 77%] Building C object CMakeFiles/JPEGReadWriter2Plugin.dir/extracted/plugins/JPEGReadWriter2Plugin/src/common/jmemmgr.c.o
[osx] [ 78%] Building C object CMakeFiles/JPEGReadWriter2Plugin.dir/extracted/plugins/JPEGReadWriter2Plugin/src/common/jmemnobs.c.o
[osx] [ 78%] Building C object CMakeFiles/JPEGReadWriter2Plugin.dir/extracted/plugins/JPEGReadWriter2Plugin/src/common/jquant1.c.o
[osx] [ 79%] Building C object CMakeFiles/JPEGReadWriter2Plugin.dir/extracted/plugins/JPEGReadWriter2Plugin/src/common/jquant2.c.o
[windows] [ 87%] Built target B2DPlugin
[windows] Scanning dependencies of target pixman-0.34.0
[windows] [ 88%] Generating build/third-party/pixman-0.34.0.zip
[windows] --2019-09-10 14:34:52--  https://files.pharo.org/vm/pharo-spur64/win/third-party/pixman-0.34.0.zip
[windows] Resolving files.pharo.org... 164.132.235.17
[windows] Connecting to files.pharo.org|164.132.235.17|:443... connected.
[windows] WARNING: cannot verify files.pharo.org’s certificate, issued by “/C=GB/ST=Greater Manchester/L=Salford/O=COMODO CA Limited/CN=COMODO RSA Domain Validation Secure Server CA�:
[windows]   Self-signed certificate encountered.
[windows] WARNING: certificate common name “cluster023.hosting.ovh.net� doesn’t match requested host name “files.pharo.org�.
[windows] HTTP request sent, awaiting response... 200 OK
[windows] Length: 272706 (266K) [application/zip]
[windows] Saving to: “pixman-0.34.0.zip�
[windows] 
[windows]      0K .......... .......... .......... .......... .......... 18% 2.76M 0s
[windows]     50K .......... .......... .......... .......... .......... 37% 12.5M 0s
[windows]    100K .......... .......... .......... .......... .......... 56% 8.74M 0s
[windows]    150K .......... .......... .......... .......... .......... 75% 4.96M 0s
[windows]    200K .......... .......... .......... .......... .......... 93% 5.43M 0s
[windows]    250K .......... ......                                     100% 9.21M=0.05s
[windows] 
[windows] 2019-09-10 14:34:52 (5.45 MB/s) - “pixman-0.34.0.zip� saved [272706/272706]
[windows] 
[windows] [ 88%] Generating build/third-party/pixman-0.34.0.done
[windows] Archive:  pixman-0.34.0.zip
[windows]   inflating: /cygdrive/e/Builds/workspace/pharo-vm_headless/build/build/vm/libpixman-1-0.dll  
[windows] [ 88%] Built target pixman-0.34.0
[windows] Scanning dependencies of target libgit2-0.25.1-fixLibGit
[windows] [ 89%] Generating build/third-party/libgit2-0.25.1-fixLibGit.zip
[windows] --2019-09-10 14:34:52--  https://files.pharo.org/vm/pharo-spur64/win/third-party/libgit2-0.25.1-fixLibGit.zip
[windows] Resolving files.pharo.org... 164.132.235.17
[windows] Connecting to files.pharo.org|164.132.235.17|:443... connected.
[windows] WARNING: cannot verify files.pharo.org’s certificate, issued by “/C=GB/ST=Greater Manchester/L=Salford/O=COMODO CA Limited/CN=COMODO RSA Domain Validation Secure Server CA�:
[windows]   Self-signed certificate encountered.
[windows] WARNING: certificate common name “cluster023.hosting.ovh.net� doesn’t match requested host name “files.pharo.org�.
[windows] HTTP request sent, awaiting response... 404 Not Found
[windows] 2019-09-10 14:34:52 ERROR 404: Not Found.
[windows] 
[windows] make[2]: *** [CMakeFiles/libgit2-0.25.1-fixLibGit.dir/build.make:68: build/third-party/libgit2-0.25.1-fixLibGit.zip] Error 8
[windows] make[1]: *** [CMakeFiles/Makefile2:888: CMakeFiles/libgit2-0.25.1-fixLibGit.dir/all] Error 2
[windows] make: *** [Makefile:152: all] Error 2
[osx] [ 80%] Building C object CMakeFiles/JPEGReadWriter2Plugin.dir/extracted/plugins/JPEGReadWriter2Plugin/src/common/jutils.c.o
[osx] [ 80%] Building C object CMakeFiles/JPEGReadWriter2Plugin.dir/extracted/plugins/JPEGReadWriter2Plugin/src/common/sqJPEGReadWriter2Plugin.c.o
[osx] [ 81%] Linking C shared library build/vm/libJPEGReadWriter2Plugin.dylib
[osx] [ 81%] Built target JPEGReadWriter2Plugin
[osx] Scanning dependencies of target FileAttributesPlugin
[osx] [ 81%] Building C object CMakeFiles/FileAttributesPlugin.dir/extracted/plugins/FileAttributesPlugin/src/common/FileAttributesPlugin.c.o
[osx] [ 82%] Building C object CMakeFiles/FileAttributesPlugin.dir/extracted/plugins/FileAttributesPlugin/src/common/faCommon.c.o
[osx] [ 83%] Building C object CMakeFiles/FileAttributesPlugin.dir/extracted/plugins/FileAttributesPlugin/src/unix/faSupport.c.o
[osx] [ 83%] Linking C shared library build/vm/libFileAttributesPlugin.dylib
[osx] [ 83%] Built target FileAttributesPlugin
[osx] Scanning dependencies of target libpng-1.2.49
[osx] [ 84%] Generating build/third-party/libpng-1.2.49.zip
[osx] --2019-09-10 16:34:49--  https://files.pharo.org/vm/pharo-spur64/mac/third-party/libpng-1.2.49.zip
[osx] Resolving files.pharo.org... 164.132.235.17, 2001:41d0:301::23
[osx] Connecting to files.pharo.org|164.132.235.17|:443... connected.
[osx] HTTP request sent, awaiting response... 200 OK
[osx] Length: 148996 (146K) [application/zip]
[osx] Saving to: 'libpng-1.2.49.zip'
[osx] 
[osx]      0K .......... .......... .......... .......... .......... 34% 4.18M 0s
[osx]     50K .......... .......... .......... .......... .......... 68% 5.78M 0s
[osx]    100K .......... .......... .......... .......... .....     100% 5.84M=0.03s
[osx] 
[osx] 2019-09-10 16:34:49 (5.12 MB/s) - 'libpng-1.2.49.zip' saved [148996/148996]
[osx] 
[osx] [ 84%] Generating build/third-party/libpng-1.2.49.done
[osx] Archive:  libpng-1.2.49.zip
[osx]   inflating: /builds/workspace/pharo-vm_headless/build/build/vm/libpng12.0.dylib  
[osx]   inflating: /builds/workspace/pharo-vm_headless/build/build/vm/libpng12.dylib  
[osx] [ 84%] Built target libpng-1.2.49
[osx] Scanning dependencies of target IA32ABI
[osx] [ 84%] Building C object CMakeFiles/IA32ABI.dir/extracted/plugins/IA32ABI/src/common/IA32ABI.c.o
[osx] /builds/workspace/pharo-vm_headless/repository/extracted/plugins/IA32ABI/src/common/IA32ABI.c:748:24: warning: incompatible integer to pointer conversion passing 'sqInt' (aka 'long') to parameter of type 'const void *' [-Wint-conversion]
[osx]         memcpy((&floatValue), addr, sizeof(floatValue));
[osx]                               ^~~~
[osx] /usr/include/secure/_string.h:65:33: note: expanded from macro 'memcpy'
[osx]   __builtin___memcpy_chk (dest, src, len, __darwin_obsz0 (dest))
[osx]                                 ^
[osx] /builds/workspace/pharo-vm_headless/repository/extracted/plugins/IA32ABI/src/common/IA32ABI.c:795:9: warning: incompatible integer to pointer conversion passing 'sqInt' (aka 'long') to parameter of type 'const void *' [-Wint-conversion]
[osx]         memcpy(addr, (&floatValue), sizeof(floatValue));
[osx]                ^~~~
[osx] /usr/include/secure/_string.h:65:59: note: expanded from macro 'memcpy'
[osx]   __builtin___memcpy_chk (dest, src, len, __darwin_obsz0 (dest))
[osx]                                                           ^
[osx] /usr/include/secure/_common.h:38:55: note: expanded from macro '__darwin_obsz0'
[osx] #define __darwin_obsz0(object) __builtin_object_size (object, 0)
[osx]                                                       ^
[osx] /builds/workspace/pharo-vm_headless/repository/extracted/plugins/IA32ABI/src/common/IA32ABI.c:795:9: warning: incompatible integer to pointer conversion passing 'sqInt' (aka 'long') to parameter of type 'void *' [-Wint-conversion]
[osx]         memcpy(addr, (&floatValue), sizeof(floatValue));
[osx]                ^~~~
[osx] /usr/include/secure/_string.h:65:27: note: expanded from macro 'memcpy'
[osx]   __builtin___memcpy_chk (dest, src, len, __darwin_obsz0 (dest))
[osx]                           ^
[osx] /builds/workspace/pharo-vm_headless/repository/extracted/plugins/IA32ABI/src/common/IA32ABI.c:840:24: warning: incompatible integer to pointer conversion passing 'sqInt' (aka 'long') to parameter of type 'const void *' [-Wint-conversion]
[osx]         memcpy((&floatValue), addr, sizeof(floatValue));
[osx]                               ^~~~
[osx] /usr/include/secure/_string.h:65:33: note: expanded from macro 'memcpy'
[osx]   __builtin___memcpy_chk (dest, src, len, __darwin_obsz0 (dest))
[osx]                                 ^
[osx] /builds/workspace/pharo-vm_headless/repository/extracted/plugins/IA32ABI/src/common/IA32ABI.c:887:9: warning: incompatible integer to pointer conversion passing 'sqInt' (aka 'long') to parameter of type 'const void *' [-Wint-conversion]
[osx]         memcpy(addr, (&floatValue), sizeof(floatValue));
[osx]                ^~~~
[osx] /usr/include/secure/_string.h:65:59: note: expanded from macro 'memcpy'
[osx]   __builtin___memcpy_chk (dest, src, len, __darwin_obsz0 (dest))
[osx]                                                           ^
[osx] /usr/include/secure/_common.h:38:55: note: expanded from macro '__darwin_obsz0'
[osx] #define __darwin_obsz0(object) __builtin_object_size (object, 0)
[osx]                                                       ^
[osx] /builds/workspace/pharo-vm_headless/repository/extracted/plugins/IA32ABI/src/common/IA32ABI.c:887:9: warning: incompatible integer to pointer conversion passing 'sqInt' (aka 'long') to parameter of type 'void *' [-Wint-conversion]
[osx]         memcpy(addr, (&floatValue), sizeof(floatValue));
[osx]                ^~~~
[osx] /usr/include/secure/_string.h:65:27: note: expanded from macro 'memcpy'
[osx]   __builtin___memcpy_chk (dest, src, len, __darwin_obsz0 (dest))
[osx]                           ^
[Pipeline] [windows] }
[Pipeline] [windows] // withEnv
[osx] /builds/workspace/pharo-vm_headless/repository/extracted/plugins/IA32ABI/src/common/IA32ABI.c:2253:34: warning: incompatible pointer types assigning to 'sqInt (*)(sqInt, VMCallbackContext *, sqInt)' from 'sqInt (*)(int, vmccp, sqInt)' [-Wincompatible-pointer-types]
[osx]                 returnAsThroughCallbackContext = interpreterProxy->returnAsThroughCallbackContext;
[osx]                                                ^ ~~~~~~~~~~~~~~~~~~~~~~~~~~~~~~~~~~~~~~~~~~~~~~~~
[Pipeline] [windows] }
[Pipeline] [windows] // stage
[Pipeline] [windows] }
[osx] 7 warnings generated.
[osx] [ 85%] Building C object CMakeFiles/IA32ABI.dir/extracted/plugins/IA32ABI/src/common/AlienSUnitTestProcedures.c.o
[Pipeline] [windows] // timeout
[Pipeline] [windows] }
[osx] [ 86%] Building C object CMakeFiles/IA32ABI.dir/extracted/plugins/IA32ABI/src/common/xabicc.c.o
[Pipeline] [windows] // node
[Pipeline] [windows] }
[windows] Failed in branch windows
[osx] In file included from /builds/workspace/pharo-vm_headless/repository/extracted/plugins/IA32ABI/src/common/xabicc.c:16:
[osx] /builds/workspace/pharo-vm_headless/repository/extracted/plugins/IA32ABI/src/common/x64sysvabicc.c:283:18: warning: implicit declaration of function 'getpagesize' is invalid in C99 [-Wimplicit-function-declaration]
[osx]         long pagesize = getpagesize();
[osx]                         ^
[osx] 1 warning generated.
[osx] [ 86%] Linking C shared library build/vm/libIA32ABI.dylib
[osx] [ 86%] Built target IA32ABI
[osx] Scanning dependencies of target SecurityPlugin
[osx] [ 87%] Building C object CMakeFiles/SecurityPlugin.dir/plugins/SecurityPlugin/common/DummySecurityPlugin.c.o
[osx] [ 87%] Linking C shared library build/vm/libSecurityPlugin.dylib
[osx] [ 87%] Built target SecurityPlugin
[osx] Scanning dependencies of target LocalePlugin
[osx] [ 88%] Building C object CMakeFiles/LocalePlugin.dir/extracted/plugins/LocalePlugin/src/common/LocalePlugin.c.o
[osx] [ 88%] Building C object CMakeFiles/LocalePlugin.dir/extracted/plugins/LocalePlugin/src/osx/sqIOSLocale.c.o
[osx] /builds/workspace/pharo-vm_headless/repository/extracted/plugins/LocalePlugin/src/osx/sqIOSLocale.c:133:17: warning: incompatible integer to pointer conversion passing 'time_t' (aka 'long') to parameter of type 'time_t *' (aka 'long *') [-Wint-conversion]
[osx]         theTime = time((time_t)NULL);
[osx]                        ^~~~~~~~~~~~
[osx] /usr/include/time.h:118:21: note: passing argument to parameter here
[osx] time_t time(time_t *);
[osx]                     ^
[osx] 1 warning generated.
[osx] [ 89%] Linking C shared library build/vm/libLocalePlugin.dylib
[osx] [ 89%] Built target LocalePlugin
[osx] Scanning dependencies of target SurfacePlugin
[osx] [ 90%] Building C object CMakeFiles/SurfacePlugin.dir/extracted/plugins/SurfacePlugin/src/common/SurfacePlugin.c.o
[osx] /builds/workspace/pharo-vm_headless/repository/extracted/plugins/SurfacePlugin/src/common/SurfacePlugin.c:135:3: warning: expression result unused [-Wunused-value]
[osx]                 -1;
[osx]                 ^~
[osx] 1 warning generated.
[osx] [ 90%] Linking C shared library build/vm/libSurfacePlugin.dylib
[osx] [ 90%] Built target SurfacePlugin
[osx] Scanning dependencies of target DSAPrims
[osx] [ 91%] Building C object CMakeFiles/DSAPrims.dir/extracted/plugins/DSAPrims/src/common/DSAPrims.c.o
[osx] [ 92%] Linking C shared library build/vm/libDSAPrims.dylib
[osx] [ 92%] Built target DSAPrims
[osx] Scanning dependencies of target SocketPlugin
[osx] [ 93%] Building C object CMakeFiles/SocketPlugin.dir/extracted/plugins/SocketPlugin/src/common/SocketPlugin.c.o
[osx] /builds/workspace/pharo-vm_headless/repository/extracted/plugins/SocketPlugin/src/common/SocketPlugin.c:2399:3: warning: pointer/integer type mismatch in conditional expression ('SocketPtr' (aka 'SQSocket *') and 'int') [-Wconditional-type-mismatch]
[osx]                 ? ((SocketPtr) (firstIndexableField(socketOop)))
[osx]                 ^ ~~~~~~~~~~~~~~~~~~~~~~~~~~~~~~~~~~~~~~~~~~~~~~
[osx] 1 warning generated.
[osx] [ 94%] Building C object CMakeFiles/SocketPlugin.dir/extracted/plugins/SocketPlugin/src/unix/sqUnixSocket.c.o
[osx] [ 94%] Linking C shared library build/vm/libSocketPlugin.dylib
[osx] [ 94%] Built target SocketPlugin
[osx] Scanning dependencies of target UUIDPlugin
[osx] [ 95%] Building C object CMakeFiles/UUIDPlugin.dir/plugins/UUIDPlugin/common/UUIDPlugin.c.o
[osx] /builds/workspace/pharo-vm_headless/repository/plugins/UUIDPlugin/common/UUIDPlugin.c:110:1: warning: control reaches end of non-void function [-Wreturn-type]
[osx] }
[osx] ^
[osx] 1 warning generated.
[osx] [ 96%] Linking C shared library build/vm/libUUIDPlugin.dylib
[osx] [ 96%] Built target UUIDPlugin
[osx] Scanning dependencies of target SqueakFFIPrims
[osx] [ 97%] Building C object CMakeFiles/SqueakFFIPrims.dir/extracted/plugins/SqueakFFIPrims/src/common/SqueakFFIPrims.c.o
[osx] In file included from /builds/workspace/pharo-vm_headless/repository/extracted/plugins/SqueakFFIPrims/src/common/SqueakFFIPrims.c:23:
[osx] /builds/workspace/pharo-vm_headless/repository/extracted/plugins/SqueakFFIPrims/src/common/X64SysVFFIPlugin.c:903:19: warning: incompatible pointer to integer conversion passing 'void *' to parameter of type 'sqInt' (aka 'long') [-Wint-conversion]
[osx]                         if (isInMemory(ptrAddress)) {
[osx]                                        ^~~~~~~~~~
[osx] /builds/workspace/pharo-vm_headless/repository/extracted/plugins/SqueakFFIPrims/src/common/X64SysVFFIPlugin.c:1156:19: warning: incompatible pointer to integer conversion passing 'void *' to parameter of type 'sqInt' (aka 'long') [-Wint-conversion]
[osx]                         if (isInMemory(ptrAddress)) {
[osx]                                        ^~~~~~~~~~
[osx] /builds/workspace/pharo-vm_headless/repository/extracted/plugins/SqueakFFIPrims/src/common/X64SysVFFIPlugin.c:2984:18: warning: incompatible pointer to integer conversion passing 'void *' to parameter of type 'sqInt' (aka 'long') [-Wint-conversion]
[osx]                 if (isInMemory(ptrAddress)) {
[osx]                                ^~~~~~~~~~
[osx] /builds/workspace/pharo-vm_headless/repository/extracted/plugins/SqueakFFIPrims/src/common/X64SysVFFIPlugin.c:3037:14: warning: incompatible integer to pointer conversion assigning to 'void *' from 'long' [-Wint-conversion]
[osx]                 ptrAddress = ((longAt(oop + BaseHeaderSize)) > 0
[osx]                            ^ ~~~~~~~~~~~~~~~~~~~~~~~~~~~~~~~~~~~
[osx] /builds/workspace/pharo-vm_headless/repository/extracted/plugins/SqueakFFIPrims/src/common/X64SysVFFIPlugin.c:3277:18: warning: incompatible pointer to integer conversion passing 'void *' to parameter of type 'sqInt' (aka 'long') [-Wint-conversion]
[osx]                 if (isInMemory(ptrAddress)) {
[osx]                                ^~~~~~~~~~
[osx] /builds/workspace/pharo-vm_headless/repository/extracted/plugins/SqueakFFIPrims/src/common/X64SysVFFIPlugin.c:3530:18: warning: incompatible pointer to integer conversion passing 'void *' to parameter of type 'sqInt' (aka 'long') [-Wint-conversion]
[osx]                 if (isInMemory(ptrAddress)) {
[osx]                                ^~~~~~~~~~
[osx] /builds/workspace/pharo-vm_headless/repository/extracted/plugins/SqueakFFIPrims/src/common/X64SysVFFIPlugin.c:6596:21: warning: incompatible pointer types assigning to 'sqInt (*)(sqInt)' from 'sqInt (*)(int)' [-Wincompatible-pointer-types]
[osx]                 characterObjectOf = interpreterProxy->characterObjectOf;
[osx]                                   ^ ~~~~~~~~~~~~~~~~~~~~~~~~~~~~~~~~~~~
[osx] 7 warnings generated.
[osx] [ 98%] Building C object CMakeFiles/SqueakFFIPrims.dir/extracted/plugins/SqueakFFIPrims/src/common/sqManualSurface.c.o
[osx] [ 99%] Building C object CMakeFiles/SqueakFFIPrims.dir/extracted/plugins/SqueakFFIPrims/src/common/sqFFIPlugin.c.o
[osx] [ 99%] Building C object CMakeFiles/SqueakFFIPrims.dir/extracted/plugins/SqueakFFIPrims/src/common/sqFFITestFuncs.c.o
[osx] [100%] Linking C shared library build/vm/libSqueakFFIPrims.dylib
[osx] [100%] Built target SqueakFFIPrims
[osx] Install the project...
[osx] -- Install configuration: ""
[osx] -- Installing: /builds/workspace/pharo-vm_headless/build/build/dist/Pharo.app/Contents/MacOS
[osx] -- Installing: /builds/workspace/pharo-vm_headless/build/build/dist/Pharo.app/Contents/MacOS/Pharo
[osx] -- Installing: /builds/workspace/pharo-vm_headless/build/build/dist/Pharo.app/Contents/MacOS/Plugins
[osx] -- Installing: /builds/workspace/pharo-vm_headless/build/build/dist/Pharo.app/Contents/MacOS/Plugins/libB2DPlugin.dylib
[osx] -- Installing: /builds/workspace/pharo-vm_headless/build/build/dist/Pharo.app/Contents/MacOS/Plugins/libBitBltPlugin.dylib
[osx] -- Installing: /builds/workspace/pharo-vm_headless/build/build/dist/Pharo.app/Contents/MacOS/Plugins/libcairo.2.dylib
[osx] -- Installing: /builds/workspace/pharo-vm_headless/build/build/dist/Pharo.app/Contents/MacOS/Plugins/libcairo.dylib
[osx] -- Installing: /builds/workspace/pharo-vm_headless/build/build/dist/Pharo.app/Contents/MacOS/Plugins/libcrypto.1.0.0.dylib
[osx] -- Installing: /builds/workspace/pharo-vm_headless/build/build/dist/Pharo.app/Contents/MacOS/Plugins/libDSAPrims.dylib
[osx] -- Installing: /builds/workspace/pharo-vm_headless/build/build/dist/Pharo.app/Contents/MacOS/Plugins/libffi.7.dylib
[osx] -- Installing: /builds/workspace/pharo-vm_headless/build/build/dist/Pharo.app/Contents/MacOS/Plugins/libFileAttributesPlugin.dylib
[osx] -- Installing: /builds/workspace/pharo-vm_headless/build/build/dist/Pharo.app/Contents/MacOS/Plugins/libFilePlugin.dylib
[osx] -- Installing: /builds/workspace/pharo-vm_headless/build/build/dist/Pharo.app/Contents/MacOS/Plugins/libfreetype.6.dylib
[osx] -- Installing: /builds/workspace/pharo-vm_headless/build/build/dist/Pharo.app/Contents/MacOS/Plugins/libfreetype.dylib
[osx] -- Installing: /builds/workspace/pharo-vm_headless/build/build/dist/Pharo.app/Contents/MacOS/Plugins/libgit2.0.25.1.dylib
[osx] -- Installing: /builds/workspace/pharo-vm_headless/build/build/dist/Pharo.app/Contents/MacOS/Plugins/libgit2.25.dylib
[osx] -- Installing: /builds/workspace/pharo-vm_headless/build/build/dist/Pharo.app/Contents/MacOS/Plugins/libgit2.dylib
[osx] -- Installing: /builds/workspace/pharo-vm_headless/build/build/dist/Pharo.app/Contents/MacOS/Plugins/libIA32ABI.dylib
[osx] -- Installing: /builds/workspace/pharo-vm_headless/build/build/dist/Pharo.app/Contents/MacOS/Plugins/libJPEGReaderPlugin.dylib
[osx] -- Installing: /builds/workspace/pharo-vm_headless/build/build/dist/Pharo.app/Contents/MacOS/Plugins/libJPEGReadWriter2Plugin.dylib
[osx] -- Installing: /builds/workspace/pharo-vm_headless/build/build/dist/Pharo.app/Contents/MacOS/Plugins/libLargeIntegers.dylib
[osx] -- Installing: /builds/workspace/pharo-vm_headless/build/build/dist/Pharo.app/Contents/MacOS/Plugins/libLocalePlugin.dylib
[osx] -- Installing: /builds/workspace/pharo-vm_headless/build/build/dist/Pharo.app/Contents/MacOS/Plugins/libMiscPrimitivePlugin.dylib
[osx] -- Installing: /builds/workspace/pharo-vm_headless/build/build/dist/Pharo.app/Contents/MacOS/Plugins/libPharoVMCore.dylib
[osx] -- Installing: /builds/workspace/pharo-vm_headless/build/build/dist/Pharo.app/Contents/MacOS/Plugins/libpixman-1.0.dylib
[osx] -- Installing: /builds/workspace/pharo-vm_headless/build/build/dist/Pharo.app/Contents/MacOS/Plugins/libpixman-1.dylib
[osx] -- Installing: /builds/workspace/pharo-vm_headless/build/build/dist/Pharo.app/Contents/MacOS/Plugins/libpng12.0.dylib
[osx] -- Installing: /builds/workspace/pharo-vm_headless/build/build/dist/Pharo.app/Contents/MacOS/Plugins/libpng12.dylib
[osx] -- Installing: /builds/workspace/pharo-vm_headless/build/build/dist/Pharo.app/Contents/MacOS/Plugins/libPThreadedPlugin.dylib
[osx] -- Installing: /builds/workspace/pharo-vm_headless/build/build/dist/Pharo.app/Contents/MacOS/Plugins/libSDL2-2.0.0.dylib
[osx] -- Installing: /builds/workspace/pharo-vm_headless/build/build/dist/Pharo.app/Contents/MacOS/Plugins/libSDL2.dylib
[osx] -- Installing: /builds/workspace/pharo-vm_headless/build/build/dist/Pharo.app/Contents/MacOS/Plugins/libSecurityPlugin.dylib
[osx] -- Installing: /builds/workspace/pharo-vm_headless/build/build/dist/Pharo.app/Contents/MacOS/Plugins/libSocketPlugin.dylib
[osx] -- Installing: /builds/workspace/pharo-vm_headless/build/build/dist/Pharo.app/Contents/MacOS/Plugins/libSqueakFFIPrims.dylib
[osx] -- Installing: /builds/workspace/pharo-vm_headless/build/build/dist/Pharo.app/Contents/MacOS/Plugins/libSqueakSSL.dylib
[osx] -- Installing: /builds/workspace/pharo-vm_headless/build/build/dist/Pharo.app/Contents/MacOS/Plugins/libssh2.1.dylib
[osx] -- Installing: /builds/workspace/pharo-vm_headless/build/build/dist/Pharo.app/Contents/MacOS/Plugins/libssh2.dylib
[osx] -- Installing: /builds/workspace/pharo-vm_headless/build/build/dist/Pharo.app/Contents/MacOS/Plugins/libssl.1.0.0.dylib
[osx] -- Installing: /builds/workspace/pharo-vm_headless/build/build/dist/Pharo.app/Contents/MacOS/Plugins/libssl.dylib
[osx] -- Installing: /builds/workspace/pharo-vm_headless/build/build/dist/Pharo.app/Contents/MacOS/Plugins/libSurfacePlugin.dylib
[osx] -- Installing: /builds/workspace/pharo-vm_headless/build/build/dist/Pharo.app/Contents/MacOS/Plugins/libUnixOSProcessPlugin.dylib
[osx] -- Installing: /builds/workspace/pharo-vm_headless/build/build/dist/Pharo.app/Contents/MacOS/Plugins/libUUIDPlugin.dylib
[osx] -- Installing: /builds/workspace/pharo-vm_headless/build/build/dist/Pharo.app/Contents/Info.plist
[osx] -- Installing: /builds/workspace/pharo-vm_headless/build/build/dist/Pharo.app/Contents/Resources/Pharo.icns
[osx] -- Installing: /builds/workspace/pharo-vm_headless/build/build/dist/include/sq.h
[osx] -- Installing: /builds/workspace/pharo-vm_headless/build/build/dist/include/sqMemoryAccess.h
[osx] -- Installing: /builds/workspace/pharo-vm_headless/build/build/dist/include/sqVirtualMachine.h
[osx] -- Installing: /builds/workspace/pharo-vm_headless/build/build/dist/include/interp.h
[osx] -- Installing: /builds/workspace/pharo-vm_headless/build/build/dist/include/vmCallback.h
[osx] -- Installing: /builds/workspace/pharo-vm_headless/build/build/dist/include/config.h
[Pipeline] [osx] sh
[osx] + make package
[osx] [ 15%] Built target PharoVMCore
[osx] [ 18%] Built target Pharo
[osx] [ 19%] Built target SDL2-2.0.7
[osx] [ 21%] Built target libgit2-0.25.1
[osx] [ 23%] Built target freetype-2.9.1
[osx] [ 25%] Built target SqueakSSL
[osx] [ 26%] Built target cairo-1.15.4
[osx] [ 27%] Built target B2DPlugin
[osx] [ 29%] Built target pthreadedPlugin-0.0.1
[osx] [ 34%] Built target FilePlugin
[osx] [ 35%] Built target UnixOSProcessPlugin
[osx] [ 36%] Built target libffi-3.3-rc0
[osx] [ 37%] Built target MiscPrimitivePlugin
[osx] [ 39%] Built target JPEGReaderPlugin
[osx] [ 40%] Built target pixman-0.34.0
[osx] [ 41%] Built target BitBltPlugin
[osx] [ 42%] Built target libssh2-1.7.0
[osx] [ 43%] Built target LargeIntegers
[osx] [ 45%] Built target openssl-1.0.2q
[osx] [ 81%] Built target JPEGReadWriter2Plugin
[osx] [ 83%] Built target FileAttributesPlugin
[osx] [ 84%] Built target libpng-1.2.49
[osx] [ 86%] Built target IA32ABI
[osx] [ 87%] Built target SecurityPlugin
[osx] [ 89%] Built target LocalePlugin
[osx] [ 90%] Built target SurfacePlugin
[osx] [ 92%] Built target DSAPrims
[osx] [ 94%] Built target SocketPlugin
[osx] [ 96%] Built target UUIDPlugin
[osx] [100%] Built target SqueakFFIPrims
[osx] Run CPack packaging tool...
[osx] CPack: Create package using ZIP
[osx] CPack: Install projects
[osx] CPack: - Run preinstall target for: PharoVM
[osx] CPack: - Install project: PharoVM
[osx] CPack: -   Install component: bin
[osx] CPack: -   Install component: include
[osx] CPack: Create package
[StackVM] 16 warnings generated.
[StackVM] [  6%] Building C object CMakeFiles/PharoVMCore.dir/extracted/vm/src/common/sqHeapMap.c.o
[StackVM] [  7%] Building C object CMakeFiles/PharoVMCore.dir/extracted/vm/src/common/sqVirtualMachine.c.o
[StackVM] /builds/workspace/pharo-vm_headless@2/repository/extracted/vm/src/common/sqVirtualMachine.c:431:37: warning: incompatible pointer types assigning to 'void *(*)(sqInt, sqInt, sqInt)' from 'void *(sqInt, sqInt, void *)' [-Wincompatible-pointer-types]
[StackVM]         VM->ioLoadSymbolOfLengthFromModule = ioLoadSymbolOfLengthFromModule;
[StackVM]                                            ^ ~~~~~~~~~~~~~~~~~~~~~~~~~~~~~~
[StackVM] /builds/workspace/pharo-vm_headless@2/repository/extracted/vm/src/common/sqVirtualMachine.c:509:22: warning: incompatible pointer types assigning to 'volatile unsigned long (*)(void)' from 'volatile unsigned long long (void)' [-Wincompatible-pointer-types]
[StackVM]         VM->utcMicroseconds = ioUTCMicroseconds;
[StackVM]                             ^ ~~~~~~~~~~~~~~~~~
[StackVM] 2 warnings generated.
[StackVM] [  8%] Building C object CMakeFiles/PharoVMCore.dir/extracted/vm/src/common/sqNamedPrims.c.o
[StackVM] [  9%] Building C object CMakeFiles/PharoVMCore.dir/extracted/vm/src/common/sqExternalSemaphores.c.o
[osx] CPack: - package: /builds/workspace/pharo-vm_headless/build/build/packages/PharoVM-8.1.0-5916a0a-mac64-bin.zip generated.
[osx] CPack: - checksum file: /builds/workspace/pharo-vm_headless/build/build/packages/PharoVM-8.1.0-5916a0a-mac64-bin.zip.sha1 generated.
[osx] CPack: - package: /builds/workspace/pharo-vm_headless/build/build/packages/PharoVM-8.1.0-5916a0a-mac64-include.zip generated.
[osx] CPack: - checksum file: /builds/workspace/pharo-vm_headless/build/build/packages/PharoVM-8.1.0-5916a0a-mac64-include.zip.sha1 generated.
[Pipeline] [osx] }
[Pipeline] [osx] // dir
[StackVM] [  9%] Building C object CMakeFiles/PharoVMCore.dir/extracted/vm/src/common/sqTicker.c.o
[StackVM] [ 10%] Building C object CMakeFiles/PharoVMCore.dir/extracted/vm/src/unix/aio.c.o
[Pipeline] [osx] stash
[StackVM] [ 11%] Building C object CMakeFiles/PharoVMCore.dir/extracted/vm/src/unix/sqUnixHeartbeat.c.o
[StackVM] [ 11%] Building C object CMakeFiles/PharoVMCore.dir/src/debugUnix.c.o
[StackVM] /builds/workspace/pharo-vm_headless@2/repository/src/debugUnix.c:304:2: warning: implicit declaration of function 'dumpPrimTraceLog' is invalid in C99 [-Wimplicit-function-declaration]
[StackVM]         dumpPrimTraceLog();
[StackVM]         ^
[StackVM] 1 warning generated.
[StackVM] [ 12%] Building CXX object CMakeFiles/PharoVMCore.dir/src/utilsMac.mm.o
[osx] Stashed 4 file(s)
[Pipeline] [osx] archiveArtifacts
[StackVM] [ 13%] Building C object CMakeFiles/PharoVMCore.dir/src/memoryUnix.c.o
[StackVM] [ 13%] Linking CXX shared library build/vm/libPharoVMCore.dylib
[StackVM] [ 13%] Built target PharoVMCore
[StackVM] Scanning dependencies of target Pharo
[StackVM] [ 13%] Building C object CMakeFiles/Pharo.dir/src/main.c.o
[StackVM] [ 14%] Building C object CMakeFiles/Pharo.dir/src/parameters.c.o
[StackVM] [ 15%] Building CXX object CMakeFiles/Pharo.dir/src/macOpenFileDialog.mm.o
[osx] Archiving artifacts
[Pipeline] [osx] }
[Pipeline] [osx] // stage
[Pipeline] [osx] }
[Pipeline] [osx] // timeout
[Pipeline] [osx] }
[Pipeline] [osx] // node
[Pipeline] [osx] }
[StackVM] [ 16%] Linking CXX executable build/vm/Pharo
[StackVM] [ 16%] Built target Pharo
[StackVM] Scanning dependencies of target SDL2-2.0.7
[StackVM] [ 17%] Generating build/third-party/SDL2-2.0.7.zip
[StackVM] --2019-09-10 16:35:02--  https://files.pharo.org/vm/pharo-spur64/mac/third-party/SDL2-2.0.7.zip
[StackVM] Resolving files.pharo.org... 164.132.235.17, 2001:41d0:301::23
[StackVM] Connecting to files.pharo.org|164.132.235.17|:443... connected.
[StackVM] HTTP request sent, awaiting response... 200 OK
[StackVM] Length: 961356 (939K) [application/zip]
[StackVM] Saving to: 'SDL2-2.0.7.zip'
[StackVM] 
[StackVM]      0K .......... .......... .......... .......... ..........  5% 3.81M 0s
[StackVM]     50K .......... .......... .......... .......... .......... 10% 10.8M 0s
[StackVM]    100K .......... .......... .......... .......... .......... 15% 21.4M 0s
[StackVM]    150K .......... .......... .......... .......... .......... 21% 14.7M 0s
[StackVM]    200K .......... .......... .......... .......... .......... 26% 17.3M 0s
[StackVM]    250K .......... .......... .......... .......... .......... 31% 14.3M 0s
[StackVM]    300K .......... .......... .......... .......... .......... 37% 21.8M 0s
[StackVM]    350K .......... .......... .......... .......... .......... 42% 14.6M 0s
[StackVM]    400K .......... .......... .......... .......... .......... 47% 39.7M 0s
[StackVM]    450K .......... .......... .......... .......... .......... 53% 19.4M 0s
[StackVM]    500K .......... .......... .......... .......... .......... 58% 11.3M 0s
[StackVM]    550K .......... .......... .......... .......... .......... 63% 14.8M 0s
[StackVM]    600K .......... .......... .......... .......... .......... 69% 24.5M 0s
[StackVM]    650K .......... .......... .......... .......... .......... 74% 32.4M 0s
[StackVM]    700K .......... .......... .......... .......... .......... 79% 19.1M 0s
[StackVM]    750K .......... .......... .......... .......... .......... 85% 27.3M 0s
[StackVM]    800K .......... .......... .......... .......... .......... 90% 18.4M 0s
[StackVM]    850K .......... .......... .......... .......... .......... 95% 20.6M 0s
[StackVM]    900K .......... .......... .......... ........             100% 29.2M=0.06s
[StackVM] 
[StackVM] 2019-09-10 16:35:03 (15.2 MB/s) - 'SDL2-2.0.7.zip' saved [961356/961356]
[StackVM] 
[StackVM] [ 18%] Generating build/third-party/SDL2-2.0.7.done
[StackVM] Archive:  SDL2-2.0.7.zip
[StackVM]   inflating: /builds/workspace/pharo-vm_headless@2/build/build/vm/libSDL2-2.0.0.dylib  
[StackVM]   inflating: /builds/workspace/pharo-vm_headless@2/build/build/vm/libSDL2.dylib  
[StackVM] [ 18%] Built target SDL2-2.0.7
[StackVM] Scanning dependencies of target libgit2-0.25.1
[StackVM] [ 19%] Generating build/third-party/libgit2-0.25.1.zip
[StackVM] --2019-09-10 16:35:03--  https://files.pharo.org/vm/pharo-spur64/mac/third-party/libgit2-0.25.1.zip
[StackVM] Resolving files.pharo.org... 164.132.235.17, 2001:41d0:301::23
[StackVM] Connecting to files.pharo.org|164.132.235.17|:443... connected.
[StackVM] HTTP request sent, awaiting response... 200 OK
[StackVM] Length: 1846137 (1.8M) [application/zip]
[StackVM] Saving to: 'libgit2-0.25.1.zip'
[StackVM] 
[StackVM]      0K .......... .......... .......... .......... ..........  2% 4.11M 0s
[StackVM]     50K .......... .......... .......... .......... ..........  5% 6.17M 0s
[StackVM]    100K .......... .......... .......... .......... ..........  8% 52.8M 0s
[StackVM]    150K .......... .......... .......... .......... .......... 11% 7.96M 0s
[StackVM]    200K .......... .......... .......... .......... .......... 13% 12.2M 0s
[StackVM]    250K .......... .......... .......... .......... .......... 16% 18.6M 0s
[StackVM]    300K .......... .......... .......... .......... .......... 19% 9.41M 0s
[StackVM]    350K .......... .......... .......... .......... .......... 22% 41.4M 0s
[StackVM]    400K .......... .......... .......... .......... .......... 24% 33.2M 0s
[StackVM]    450K .......... .......... .......... .......... .......... 27% 7.37M 0s
[StackVM]    500K .......... .......... .......... .......... .......... 30% 18.6M 0s
[StackVM]    550K .......... .......... .......... .......... .......... 33% 22.4M 0s
[StackVM]    600K .......... .......... .......... .......... .......... 36% 43.8M 0s
[StackVM]    650K .......... .......... .......... .......... .......... 38% 13.0M 0s
[StackVM]    700K .......... .......... .......... .......... .......... 41% 18.3M 0s
[StackVM]    750K .......... .......... .......... .......... .......... 44% 56.7M 0s
[StackVM]    800K .......... .......... .......... .......... .......... 47% 13.1M 0s
[StackVM]    850K .......... .......... .......... .......... .......... 49% 26.7M 0s
[StackVM]    900K .......... .......... .......... .......... .......... 52% 17.1M 0s
[StackVM]    950K .......... .......... .......... .......... .......... 55% 34.6M 0s
[StackVM]   1000K .......... .......... .......... .......... .......... 58% 27.7M 0s
[StackVM]   1050K .......... .......... .......... .......... .......... 61% 11.8M 0s
[StackVM]   1100K .......... .......... .......... .......... .......... 63% 30.8M 0s
[StackVM]   1150K .......... .......... .......... .......... .......... 66% 10.1M 0s
[StackVM]   1200K .......... .......... .......... .......... .......... 69% 31.4M 0s
[StackVM]   1250K .......... .......... .......... .......... .......... 72% 55.5M 0s
[StackVM]   1300K .......... .......... .......... .......... .......... 74% 12.6M 0s
[StackVM]   1350K .......... .......... .......... .......... .......... 77% 41.3M 0s
[StackVM]   1400K .......... .......... .......... .......... .......... 80% 32.0M 0s
[StackVM]   1450K .......... .......... .......... .......... .......... 83% 18.3M 0s
[StackVM]   1500K .......... .......... .......... .......... .......... 85% 32.9M 0s
[StackVM]   1550K .......... .......... .......... .......... .......... 88% 22.8M 0s
[StackVM]   1600K .......... .......... .......... .......... .......... 91% 16.4M 0s
[StackVM]   1650K .......... .......... .......... .......... .......... 94% 31.1M 0s
[StackVM]   1700K .......... .......... .......... .......... .......... 97% 13.4M 0s
[StackVM]   1750K .......... .......... .......... .......... .......... 99% 66.4M 0s
[StackVM]   1800K ..                                                    100% 70.0M=0.1s
[StackVM] 
[StackVM] 2019-09-10 16:35:03 (16.4 MB/s) - 'libgit2-0.25.1.zip' saved [1846137/1846137]
[StackVM] 
[StackVM] [ 20%] Generating build/third-party/libgit2-0.25.1.done
[StackVM] Archive:  libgit2-0.25.1.zip
[StackVM]   inflating: /builds/workspace/pharo-vm_headless@2/build/build/vm/libgit2.0.25.1.dylib  
[StackVM]   inflating: /builds/workspace/pharo-vm_headless@2/build/build/vm/libgit2.25.dylib  
[StackVM]   inflating: /builds/workspace/pharo-vm_headless@2/build/build/vm/libgit2.dylib  
[StackVM] [ 20%] Built target libgit2-0.25.1
[StackVM] Scanning dependencies of target freetype-2.9.1
[StackVM] [ 21%] Generating build/third-party/freetype-2.9.1.zip
[StackVM] --2019-09-10 16:35:03--  https://files.pharo.org/vm/pharo-spur64/mac/third-party/freetype-2.9.1.zip
[StackVM] Resolving files.pharo.org... 164.132.235.17, 2001:41d0:301::23
[StackVM] Connecting to files.pharo.org|164.132.235.17|:443... connected.
[StackVM] HTTP request sent, awaiting response... 200 OK
[StackVM] Length: 744194 (727K) [application/zip]
[StackVM] Saving to: 'freetype-2.9.1.zip'
[StackVM] 
[StackVM]      0K .......... .......... .......... .......... ..........  6% 4.46M 0s
[StackVM]     50K .......... .......... .......... .......... .......... 13% 6.89M 0s
[StackVM]    100K .......... .......... .......... .......... .......... 20% 32.8M 0s
[StackVM]    150K .......... .......... .......... .......... .......... 27% 27.2M 0s
[StackVM]    200K .......... .......... .......... .......... .......... 34% 11.4M 0s
[StackVM]    250K .......... .......... .......... .......... .......... 41% 11.0M 0s
[StackVM]    300K .......... .......... .......... .......... .......... 48% 14.2M 0s
[StackVM]    350K .......... .......... .......... .......... .......... 55% 38.8M 0s
[StackVM]    400K .......... .......... .......... .......... .......... 61% 11.6M 0s
[StackVM]    450K .......... .......... .......... .......... .......... 68% 36.6M 0s
[StackVM]    500K .......... .......... .......... .......... .......... 75% 38.5M 0s
[StackVM]    550K .......... .......... .......... .......... .......... 82% 9.96M 0s
[StackVM]    600K .......... .......... .......... .......... .......... 89% 42.6M 0s
[StackVM]    650K .......... .......... .......... .......... .......... 96% 72.4M 0s
[StackVM]    700K .......... .......... ......                          100% 4.90M=0.05s
[StackVM] 
[StackVM] 2019-09-10 16:35:03 (13.2 MB/s) - 'freetype-2.9.1.zip' saved [744194/744194]
[StackVM] 
[StackVM] [ 22%] Generating build/third-party/freetype-2.9.1.done
[StackVM] Archive:  freetype-2.9.1.zip
[StackVM]   inflating: /builds/workspace/pharo-vm_headless@2/build/build/vm/libfreetype.6.dylib  
[StackVM]   inflating: /builds/workspace/pharo-vm_headless@2/build/build/vm/libfreetype.dylib  
[StackVM] [ 22%] Built target freetype-2.9.1
[StackVM] Scanning dependencies of target SqueakSSL
[StackVM] [ 22%] Building C object CMakeFiles/SqueakSSL.dir/extracted/plugins/SqueakSSL/src/common/SqueakSSL.c.o
[StackVM] [ 23%] Building C object CMakeFiles/SqueakSSL.dir/extracted/plugins/SqueakSSL/src/osx/sqMacSSL.c.o
[StackVM] [ 24%] Linking C shared library build/vm/libSqueakSSL.dylib
[StackVM] [ 24%] Built target SqueakSSL
[StackVM] Scanning dependencies of target cairo-1.15.4
[StackVM] [ 24%] Generating build/third-party/cairo-1.15.4.zip
[StackVM] --2019-09-10 16:35:04--  https://files.pharo.org/vm/pharo-spur64/mac/third-party/cairo-1.15.4.zip
[StackVM] Resolving files.pharo.org... 164.132.235.17, 2001:41d0:301::23
[StackVM] Connecting to files.pharo.org|164.132.235.17|:443... connected.
[StackVM] HTTP request sent, awaiting response... 200 OK
[StackVM] Length: 1017920 (994K) [application/zip]
[StackVM] Saving to: 'cairo-1.15.4.zip'
[StackVM] 
[StackVM]      0K .......... .......... .......... .......... ..........  5% 4.21M 0s
[StackVM]     50K .......... .......... .......... .......... .......... 10% 8.24M 0s
[StackVM]    100K .......... .......... .......... .......... .......... 15% 16.2M 0s
[StackVM]    150K .......... .......... .......... .......... .......... 20% 8.49M 0s
[StackVM]    200K .......... .......... .......... .......... .......... 25% 15.1M 0s
[StackVM]    250K .......... .......... .......... .......... .......... 30%  101M 0s
[StackVM]    300K .......... .......... .......... .......... .......... 35% 10.3M 0s
[StackVM]    350K .......... .......... .......... .......... .......... 40% 17.4M 0s
[StackVM]    400K .......... .......... .......... .......... .......... 45% 32.3M 0s
[StackVM]    450K .......... .......... .......... .......... .......... 50% 11.9M 0s
[StackVM]    500K .......... .......... .......... .......... .......... 55% 23.5M 0s
[StackVM]    550K .......... .......... .......... .......... .......... 60% 32.1M 0s
[StackVM]    600K .......... .......... .......... .......... .......... 65% 9.52M 0s
[StackVM]    650K .......... .......... .......... .......... .......... 70% 33.7M 0s
[StackVM]    700K .......... .......... .......... .......... .......... 75% 37.9M 0s
[StackVM]    750K .......... .......... .......... .......... .......... 80% 12.2M 0s
[StackVM]    800K .......... .......... .......... .......... .......... 85% 29.5M 0s
[StackVM]    850K .......... .......... .......... .......... .......... 90% 34.5M 0s
[StackVM]    900K .......... .......... .......... .......... .......... 95% 14.9M 0s
[StackVM]    950K .......... .......... .......... .......... ....      100% 32.0M=0.07s
[StackVM] 
[StackVM] 2019-09-10 16:35:04 (14.6 MB/s) - 'cairo-1.15.4.zip' saved [1017920/1017920]
[StackVM] 
[StackVM] [ 25%] Generating build/third-party/cairo-1.15.4.done
[StackVM] Archive:  cairo-1.15.4.zip
[StackVM]   inflating: /builds/workspace/pharo-vm_headless@2/build/build/vm/libcairo.2.dylib  
[StackVM]   inflating: /builds/workspace/pharo-vm_headless@2/build/build/vm/libcairo.dylib  
[StackVM] [ 25%] Built target cairo-1.15.4
[StackVM] Scanning dependencies of target B2DPlugin
[StackVM] [ 25%] Building C object CMakeFiles/B2DPlugin.dir/extracted/plugins/B2DPlugin/src/common/B2DPlugin.c.o
[StackVM] /builds/workspace/pharo-vm_headless@2/repository/extracted/plugins/B2DPlugin/src/common/B2DPlugin.c:13646:18: warning: expression result unused [-Wunused-value]
[StackVM]                 ((signed)lastX >> 8);
[StackVM]                  ~~~~~~~~~~~~~ ^  ~
[StackVM] /builds/workspace/pharo-vm_headless@2/repository/extracted/plugins/B2DPlugin/src/common/B2DPlugin.c:13676:18: warning: expression result unused [-Wunused-value]
[StackVM]         ((signed)lastX1 >> 8);
[StackVM]          ~~~~~~~~~~~~~~ ^  ~
[StackVM] 2 warnings generated.
[StackVM] [ 26%] Linking C shared library build/vm/libB2DPlugin.dylib
[StackVM] [ 26%] Built target B2DPlugin
[StackVM] Scanning dependencies of target pthreadedPlugin-0.0.1
[StackVM] [ 27%] Generating build/third-party/pthreadedPlugin-0.0.1.zip
[StackVM] --2019-09-10 16:35:06--  https://files.pharo.org/vm/pharo-spur64/mac/third-party/pthreadedPlugin-0.0.1.zip
[StackVM] Resolving files.pharo.org... 164.132.235.17, 2001:41d0:301::23
[StackVM] Connecting to files.pharo.org|164.132.235.17|:443... connected.
[StackVM] HTTP request sent, awaiting response... 200 OK
[StackVM] Length: 438839 (429K) [application/zip]
[StackVM] Saving to: 'pthreadedPlugin-0.0.1.zip'
[StackVM] 
[StackVM]      0K .......... .......... .......... .......... .......... 11% 4.05M 0s
[StackVM]     50K .......... .......... .......... .......... .......... 23% 8.95M 0s
[StackVM]    100K .......... .......... .......... .......... .......... 35% 29.4M 0s
[StackVM]    150K .......... .......... .......... .......... .......... 46% 12.0M 0s
[StackVM]    200K .......... .......... .......... .......... .......... 58% 27.6M 0s
[StackVM]    250K .......... .......... .......... .......... .......... 70% 36.7M 0s
[StackVM]    300K .......... .......... .......... .......... .......... 81% 11.7M 0s
[StackVM]    350K .......... .......... .......... .......... .......... 93% 33.0M 0s
[StackVM]    400K .......... .......... ........                        100% 25.3M=0.03s
[StackVM] 
[StackVM] 2019-09-10 16:35:07 (12.6 MB/s) - 'pthreadedPlugin-0.0.1.zip' saved [438839/438839]
[StackVM] 
[StackVM] [ 28%] Generating build/third-party/pthreadedPlugin-0.0.1.done
[StackVM] Archive:  pthreadedPlugin-0.0.1.zip
[StackVM]   inflating: /builds/workspace/pharo-vm_headless@2/build/build/vm/cygffi-7.dll  
[StackVM]   inflating: /builds/workspace/pharo-vm_headless@2/build/build/vm/PThreadedPlugin.dll  
[StackVM]   inflating: /builds/workspace/pharo-vm_headless@2/build/build/vm/libPThreadedPlugin.dylib  
[StackVM] [ 28%] Built target pthreadedPlugin-0.0.1
[StackVM] Scanning dependencies of target FilePlugin
[StackVM] [ 29%] Building C object CMakeFiles/FilePlugin.dir/extracted/plugins/FilePlugin/src/common/FilePlugin.c.o
[StackVM] /builds/workspace/pharo-vm_headless@2/repository/extracted/plugins/FilePlugin/src/common/FilePlugin.c:579:10: warning: incompatible integer to pointer conversion returning 'sqInt' (aka 'long') from a function with result type 'void *' [-Wint-conversion]
[StackVM]                 return primitiveFailFor(PrimErrBadArgument);
[StackVM]                        ^~~~~~~~~~~~~~~~~~~~~~~~~~~~~~~~~~~~
[StackVM] /builds/workspace/pharo-vm_headless@2/repository/extracted/plugins/FilePlugin/src/common/FilePlugin.c:1735:21: warning: incompatible pointer types assigning to 'sqInt (*)(sqInt)' from 'sqInt (*)(int)' [-Wincompatible-pointer-types]
[StackVM]                 characterObjectOf = interpreterProxy->characterObjectOf;
[StackVM]                                   ^ ~~~~~~~~~~~~~~~~~~~~~~~~~~~~~~~~~~~
[StackVM] /builds/workspace/pharo-vm_headless@2/repository/extracted/plugins/FilePlugin/src/common/FilePlugin.c:1749:10: warning: incompatible pointer types assigning to 'sqInt (*)(void)' from 'void (*)(void)' [-Wincompatible-pointer-types]
[StackVM]                 fullGC = interpreterProxy->fullGC;
[StackVM]                        ^ ~~~~~~~~~~~~~~~~~~~~~~~~
[StackVM] 3 warnings generated.
[StackVM] [ 30%] Building C object CMakeFiles/FilePlugin.dir/extracted/plugins/FilePlugin/src/common/sqFilePluginBasicPrims.c.o
[StackVM] [ 31%] Building C object CMakeFiles/FilePlugin.dir/extracted/plugins/FilePlugin/src/unix/sqUnixFile.c.o
[StackVM] [ 31%] Building C object CMakeFiles/FilePlugin.dir/extracted/vm/src/unix/sqUnixCharConv.c.o
[StackVM] [ 32%] Building C object CMakeFiles/FilePlugin.dir/src/fileUtils.c.o
[StackVM] [ 33%] Linking C shared library build/vm/libFilePlugin.dylib
[StackVM] [ 33%] Built target FilePlugin
[StackVM] Scanning dependencies of target UnixOSProcessPlugin
[StackVM] [ 33%] Building C object CMakeFiles/UnixOSProcessPlugin.dir/extracted/plugins/UnixOSProcessPlugin/src/common/UnixOSProcessPlugin.c.o
[StackVM] /builds/workspace/pharo-vm_headless@2/repository/extracted/plugins/UnixOSProcessPlugin/src/common/UnixOSProcessPlugin.c:461:2: warning: expression result unused [-Wunused-value]
[StackVM]         (char *) strncpy (cString, sPtr, len);
[StackVM]         ^        ~~~~~~~~~~~~~~~~~~~~~~~~~~~~
[StackVM] /builds/workspace/pharo-vm_headless@2/repository/extracted/plugins/UnixOSProcessPlugin/src/common/UnixOSProcessPlugin.c:4622:36: warning: incompatible pointer types assigning to 'void (*)(int, struct __siginfo *, void *)' from 'void (int)' [-Wincompatible-pointer-types]
[StackVM]         sigchldHandlerAction.sa_sigaction = reapChildProcess;
[StackVM]                                           ^ ~~~~~~~~~~~~~~~~
[StackVM] /builds/workspace/pharo-vm_headless@2/repository/extracted/plugins/UnixOSProcessPlugin/src/common/UnixOSProcessPlugin.c:4628:53: warning: comparison between pointer and integer ('int' and 'void *')
[StackVM]         if ((sigaction(SIGCHLD, &sigchldHandlerAction, 0)) == (sigErrorNumber())) {
[StackVM]             ~~~~~~~~~~~~~~~~~~~~~~~~~~~~~~~~~~~~~~~~~~~~~~ ^  ~~~~~~~~~~~~~~~~~~
[StackVM] /builds/workspace/pharo-vm_headless@2/repository/extracted/plugins/UnixOSProcessPlugin/src/common/UnixOSProcessPlugin.c:4671:74: warning: comparison between pointer and integer ('int' and 'void *')
[StackVM]         if ((sigaction(signalNumber, (&sigHandlerAction), (&oldHandlerAction))) == (sigErrorNumber())) {
[StackVM]             ~~~~~~~~~~~~~~~~~~~~~~~~~~~~~~~~~~~~~~~~~~~~~~~~~~~~~~~~~~~~~~~~~~~ ^  ~~~~~~~~~~~~~~~~~~
[StackVM] /builds/workspace/pharo-vm_headless@2/repository/extracted/plugins/UnixOSProcessPlugin/src/common/UnixOSProcessPlugin.c:5063:2: warning: expression result unused [-Wunused-value]
[StackVM]         (char *)strncpy(cString, stringPtr, len);
[StackVM]         ^       ~~~~~~~~~~~~~~~~~~~~~~~~~~~~~~~~
[StackVM] 5 warnings generated.
[StackVM] [ 34%] Linking C shared library build/vm/libUnixOSProcessPlugin.dylib
[StackVM] [ 34%] Built target UnixOSProcessPlugin
[StackVM] Scanning dependencies of target libffi-3.3-rc0
[StackVM] [ 35%] Generating build/third-party/libffi-3.3-rc0.zip
[StackVM] --2019-09-10 16:35:08--  https://files.pharo.org/vm/pharo-spur64/mac/third-party/libffi-3.3-rc0.zip
[StackVM] Resolving files.pharo.org... 164.132.235.17, 2001:41d0:301::23
[StackVM] Connecting to files.pharo.org|164.132.235.17|:443... connected.
[StackVM] HTTP request sent, awaiting response... 200 OK
[StackVM] Length: 16182 (16K) [application/zip]
[StackVM] Saving to: 'libffi-3.3-rc0.zip'
[StackVM] 
[StackVM]      0K .......... .....                                      100% 2.15M=0.007s
[StackVM] 
[StackVM] 2019-09-10 16:35:08 (2.15 MB/s) - 'libffi-3.3-rc0.zip' saved [16182/16182]
[StackVM] 
[StackVM] [ 35%] Generating build/third-party/libffi-3.3-rc0.done
[StackVM] Archive:  libffi-3.3-rc0.zip
[StackVM]   inflating: /builds/workspace/pharo-vm_headless@2/build/build/vm/libffi.7.dylib  
[StackVM] [ 35%] Built target libffi-3.3-rc0
[StackVM] Scanning dependencies of target MiscPrimitivePlugin
[StackVM] [ 36%] Building C object CMakeFiles/MiscPrimitivePlugin.dir/extracted/plugins/MiscPrimitivePlugin/src/common/MiscPrimitivePlugin.c.o
[StackVM] [ 37%] Linking C shared library build/vm/libMiscPrimitivePlugin.dylib
[StackVM] [ 37%] Built target MiscPrimitivePlugin
[StackVM] Scanning dependencies of target JPEGReaderPlugin
[StackVM] [ 37%] Building C object CMakeFiles/JPEGReaderPlugin.dir/extracted/plugins/JPEGReaderPlugin/src/common/JPEGReaderPlugin.c.o
[StackVM] [ 38%] Linking C shared library build/vm/libJPEGReaderPlugin.dylib
[StackVM] [ 38%] Built target JPEGReaderPlugin
[StackVM] Scanning dependencies of target pixman-0.34.0
[StackVM] [ 39%] Generating build/third-party/pixman-0.34.0.zip
[StackVM] --2019-09-10 16:35:09--  https://files.pharo.org/vm/pharo-spur64/mac/third-party/pixman-0.34.0.zip
[StackVM] Resolving files.pharo.org... 164.132.235.17, 2001:41d0:301::23
[StackVM] Connecting to files.pharo.org|164.132.235.17|:443... connected.
[StackVM] HTTP request sent, awaiting response... 200 OK
[StackVM] Length: 1343558 (1.3M) [application/zip]
[StackVM] Saving to: 'pixman-0.34.0.zip'
[StackVM] 
[StackVM]      0K .......... .......... .......... .......... ..........  3% 7.92M 0s
[StackVM]     50K .......... .......... .......... .......... ..........  7% 7.82M 0s
[StackVM]    100K .......... .......... .......... .......... .......... 11% 30.4M 0s
[StackVM]    150K .......... .......... .......... .......... .......... 15% 10.8M 0s
[StackVM]    200K .......... .......... .......... .......... .......... 19% 26.0M 0s
[StackVM]    250K .......... .......... .......... .......... .......... 22% 17.6M 0s
[StackVM]    300K .......... .......... .......... .......... .......... 26% 13.2M 0s
[StackVM]    350K .......... .......... .......... .......... .......... 30% 12.8M 0s
[StackVM]    400K .......... .......... .......... .......... .......... 34% 30.6M 0s
[StackVM]    450K .......... .......... .......... .......... .......... 38% 26.2M 0s
[StackVM]    500K .......... .......... .......... .......... .......... 41% 18.8M 0s
[StackVM]    550K .......... .......... .......... .......... .......... 45% 15.3M 0s
[StackVM]    600K .......... .......... .......... .......... .......... 49% 24.1M 0s
[StackVM]    650K .......... .......... .......... .......... .......... 53% 69.7M 0s
[StackVM]    700K .......... .......... .......... .......... .......... 57% 16.4M 0s
[StackVM]    750K .......... .......... .......... .......... .......... 60% 18.8M 0s
[StackVM]    800K .......... .......... .......... .......... .......... 64% 55.9M 0s
[StackVM]    850K .......... .......... .......... .......... .......... 68% 8.14M 0s
[StackVM]    900K .......... .......... .......... .......... .......... 72% 69.7M 0s
[StackVM]    950K .......... .......... .......... .......... .......... 76% 57.6M 0s
[StackVM]   1000K .......... .......... .......... .......... .......... 80% 63.5M 0s
[StackVM]   1050K .......... .......... .......... .......... .......... 83% 9.35M 0s
[StackVM]   1100K .......... .......... .......... .......... .......... 87% 41.2M 0s
[StackVM]   1150K .......... .......... .......... .......... .......... 91% 70.8M 0s
[StackVM]   1200K .......... .......... .......... .......... .......... 95% 14.4M 0s
[StackVM]   1250K .......... .......... .......... .......... .......... 99% 16.5M 0s
[StackVM]   1300K .......... ..                                         100% 68.5M=0.07s
[StackVM] 
[StackVM] 2019-09-10 16:35:09 (18.0 MB/s) - 'pixman-0.34.0.zip' saved [1343558/1343558]
[StackVM] 
[StackVM] [ 39%] Generating build/third-party/pixman-0.34.0.done
[StackVM] Archive:  pixman-0.34.0.zip
[StackVM]   inflating: /builds/workspace/pharo-vm_headless@2/build/build/vm/libpixman-1.0.dylib  
[StackVM]   inflating: /builds/workspace/pharo-vm_headless@2/build/build/vm/libpixman-1.dylib  
[StackVM] [ 39%] Built target pixman-0.34.0
[StackVM] Scanning dependencies of target BitBltPlugin
[StackVM] [ 40%] Building C object CMakeFiles/BitBltPlugin.dir/extracted/plugins/BitBltPlugin/src/common/BitBltPlugin.c.o
[StackVM] [ 40%] Linking C shared library build/vm/libBitBltPlugin.dylib
[StackVM] [ 40%] Built target BitBltPlugin
[StackVM] Scanning dependencies of target libssh2-1.7.0
[StackVM] [ 40%] Generating build/third-party/libssh2-1.7.0.zip
[StackVM] --2019-09-10 16:35:11--  https://files.pharo.org/vm/pharo-spur64/mac/third-party/libssh2-1.7.0.zip
[StackVM] Resolving files.pharo.org... 164.132.235.17, 2001:41d0:301::23
[StackVM] Connecting to files.pharo.org|164.132.235.17|:443... connected.
[StackVM] HTTP request sent, awaiting response... 200 OK
[StackVM] Length: 184746 (180K) [application/zip]
[StackVM] Saving to: 'libssh2-1.7.0.zip'
[StackVM] 
[StackVM]      0K .......... .......... .......... .......... .......... 27% 4.11M 0s
[StackVM]     50K .......... .......... .......... .......... .......... 55% 8.37M 0s
[StackVM]    100K .......... .......... .......... .......... .......... 83% 17.3M 0s
[StackVM]    150K .......... .......... ..........                      100% 9.30M=0.02s
[StackVM] 
[StackVM] 2019-09-10 16:35:11 (7.43 MB/s) - 'libssh2-1.7.0.zip' saved [184746/184746]
[StackVM] 
[StackVM] [ 41%] Generating build/third-party/libssh2-1.7.0.done
[StackVM] Archive:  libssh2-1.7.0.zip
[StackVM]   inflating: /builds/workspace/pharo-vm_headless@2/build/build/vm/libssh2.1.dylib  
[StackVM]   inflating: /builds/workspace/pharo-vm_headless@2/build/build/vm/libssh2.dylib  
[StackVM] [ 41%] Built target libssh2-1.7.0
[StackVM] Scanning dependencies of target LargeIntegers
[StackVM] [ 42%] Building C object CMakeFiles/LargeIntegers.dir/extracted/plugins/LargeIntegers/src/common/LargeIntegers.c.o
[StackVM] [ 42%] Linking C shared library build/vm/libLargeIntegers.dylib
[StackVM] [ 42%] Built target LargeIntegers
[StackVM] Scanning dependencies of target openssl-1.0.2q
[StackVM] [ 43%] Generating build/third-party/openssl-1.0.2q.zip
[StackVM] --2019-09-10 16:35:11--  https://files.pharo.org/vm/pharo-spur64/mac/third-party/openssl-1.0.2q.zip
[StackVM] Resolving files.pharo.org... 164.132.235.17, 2001:41d0:301::23
[StackVM] Connecting to files.pharo.org|164.132.235.17|:443... connected.
[StackVM] HTTP request sent, awaiting response... 200 OK
[StackVM] Length: 1343688 (1.3M) [application/zip]
[StackVM] Saving to: 'openssl-1.0.2q.zip'
[StackVM] 
[StackVM]      0K .......... .......... .......... .......... ..........  3% 4.04M 0s
[StackVM]     50K .......... .......... .......... .......... ..........  7% 7.77M 0s
[StackVM]    100K .......... .......... .......... .......... .......... 11% 28.9M 0s
[StackVM]    150K .......... .......... .......... .......... .......... 15% 10.5M 0s
[StackVM]    200K .......... .......... .......... .......... .......... 19% 32.2M 0s
[StackVM]    250K .......... .......... .......... .......... .......... 22% 9.24M 0s
[StackVM]    300K .......... .......... .......... .......... .......... 26% 29.6M 0s
[StackVM]    350K .......... .......... .......... .......... .......... 30% 10.3M 0s
[StackVM]    400K .......... .......... .......... .......... .......... 34% 32.7M 0s
[StackVM]    450K .......... .......... .......... .......... .......... 38% 11.4M 0s
[StackVM]    500K .......... .......... .......... .......... .......... 41% 35.2M 0s
[StackVM]    550K .......... .......... .......... .......... .......... 45% 14.4M 0s
[StackVM]    600K .......... .......... .......... .......... .......... 49% 21.6M 0s
[StackVM]    650K .......... .......... .......... .......... .......... 53% 72.9M 0s
[StackVM]    700K .......... .......... .......... .......... .......... 57% 10.2M 0s
[StackVM]    750K .......... .......... .......... .......... .......... 60% 30.1M 0s
[StackVM]    800K .......... .......... .......... .......... .......... 64% 12.0M 0s
[StackVM]    850K .......... .......... .......... .......... .......... 68% 58.4M 0s
[StackVM]    900K .......... .......... .......... .......... .......... 72% 41.6M 0s
[StackVM]    950K .......... .......... .......... .......... .......... 76% 9.47M 0s
[StackVM]   1000K .......... .......... .......... .......... .......... 80% 63.7M 0s
[StackVM]   1050K .......... .......... .......... .......... .......... 83% 14.2M 0s
[StackVM]   1100K .......... .......... .......... .......... .......... 87% 26.0M 0s
[StackVM]   1150K .......... .......... .......... .......... .......... 91% 78.8M 0s
[StackVM]   1200K .......... .......... .......... .......... .......... 95% 9.91M 0s
[StackVM]   1250K .......... .......... .......... .......... .......... 99% 69.7M 0s
[StackVM]   1300K .......... ..                                         100% 79.9M=0.08s
[StackVM] 
[StackVM] 2019-09-10 16:35:11 (15.7 MB/s) - 'openssl-1.0.2q.zip' saved [1343688/1343688]
[StackVM] 
[StackVM] [ 44%] Generating build/third-party/openssl-1.0.2q.done
[StackVM] Archive:  openssl-1.0.2q.zip
[StackVM]   inflating: /builds/workspace/pharo-vm_headless@2/build/build/vm/libssl.1.0.0.dylib  
[StackVM]   inflating: /builds/workspace/pharo-vm_headless@2/build/build/vm/libssl.dylib  
[StackVM]   inflating: /builds/workspace/pharo-vm_headless@2/build/build/vm/libcrypto.1.0.0.dylib  
[StackVM] [ 44%] Built target openssl-1.0.2q
[StackVM] Scanning dependencies of target JPEGReadWriter2Plugin
[StackVM] [ 45%] Building C object CMakeFiles/JPEGReadWriter2Plugin.dir/extracted/plugins/JPEGReadWriter2Plugin/src/common/Error.c.o
[StackVM] [ 46%] Building C object CMakeFiles/JPEGReadWriter2Plugin.dir/extracted/plugins/JPEGReadWriter2Plugin/src/common/JPEGReadWriter2Plugin.c.o
[StackVM] [ 46%] Building C object CMakeFiles/JPEGReadWriter2Plugin.dir/extracted/plugins/JPEGReadWriter2Plugin/src/common/jcapimin.c.o
[StackVM] [ 47%] Building C object CMakeFiles/JPEGReadWriter2Plugin.dir/extracted/plugins/JPEGReadWriter2Plugin/src/common/jcapistd.c.o
[StackVM] [ 48%] Building C object CMakeFiles/JPEGReadWriter2Plugin.dir/extracted/plugins/JPEGReadWriter2Plugin/src/common/jccoefct.c.o
[StackVM] [ 49%] Building C object CMakeFiles/JPEGReadWriter2Plugin.dir/extracted/plugins/JPEGReadWriter2Plugin/src/common/jccolor.c.o
[StackVM] [ 49%] Building C object CMakeFiles/JPEGReadWriter2Plugin.dir/extracted/plugins/JPEGReadWriter2Plugin/src/common/jcdctmgr.c.o
[StackVM] [ 50%] Building C object CMakeFiles/JPEGReadWriter2Plugin.dir/extracted/plugins/JPEGReadWriter2Plugin/src/common/jchuff.c.o
[StackVM] [ 51%] Building C object CMakeFiles/JPEGReadWriter2Plugin.dir/extracted/plugins/JPEGReadWriter2Plugin/src/common/jcinit.c.o
[StackVM] [ 51%] Building C object CMakeFiles/JPEGReadWriter2Plugin.dir/extracted/plugins/JPEGReadWriter2Plugin/src/common/jcmainct.c.o
[StackVM] [ 52%] Building C object CMakeFiles/JPEGReadWriter2Plugin.dir/extracted/plugins/JPEGReadWriter2Plugin/src/common/jcmarker.c.o
[StackVM] [ 53%] Building C object CMakeFiles/JPEGReadWriter2Plugin.dir/extracted/plugins/JPEGReadWriter2Plugin/src/common/jcmaster.c.o
[StackVM] [ 53%] Building C object CMakeFiles/JPEGReadWriter2Plugin.dir/extracted/plugins/JPEGReadWriter2Plugin/src/common/jcomapi.c.o
[StackVM] [ 54%] Building C object CMakeFiles/JPEGReadWriter2Plugin.dir/extracted/plugins/JPEGReadWriter2Plugin/src/common/jcparam.c.o
[StackVM] [ 55%] Building C object CMakeFiles/JPEGReadWriter2Plugin.dir/extracted/plugins/JPEGReadWriter2Plugin/src/common/jcphuff.c.o
[StackVM] [ 56%] Building C object CMakeFiles/JPEGReadWriter2Plugin.dir/extracted/plugins/JPEGReadWriter2Plugin/src/common/jcprepct.c.o
[StackVM] [ 56%] Building C object CMakeFiles/JPEGReadWriter2Plugin.dir/extracted/plugins/JPEGReadWriter2Plugin/src/common/jcsample.c.o
[StackVM] [ 57%] Building C object CMakeFiles/JPEGReadWriter2Plugin.dir/extracted/plugins/JPEGReadWriter2Plugin/src/common/jctrans.c.o
[StackVM] [ 58%] Building C object CMakeFiles/JPEGReadWriter2Plugin.dir/extracted/plugins/JPEGReadWriter2Plugin/src/common/jdapimin.c.o
[StackVM] [ 58%] Building C object CMakeFiles/JPEGReadWriter2Plugin.dir/extracted/plugins/JPEGReadWriter2Plugin/src/common/jdapistd.c.o
[StackVM] [ 59%] Building C object CMakeFiles/JPEGReadWriter2Plugin.dir/extracted/plugins/JPEGReadWriter2Plugin/src/common/jdatadst.c.o
[StackVM] [ 60%] Building C object CMakeFiles/JPEGReadWriter2Plugin.dir/extracted/plugins/JPEGReadWriter2Plugin/src/common/jdatasrc.c.o
[StackVM] [ 60%] Building C object CMakeFiles/JPEGReadWriter2Plugin.dir/extracted/plugins/JPEGReadWriter2Plugin/src/common/jdcoefct.c.o
[StackVM] [ 61%] Building C object CMakeFiles/JPEGReadWriter2Plugin.dir/extracted/plugins/JPEGReadWriter2Plugin/src/common/jdcolor.c.o
[StackVM] [ 62%] Building C object CMakeFiles/JPEGReadWriter2Plugin.dir/extracted/plugins/JPEGReadWriter2Plugin/src/common/jddctmgr.c.o
[StackVM] [ 62%] Building C object CMakeFiles/JPEGReadWriter2Plugin.dir/extracted/plugins/JPEGReadWriter2Plugin/src/common/jdhuff.c.o
[StackVM] [ 63%] Building C object CMakeFiles/JPEGReadWriter2Plugin.dir/extracted/plugins/JPEGReadWriter2Plugin/src/common/jdinput.c.o
[StackVM] [ 64%] Building C object CMakeFiles/JPEGReadWriter2Plugin.dir/extracted/plugins/JPEGReadWriter2Plugin/src/common/jdmainct.c.o
[StackVM] [ 65%] Building C object CMakeFiles/JPEGReadWriter2Plugin.dir/extracted/plugins/JPEGReadWriter2Plugin/src/common/jdmarker.c.o
[StackVM] [ 65%] Building C object CMakeFiles/JPEGReadWriter2Plugin.dir/extracted/plugins/JPEGReadWriter2Plugin/src/common/jdmaster.c.o
[StackVM] [ 66%] Building C object CMakeFiles/JPEGReadWriter2Plugin.dir/extracted/plugins/JPEGReadWriter2Plugin/src/common/jdmerge.c.o
[StackVM] [ 67%] Building C object CMakeFiles/JPEGReadWriter2Plugin.dir/extracted/plugins/JPEGReadWriter2Plugin/src/common/jdphuff.c.o
[StackVM] [ 67%] Building C object CMakeFiles/JPEGReadWriter2Plugin.dir/extracted/plugins/JPEGReadWriter2Plugin/src/common/jdpostct.c.o
[StackVM] [ 68%] Building C object CMakeFiles/JPEGReadWriter2Plugin.dir/extracted/plugins/JPEGReadWriter2Plugin/src/common/jdsample.c.o
[StackVM] [ 69%] Building C object CMakeFiles/JPEGReadWriter2Plugin.dir/extracted/plugins/JPEGReadWriter2Plugin/src/common/jdtrans.c.o
[StackVM] [ 69%] Building C object CMakeFiles/JPEGReadWriter2Plugin.dir/extracted/plugins/JPEGReadWriter2Plugin/src/common/jerror.c.o
[StackVM] [ 70%] Building C object CMakeFiles/JPEGReadWriter2Plugin.dir/extracted/plugins/JPEGReadWriter2Plugin/src/common/jfdctflt.c.o
[StackVM] [ 71%] Building C object CMakeFiles/JPEGReadWriter2Plugin.dir/extracted/plugins/JPEGReadWriter2Plugin/src/common/jfdctfst.c.o
[StackVM] [ 71%] Building C object CMakeFiles/JPEGReadWriter2Plugin.dir/extracted/plugins/JPEGReadWriter2Plugin/src/common/jfdctint.c.o
[StackVM] [ 72%] Building C object CMakeFiles/JPEGReadWriter2Plugin.dir/extracted/plugins/JPEGReadWriter2Plugin/src/common/jidctflt.c.o
[StackVM] [ 73%] Building C object CMakeFiles/JPEGReadWriter2Plugin.dir/extracted/plugins/JPEGReadWriter2Plugin/src/common/jidctfst.c.o
[StackVM] [ 74%] Building C object CMakeFiles/JPEGReadWriter2Plugin.dir/extracted/plugins/JPEGReadWriter2Plugin/src/common/jidctint.c.o
[StackVM] [ 74%] Building C object CMakeFiles/JPEGReadWriter2Plugin.dir/extracted/plugins/JPEGReadWriter2Plugin/src/common/jidctred.c.o
[StackVM] [ 75%] Building C object CMakeFiles/JPEGReadWriter2Plugin.dir/extracted/plugins/JPEGReadWriter2Plugin/src/common/jmemdatadst.c.o
[StackVM] [ 76%] Building C object CMakeFiles/JPEGReadWriter2Plugin.dir/extracted/plugins/JPEGReadWriter2Plugin/src/common/jmemdatasrc.c.o
[StackVM] [ 76%] Building C object CMakeFiles/JPEGReadWriter2Plugin.dir/extracted/plugins/JPEGReadWriter2Plugin/src/common/jmemmgr.c.o
[StackVM] [ 77%] Building C object CMakeFiles/JPEGReadWriter2Plugin.dir/extracted/plugins/JPEGReadWriter2Plugin/src/common/jmemnobs.c.o
[StackVM] [ 78%] Building C object CMakeFiles/JPEGReadWriter2Plugin.dir/extracted/plugins/JPEGReadWriter2Plugin/src/common/jquant1.c.o
[StackVM] [ 78%] Building C object CMakeFiles/JPEGReadWriter2Plugin.dir/extracted/plugins/JPEGReadWriter2Plugin/src/common/jquant2.c.o
[StackVM] [ 79%] Building C object CMakeFiles/JPEGReadWriter2Plugin.dir/extracted/plugins/JPEGReadWriter2Plugin/src/common/jutils.c.o
[StackVM] [ 80%] Building C object CMakeFiles/JPEGReadWriter2Plugin.dir/extracted/plugins/JPEGReadWriter2Plugin/src/common/sqJPEGReadWriter2Plugin.c.o
[StackVM] [ 81%] Linking C shared library build/vm/libJPEGReadWriter2Plugin.dylib
[StackVM] [ 81%] Built target JPEGReadWriter2Plugin
[StackVM] Scanning dependencies of target FileAttributesPlugin
[StackVM] [ 81%] Building C object CMakeFiles/FileAttributesPlugin.dir/extracted/plugins/FileAttributesPlugin/src/common/FileAttributesPlugin.c.o
[StackVM] [ 82%] Building C object CMakeFiles/FileAttributesPlugin.dir/extracted/plugins/FileAttributesPlugin/src/common/faCommon.c.o
[StackVM] [ 83%] Building C object CMakeFiles/FileAttributesPlugin.dir/extracted/plugins/FileAttributesPlugin/src/unix/faSupport.c.o
[StackVM] [ 83%] Linking C shared library build/vm/libFileAttributesPlugin.dylib
[StackVM] [ 83%] Built target FileAttributesPlugin
[StackVM] Scanning dependencies of target libpng-1.2.49
[StackVM] [ 84%] Generating build/third-party/libpng-1.2.49.zip
[StackVM] --2019-09-10 16:35:20--  https://files.pharo.org/vm/pharo-spur64/mac/third-party/libpng-1.2.49.zip
[StackVM] Resolving files.pharo.org... 164.132.235.17, 2001:41d0:301::23
[StackVM] Connecting to files.pharo.org|164.132.235.17|:443... connected.
[StackVM] HTTP request sent, awaiting response... 200 OK
[StackVM] Length: 148996 (146K) [application/zip]
[StackVM] Saving to: 'libpng-1.2.49.zip'
[StackVM] 
[StackVM]      0K .......... .......... .......... .......... .......... 34% 3.95M 0s
[StackVM]     50K .......... .......... .......... .......... .......... 68% 10.0M 0s
[StackVM]    100K .......... .......... .......... .......... .....     100% 14.6M=0.02s
[StackVM] 
[StackVM] 2019-09-10 16:35:21 (7.01 MB/s) - 'libpng-1.2.49.zip' saved [148996/148996]
[StackVM] 
[StackVM] [ 84%] Generating build/third-party/libpng-1.2.49.done
[StackVM] Archive:  libpng-1.2.49.zip
[StackVM]   inflating: /builds/workspace/pharo-vm_headless@2/build/build/vm/libpng12.0.dylib  
[StackVM]   inflating: /builds/workspace/pharo-vm_headless@2/build/build/vm/libpng12.dylib  
[StackVM] [ 84%] Built target libpng-1.2.49
[StackVM] Scanning dependencies of target IA32ABI
[StackVM] [ 84%] Building C object CMakeFiles/IA32ABI.dir/extracted/plugins/IA32ABI/src/common/IA32ABI.c.o
[StackVM] /builds/workspace/pharo-vm_headless@2/repository/extracted/plugins/IA32ABI/src/common/IA32ABI.c:748:24: warning: incompatible integer to pointer conversion passing 'sqInt' (aka 'long') to parameter of type 'const void *' [-Wint-conversion]
[StackVM]         memcpy((&floatValue), addr, sizeof(floatValue));
[StackVM]                               ^~~~
[StackVM] /usr/include/secure/_string.h:65:33: note: expanded from macro 'memcpy'
[StackVM]   __builtin___memcpy_chk (dest, src, len, __darwin_obsz0 (dest))
[StackVM]                                 ^
[StackVM] /builds/workspace/pharo-vm_headless@2/repository/extracted/plugins/IA32ABI/src/common/IA32ABI.c:795:9: warning: incompatible integer to pointer conversion passing 'sqInt' (aka 'long') to parameter of type 'const void *' [-Wint-conversion]
[StackVM]         memcpy(addr, (&floatValue), sizeof(floatValue));
[StackVM]                ^~~~
[StackVM] /usr/include/secure/_string.h:65:59: note: expanded from macro 'memcpy'
[StackVM]   __builtin___memcpy_chk (dest, src, len, __darwin_obsz0 (dest))
[StackVM]                                                           ^
[StackVM] /usr/include/secure/_common.h:38:55: note: expanded from macro '__darwin_obsz0'
[StackVM] #define __darwin_obsz0(object) __builtin_object_size (object, 0)
[StackVM]                                                       ^
[StackVM] /builds/workspace/pharo-vm_headless@2/repository/extracted/plugins/IA32ABI/src/common/IA32ABI.c:795:9: warning: incompatible integer to pointer conversion passing 'sqInt' (aka 'long') to parameter of type 'void *' [-Wint-conversion]
[StackVM]         memcpy(addr, (&floatValue), sizeof(floatValue));
[StackVM]                ^~~~
[StackVM] /usr/include/secure/_string.h:65:27: note: expanded from macro 'memcpy'
[StackVM]   __builtin___memcpy_chk (dest, src, len, __darwin_obsz0 (dest))
[StackVM]                           ^
[StackVM] /builds/workspace/pharo-vm_headless@2/repository/extracted/plugins/IA32ABI/src/common/IA32ABI.c:840:24: warning: incompatible integer to pointer conversion passing 'sqInt' (aka 'long') to parameter of type 'const void *' [-Wint-conversion]
[StackVM]         memcpy((&floatValue), addr, sizeof(floatValue));
[StackVM]                               ^~~~
[StackVM] /usr/include/secure/_string.h:65:33: note: expanded from macro 'memcpy'
[StackVM]   __builtin___memcpy_chk (dest, src, len, __darwin_obsz0 (dest))
[StackVM]                                 ^
[StackVM] /builds/workspace/pharo-vm_headless@2/repository/extracted/plugins/IA32ABI/src/common/IA32ABI.c:887:9: warning: incompatible integer to pointer conversion passing 'sqInt' (aka 'long') to parameter of type 'const void *' [-Wint-conversion]
[StackVM]         memcpy(addr, (&floatValue), sizeof(floatValue));
[StackVM]                ^~~~
[StackVM] /usr/include/secure/_string.h:65:59: note: expanded from macro 'memcpy'
[StackVM]   __builtin___memcpy_chk (dest, src, len, __darwin_obsz0 (dest))
[StackVM]                                                           ^
[StackVM] /usr/include/secure/_common.h:38:55: note: expanded from macro '__darwin_obsz0'
[StackVM] #define __darwin_obsz0(object) __builtin_object_size (object, 0)
[StackVM]                                                       ^
[StackVM] /builds/workspace/pharo-vm_headless@2/repository/extracted/plugins/IA32ABI/src/common/IA32ABI.c:887:9: warning: incompatible integer to pointer conversion passing 'sqInt' (aka 'long') to parameter of type 'void *' [-Wint-conversion]
[StackVM]         memcpy(addr, (&floatValue), sizeof(floatValue));
[StackVM]                ^~~~
[StackVM] /usr/include/secure/_string.h:65:27: note: expanded from macro 'memcpy'
[StackVM]   __builtin___memcpy_chk (dest, src, len, __darwin_obsz0 (dest))
[StackVM]                           ^
[StackVM] /builds/workspace/pharo-vm_headless@2/repository/extracted/plugins/IA32ABI/src/common/IA32ABI.c:2253:34: warning: incompatible pointer types assigning to 'sqInt (*)(sqInt, VMCallbackContext *, sqInt)' from 'sqInt (*)(int, vmccp, sqInt)' [-Wincompatible-pointer-types]
[StackVM]                 returnAsThroughCallbackContext = interpreterProxy->returnAsThroughCallbackContext;
[StackVM]                                                ^ ~~~~~~~~~~~~~~~~~~~~~~~~~~~~~~~~~~~~~~~~~~~~~~~~
[StackVM] 7 warnings generated.
[StackVM] [ 85%] Building C object CMakeFiles/IA32ABI.dir/extracted/plugins/IA32ABI/src/common/AlienSUnitTestProcedures.c.o
[StackVM] [ 86%] Building C object CMakeFiles/IA32ABI.dir/extracted/plugins/IA32ABI/src/common/xabicc.c.o
[StackVM] In file included from /builds/workspace/pharo-vm_headless@2/repository/extracted/plugins/IA32ABI/src/common/xabicc.c:16:
[StackVM] /builds/workspace/pharo-vm_headless@2/repository/extracted/plugins/IA32ABI/src/common/x64sysvabicc.c:283:18: warning: implicit declaration of function 'getpagesize' is invalid in C99 [-Wimplicit-function-declaration]
[StackVM]         long pagesize = getpagesize();
[StackVM]                         ^
[StackVM] 1 warning generated.
[StackVM] [ 86%] Linking C shared library build/vm/libIA32ABI.dylib
[StackVM] [ 86%] Built target IA32ABI
[StackVM] Scanning dependencies of target SecurityPlugin
[StackVM] [ 87%] Building C object CMakeFiles/SecurityPlugin.dir/plugins/SecurityPlugin/common/DummySecurityPlugin.c.o
[StackVM] [ 87%] Linking C shared library build/vm/libSecurityPlugin.dylib
[StackVM] [ 87%] Built target SecurityPlugin
[StackVM] Scanning dependencies of target LocalePlugin
[StackVM] [ 88%] Building C object CMakeFiles/LocalePlugin.dir/extracted/plugins/LocalePlugin/src/common/LocalePlugin.c.o
[StackVM] [ 89%] Building C object CMakeFiles/LocalePlugin.dir/extracted/plugins/LocalePlugin/src/osx/sqIOSLocale.c.o
[StackVM] /builds/workspace/pharo-vm_headless@2/repository/extracted/plugins/LocalePlugin/src/osx/sqIOSLocale.c:133:17: warning: incompatible integer to pointer conversion passing 'time_t' (aka 'long') to parameter of type 'time_t *' (aka 'long *') [-Wint-conversion]
[StackVM]         theTime = time((time_t)NULL);
[StackVM]                        ^~~~~~~~~~~~
[StackVM] /usr/include/time.h:118:21: note: passing argument to parameter here
[StackVM] time_t time(time_t *);
[StackVM]                     ^
[StackVM] 1 warning generated.
[StackVM] [ 89%] Linking C shared library build/vm/libLocalePlugin.dylib
[StackVM] [ 89%] Built target LocalePlugin
[StackVM] Scanning dependencies of target SurfacePlugin
[StackVM] [ 90%] Building C object CMakeFiles/SurfacePlugin.dir/extracted/plugins/SurfacePlugin/src/common/SurfacePlugin.c.o
[StackVM] /builds/workspace/pharo-vm_headless@2/repository/extracted/plugins/SurfacePlugin/src/common/SurfacePlugin.c:135:3: warning: expression result unused [-Wunused-value]
[StackVM]                 -1;
[StackVM]                 ^~
[StackVM] 1 warning generated.
[StackVM] [ 90%] Linking C shared library build/vm/libSurfacePlugin.dylib
[StackVM] [ 90%] Built target SurfacePlugin
[StackVM] Scanning dependencies of target DSAPrims
[StackVM] [ 91%] Building C object CMakeFiles/DSAPrims.dir/extracted/plugins/DSAPrims/src/common/DSAPrims.c.o
[StackVM] [ 92%] Linking C shared library build/vm/libDSAPrims.dylib
[StackVM] [ 92%] Built target DSAPrims
[StackVM] Scanning dependencies of target SocketPlugin
[StackVM] [ 93%] Building C object CMakeFiles/SocketPlugin.dir/extracted/plugins/SocketPlugin/src/common/SocketPlugin.c.o
[StackVM] /builds/workspace/pharo-vm_headless@2/repository/extracted/plugins/SocketPlugin/src/common/SocketPlugin.c:2399:3: warning: pointer/integer type mismatch in conditional expression ('SocketPtr' (aka 'SQSocket *') and 'int') [-Wconditional-type-mismatch]
[StackVM]                 ? ((SocketPtr) (firstIndexableField(socketOop)))
[StackVM]                 ^ ~~~~~~~~~~~~~~~~~~~~~~~~~~~~~~~~~~~~~~~~~~~~~~
[StackVM] 1 warning generated.
[StackVM] [ 94%] Building C object CMakeFiles/SocketPlugin.dir/extracted/plugins/SocketPlugin/src/unix/sqUnixSocket.c.o
[StackVM] [ 94%] Linking C shared library build/vm/libSocketPlugin.dylib
[StackVM] [ 94%] Built target SocketPlugin
[StackVM] Scanning dependencies of target UUIDPlugin
[StackVM] [ 95%] Building C object CMakeFiles/UUIDPlugin.dir/plugins/UUIDPlugin/common/UUIDPlugin.c.o
[StackVM] /builds/workspace/pharo-vm_headless@2/repository/plugins/UUIDPlugin/common/UUIDPlugin.c:110:1: warning: control reaches end of non-void function [-Wreturn-type]
[StackVM] }
[StackVM] ^
[StackVM] 1 warning generated.
[StackVM] [ 96%] Linking C shared library build/vm/libUUIDPlugin.dylib
[StackVM] [ 96%] Built target UUIDPlugin
[StackVM] Scanning dependencies of target SqueakFFIPrims
[StackVM] [ 97%] Building C object CMakeFiles/SqueakFFIPrims.dir/extracted/plugins/SqueakFFIPrims/src/common/SqueakFFIPrims.c.o
[StackVM] In file included from /builds/workspace/pharo-vm_headless@2/repository/extracted/plugins/SqueakFFIPrims/src/common/SqueakFFIPrims.c:23:
[StackVM] /builds/workspace/pharo-vm_headless@2/repository/extracted/plugins/SqueakFFIPrims/src/common/X64SysVFFIPlugin.c:903:19: warning: incompatible pointer to integer conversion passing 'void *' to parameter of type 'sqInt' (aka 'long') [-Wint-conversion]
[StackVM]                         if (isInMemory(ptrAddress)) {
[StackVM]                                        ^~~~~~~~~~
[StackVM] /builds/workspace/pharo-vm_headless@2/repository/extracted/plugins/SqueakFFIPrims/src/common/X64SysVFFIPlugin.c:1156:19: warning: incompatible pointer to integer conversion passing 'void *' to parameter of type 'sqInt' (aka 'long') [-Wint-conversion]
[StackVM]                         if (isInMemory(ptrAddress)) {
[StackVM]                                        ^~~~~~~~~~
[StackVM] /builds/workspace/pharo-vm_headless@2/repository/extracted/plugins/SqueakFFIPrims/src/common/X64SysVFFIPlugin.c:2984:18: warning: incompatible pointer to integer conversion passing 'void *' to parameter of type 'sqInt' (aka 'long') [-Wint-conversion]
[StackVM]                 if (isInMemory(ptrAddress)) {
[StackVM]                                ^~~~~~~~~~
[StackVM] /builds/workspace/pharo-vm_headless@2/repository/extracted/plugins/SqueakFFIPrims/src/common/X64SysVFFIPlugin.c:3037:14: warning: incompatible integer to pointer conversion assigning to 'void *' from 'long' [-Wint-conversion]
[StackVM]                 ptrAddress = ((longAt(oop + BaseHeaderSize)) > 0
[StackVM]                            ^ ~~~~~~~~~~~~~~~~~~~~~~~~~~~~~~~~~~~
[StackVM] /builds/workspace/pharo-vm_headless@2/repository/extracted/plugins/SqueakFFIPrims/src/common/X64SysVFFIPlugin.c:3277:18: warning: incompatible pointer to integer conversion passing 'void *' to parameter of type 'sqInt' (aka 'long') [-Wint-conversion]
[StackVM]                 if (isInMemory(ptrAddress)) {
[StackVM]                                ^~~~~~~~~~
[StackVM] /builds/workspace/pharo-vm_headless@2/repository/extracted/plugins/SqueakFFIPrims/src/common/X64SysVFFIPlugin.c:3530:18: warning: incompatible pointer to integer conversion passing 'void *' to parameter of type 'sqInt' (aka 'long') [-Wint-conversion]
[StackVM]                 if (isInMemory(ptrAddress)) {
[StackVM]                                ^~~~~~~~~~
[StackVM] /builds/workspace/pharo-vm_headless@2/repository/extracted/plugins/SqueakFFIPrims/src/common/X64SysVFFIPlugin.c:6596:21: warning: incompatible pointer types assigning to 'sqInt (*)(sqInt)' from 'sqInt (*)(int)' [-Wincompatible-pointer-types]
[StackVM]                 characterObjectOf = interpreterProxy->characterObjectOf;
[StackVM]                                   ^ ~~~~~~~~~~~~~~~~~~~~~~~~~~~~~~~~~~~
[StackVM] 7 warnings generated.
[StackVM] [ 98%] Building C object CMakeFiles/SqueakFFIPrims.dir/extracted/plugins/SqueakFFIPrims/src/common/sqManualSurface.c.o
[StackVM] [ 98%] Building C object CMakeFiles/SqueakFFIPrims.dir/extracted/plugins/SqueakFFIPrims/src/common/sqFFIPlugin.c.o
[StackVM] [ 99%] Building C object CMakeFiles/SqueakFFIPrims.dir/extracted/plugins/SqueakFFIPrims/src/common/sqFFITestFuncs.c.o
[StackVM] [100%] Linking C shared library build/vm/libSqueakFFIPrims.dylib
[StackVM] [100%] Built target SqueakFFIPrims
[StackVM] Install the project...
[StackVM] -- Install configuration: ""
[StackVM] -- Installing: /builds/workspace/pharo-vm_headless@2/build/build/dist/Pharo.app/Contents/MacOS
[StackVM] -- Installing: /builds/workspace/pharo-vm_headless@2/build/build/dist/Pharo.app/Contents/MacOS/Pharo
[StackVM] -- Installing: /builds/workspace/pharo-vm_headless@2/build/build/dist/Pharo.app/Contents/MacOS/Plugins
[StackVM] -- Installing: /builds/workspace/pharo-vm_headless@2/build/build/dist/Pharo.app/Contents/MacOS/Plugins/libB2DPlugin.dylib
[StackVM] -- Installing: /builds/workspace/pharo-vm_headless@2/build/build/dist/Pharo.app/Contents/MacOS/Plugins/libBitBltPlugin.dylib
[StackVM] -- Installing: /builds/workspace/pharo-vm_headless@2/build/build/dist/Pharo.app/Contents/MacOS/Plugins/libcairo.2.dylib
[StackVM] -- Installing: /builds/workspace/pharo-vm_headless@2/build/build/dist/Pharo.app/Contents/MacOS/Plugins/libcairo.dylib
[StackVM] -- Installing: /builds/workspace/pharo-vm_headless@2/build/build/dist/Pharo.app/Contents/MacOS/Plugins/libcrypto.1.0.0.dylib
[StackVM] -- Installing: /builds/workspace/pharo-vm_headless@2/build/build/dist/Pharo.app/Contents/MacOS/Plugins/libDSAPrims.dylib
[StackVM] -- Installing: /builds/workspace/pharo-vm_headless@2/build/build/dist/Pharo.app/Contents/MacOS/Plugins/libffi.7.dylib
[StackVM] -- Installing: /builds/workspace/pharo-vm_headless@2/build/build/dist/Pharo.app/Contents/MacOS/Plugins/libFileAttributesPlugin.dylib
[StackVM] -- Installing: /builds/workspace/pharo-vm_headless@2/build/build/dist/Pharo.app/Contents/MacOS/Plugins/libFilePlugin.dylib
[StackVM] -- Installing: /builds/workspace/pharo-vm_headless@2/build/build/dist/Pharo.app/Contents/MacOS/Plugins/libfreetype.6.dylib
[StackVM] -- Installing: /builds/workspace/pharo-vm_headless@2/build/build/dist/Pharo.app/Contents/MacOS/Plugins/libfreetype.dylib
[StackVM] -- Installing: /builds/workspace/pharo-vm_headless@2/build/build/dist/Pharo.app/Contents/MacOS/Plugins/libgit2.0.25.1.dylib
[StackVM] -- Installing: /builds/workspace/pharo-vm_headless@2/build/build/dist/Pharo.app/Contents/MacOS/Plugins/libgit2.25.dylib
[StackVM] -- Installing: /builds/workspace/pharo-vm_headless@2/build/build/dist/Pharo.app/Contents/MacOS/Plugins/libgit2.dylib
[StackVM] -- Installing: /builds/workspace/pharo-vm_headless@2/build/build/dist/Pharo.app/Contents/MacOS/Plugins/libIA32ABI.dylib
[StackVM] -- Installing: /builds/workspace/pharo-vm_headless@2/build/build/dist/Pharo.app/Contents/MacOS/Plugins/libJPEGReaderPlugin.dylib
[StackVM] -- Installing: /builds/workspace/pharo-vm_headless@2/build/build/dist/Pharo.app/Contents/MacOS/Plugins/libJPEGReadWriter2Plugin.dylib
[StackVM] -- Installing: /builds/workspace/pharo-vm_headless@2/build/build/dist/Pharo.app/Contents/MacOS/Plugins/libLargeIntegers.dylib
[StackVM] -- Installing: /builds/workspace/pharo-vm_headless@2/build/build/dist/Pharo.app/Contents/MacOS/Plugins/libLocalePlugin.dylib
[StackVM] -- Installing: /builds/workspace/pharo-vm_headless@2/build/build/dist/Pharo.app/Contents/MacOS/Plugins/libMiscPrimitivePlugin.dylib
[StackVM] -- Installing: /builds/workspace/pharo-vm_headless@2/build/build/dist/Pharo.app/Contents/MacOS/Plugins/libPharoVMCore.dylib
[StackVM] -- Installing: /builds/workspace/pharo-vm_headless@2/build/build/dist/Pharo.app/Contents/MacOS/Plugins/libpixman-1.0.dylib
[StackVM] -- Installing: /builds/workspace/pharo-vm_headless@2/build/build/dist/Pharo.app/Contents/MacOS/Plugins/libpixman-1.dylib
[StackVM] -- Installing: /builds/workspace/pharo-vm_headless@2/build/build/dist/Pharo.app/Contents/MacOS/Plugins/libpng12.0.dylib
[StackVM] -- Installing: /builds/workspace/pharo-vm_headless@2/build/build/dist/Pharo.app/Contents/MacOS/Plugins/libpng12.dylib
[StackVM] -- Installing: /builds/workspace/pharo-vm_headless@2/build/build/dist/Pharo.app/Contents/MacOS/Plugins/libPThreadedPlugin.dylib
[StackVM] -- Installing: /builds/workspace/pharo-vm_headless@2/build/build/dist/Pharo.app/Contents/MacOS/Plugins/libSDL2-2.0.0.dylib
[StackVM] -- Installing: /builds/workspace/pharo-vm_headless@2/build/build/dist/Pharo.app/Contents/MacOS/Plugins/libSDL2.dylib
[StackVM] -- Installing: /builds/workspace/pharo-vm_headless@2/build/build/dist/Pharo.app/Contents/MacOS/Plugins/libSecurityPlugin.dylib
[StackVM] -- Installing: /builds/workspace/pharo-vm_headless@2/build/build/dist/Pharo.app/Contents/MacOS/Plugins/libSocketPlugin.dylib
[StackVM] -- Installing: /builds/workspace/pharo-vm_headless@2/build/build/dist/Pharo.app/Contents/MacOS/Plugins/libSqueakFFIPrims.dylib
[StackVM] -- Installing: /builds/workspace/pharo-vm_headless@2/build/build/dist/Pharo.app/Contents/MacOS/Plugins/libSqueakSSL.dylib
[StackVM] -- Installing: /builds/workspace/pharo-vm_headless@2/build/build/dist/Pharo.app/Contents/MacOS/Plugins/libssh2.1.dylib
[StackVM] -- Installing: /builds/workspace/pharo-vm_headless@2/build/build/dist/Pharo.app/Contents/MacOS/Plugins/libssh2.dylib
[StackVM] -- Installing: /builds/workspace/pharo-vm_headless@2/build/build/dist/Pharo.app/Contents/MacOS/Plugins/libssl.1.0.0.dylib
[StackVM] -- Installing: /builds/workspace/pharo-vm_headless@2/build/build/dist/Pharo.app/Contents/MacOS/Plugins/libssl.dylib
[StackVM] -- Installing: /builds/workspace/pharo-vm_headless@2/build/build/dist/Pharo.app/Contents/MacOS/Plugins/libSurfacePlugin.dylib
[StackVM] -- Installing: /builds/workspace/pharo-vm_headless@2/build/build/dist/Pharo.app/Contents/MacOS/Plugins/libUnixOSProcessPlugin.dylib
[StackVM] -- Installing: /builds/workspace/pharo-vm_headless@2/build/build/dist/Pharo.app/Contents/MacOS/Plugins/libUUIDPlugin.dylib
[StackVM] -- Installing: /builds/workspace/pharo-vm_headless@2/build/build/dist/Pharo.app/Contents/Info.plist
[StackVM] -- Installing: /builds/workspace/pharo-vm_headless@2/build/build/dist/Pharo.app/Contents/Resources/Pharo.icns
[StackVM] -- Installing: /builds/workspace/pharo-vm_headless@2/build/build/dist/include/sq.h
[StackVM] -- Installing: /builds/workspace/pharo-vm_headless@2/build/build/dist/include/sqMemoryAccess.h
[StackVM] -- Installing: /builds/workspace/pharo-vm_headless@2/build/build/dist/include/sqVirtualMachine.h
[StackVM] -- Installing: /builds/workspace/pharo-vm_headless@2/build/build/dist/include/interp.h
[StackVM] -- Installing: /builds/workspace/pharo-vm_headless@2/build/build/dist/include/vmCallback.h
[StackVM] -- Installing: /builds/workspace/pharo-vm_headless@2/build/build/dist/include/config.h
[Pipeline] [StackVM] sh
[StackVM] + make package
[StackVM] [ 13%] Built target PharoVMCore
[StackVM] [ 16%] Built target Pharo
[StackVM] [ 18%] Built target SDL2-2.0.7
[StackVM] [ 20%] Built target libgit2-0.25.1
[StackVM] [ 22%] Built target freetype-2.9.1
[StackVM] [ 24%] Built target SqueakSSL
[StackVM] [ 25%] Built target cairo-1.15.4
[StackVM] [ 26%] Built target B2DPlugin
[StackVM] [ 28%] Built target pthreadedPlugin-0.0.1
[StackVM] [ 33%] Built target FilePlugin
[StackVM] [ 34%] Built target UnixOSProcessPlugin
[StackVM] [ 35%] Built target libffi-3.3-rc0
[StackVM] [ 37%] Built target MiscPrimitivePlugin
[StackVM] [ 38%] Built target JPEGReaderPlugin
[StackVM] [ 39%] Built target pixman-0.34.0
[StackVM] [ 40%] Built target BitBltPlugin
[StackVM] [ 41%] Built target libssh2-1.7.0
[StackVM] [ 42%] Built target LargeIntegers
[StackVM] [ 44%] Built target openssl-1.0.2q
[StackVM] [ 81%] Built target JPEGReadWriter2Plugin
[StackVM] [ 83%] Built target FileAttributesPlugin
[StackVM] [ 84%] Built target libpng-1.2.49
[StackVM] [ 86%] Built target IA32ABI
[StackVM] [ 87%] Built target SecurityPlugin
[StackVM] [ 89%] Built target LocalePlugin
[StackVM] [ 90%] Built target SurfacePlugin
[StackVM] [ 92%] Built target DSAPrims
[StackVM] [ 94%] Built target SocketPlugin
[StackVM] [ 96%] Built target UUIDPlugin
[StackVM] [100%] Built target SqueakFFIPrims
[StackVM] Run CPack packaging tool...
[StackVM] CPack: Create package using ZIP
[StackVM] CPack: Install projects
[StackVM] CPack: - Run preinstall target for: PharoVM
[StackVM] CPack: - Install project: PharoVM
[StackVM] CPack: -   Install component: bin
[StackVM] CPack: -   Install component: include
[StackVM] CPack: Create package
[StackVM] CPack: - package: /builds/workspace/pharo-vm_headless@2/build/build/packages/PharoVM-8.1.0-5916a0a-mac64-bin.zip generated.
[StackVM] CPack: - checksum file: /builds/workspace/pharo-vm_headless@2/build/build/packages/PharoVM-8.1.0-5916a0a-mac64-bin.zip.sha1 generated.
[StackVM] CPack: - package: /builds/workspace/pharo-vm_headless@2/build/build/packages/PharoVM-8.1.0-5916a0a-mac64-include.zip generated.
[StackVM] CPack: - checksum file: /builds/workspace/pharo-vm_headless@2/build/build/packages/PharoVM-8.1.0-5916a0a-mac64-include.zip.sha1 generated.
[Pipeline] [StackVM] }
[Pipeline] [StackVM] // dir
[Pipeline] [StackVM] stash
[StackVM] Stashed 4 file(s)
[Pipeline] [StackVM] archiveArtifacts
[StackVM] Archiving artifacts
[Pipeline] [StackVM] }
[Pipeline] [StackVM] // stage
[Pipeline] [StackVM] }
[Pipeline] [StackVM] // timeout
[Pipeline] [StackVM] }
[Pipeline] [StackVM] // node
[Pipeline] [StackVM] }
[Pipeline] // parallel
[Pipeline] End of Pipeline

GitHub has been notified of this commit’s build result

ERROR: script returned exit code 2
Finished: FAILURE