FailedConsole Output

Skipping 784 KB.. Full Log
ce/pharo-vm_headless/repository/extracted/plugins/B2DPlugin/src/common/B2DPlugin.c:6028:1: warning: unused function 'lastExportedFillPut' [-Wunused-function]
[windows] lastExportedFillPut(sqInt value)
[windows] ^
[windows] /cygdrive/e/Builds/workspace/pharo-vm_headless/repository/extracted/plugins/B2DPlugin/src/common/B2DPlugin.c:6035:1: warning: unused function 'lastExportedLeftXGet' [-Wunused-function]
[windows] lastExportedLeftXGet(void)
[windows] ^
[windows] /cygdrive/e/Builds/workspace/pharo-vm_headless/repository/extracted/plugins/B2DPlugin/src/common/B2DPlugin.c:6042:1: warning: unused function 'lastExportedLeftXPut' [-Wunused-function]
[windows] lastExportedLeftXPut(sqInt value)
[windows] ^
[windows] /cygdrive/e/Builds/workspace/pharo-vm_headless/repository/extracted/plugins/B2DPlugin/src/common/B2DPlugin.c:6049:1: warning: unused function 'lastExportedRightXGet' [-Wunused-function]
[windows] lastExportedRightXGet(void)
[windows] ^
[windows] /cygdrive/e/Builds/workspace/pharo-vm_headless/repository/extracted/plugins/B2DPlugin/src/common/B2DPlugin.c:6056:1: warning: unused function 'lastExportedRightXPut' [-Wunused-function]
[windows] lastExportedRightXPut(sqInt value)
[windows] ^
[windows] /cygdrive/e/Builds/workspace/pharo-vm_headless/repository/extracted/plugins/B2DPlugin/src/common/B2DPlugin.c:6063:1: warning: unused function 'lineEndXOf' [-Wunused-function]
[windows] lineEndXOf(sqInt line)
[windows] ^
[windows] /cygdrive/e/Builds/workspace/pharo-vm_headless/repository/extracted/plugins/B2DPlugin/src/common/B2DPlugin.c:6070:1: warning: unused function 'lineEndXOfput' [-Wunused-function]
[windows] lineEndXOfput(sqInt line, sqInt value)
[windows] ^
[windows] /cygdrive/e/Builds/workspace/pharo-vm_headless/repository/extracted/plugins/B2DPlugin/src/common/B2DPlugin.c:6077:1: warning: unused function 'lineEndYOf' [-Wunused-function]
[windows] lineEndYOf(sqInt line)
[windows] ^
[windows] /cygdrive/e/Builds/workspace/pharo-vm_headless/repository/extracted/plugins/B2DPlugin/src/common/B2DPlugin.c:6084:1: warning: unused function 'lineEndYOfput' [-Wunused-function]
[windows] lineEndYOfput(sqInt line, sqInt value)
[windows] ^
[windows] /cygdrive/e/Builds/workspace/pharo-vm_headless/repository/extracted/plugins/B2DPlugin/src/common/B2DPlugin.c:6091:1: warning: unused function 'lineErrorAdjDownOf' [-Wunused-function]
[windows] lineErrorAdjDownOf(sqInt line)
[windows] ^
[windows] /cygdrive/e/Builds/workspace/pharo-vm_headless/repository/extracted/plugins/B2DPlugin/src/common/B2DPlugin.c:6098:1: warning: unused function 'lineErrorAdjDownOfput' [-Wunused-function]
[windows] lineErrorAdjDownOfput(sqInt line, sqInt value)
[windows] ^
[windows] /cygdrive/e/Builds/workspace/pharo-vm_headless/repository/extracted/plugins/B2DPlugin/src/common/B2DPlugin.c:6105:1: warning: unused function 'lineErrorAdjUpOf' [-Wunused-function]
[windows] lineErrorAdjUpOf(sqInt line)
[windows] ^
[windows] /cygdrive/e/Builds/workspace/pharo-vm_headless/repository/extracted/plugins/B2DPlugin/src/common/B2DPlugin.c:6112:1: warning: unused function 'lineErrorAdjUpOfput' [-Wunused-function]
[windows] lineErrorAdjUpOfput(sqInt line, sqInt value)
[windows] ^
[windows] /cygdrive/e/Builds/workspace/pharo-vm_headless/repository/extracted/plugins/B2DPlugin/src/common/B2DPlugin.c:6119:1: warning: unused function 'lineErrorOf' [-Wunused-function]
[windows] lineErrorOf(sqInt line)
[windows] ^
[windows] /cygdrive/e/Builds/workspace/pharo-vm_headless/repository/extracted/plugins/B2DPlugin/src/common/B2DPlugin.c:6126:1: warning: unused function 'lineErrorOfput' [-Wunused-function]
[windows] lineErrorOfput(sqInt line, sqInt value)
[windows] ^
[windows] /cygdrive/e/Builds/workspace/pharo-vm_headless/repository/extracted/plugins/B2DPlugin/src/common/B2DPlugin.c:6133:1: warning: unused function 'lineXDirectionOf' [-Wunused-function]
[windows] lineXDirectionOf(sqInt line)
[windows] ^
[windows] /cygdrive/e/Builds/workspace/pharo-vm_headless/repository/extracted/plugins/B2DPlugin/src/common/B2DPlugin.c:6140:1: warning: unused function 'lineXDirectionOfput' [-Wunused-function]
[windows] lineXDirectionOfput(sqInt line, sqInt value)
[windows] ^
[windows] /cygdrive/e/Builds/workspace/pharo-vm_headless/repository/extracted/plugins/B2DPlugin/src/common/B2DPlugin.c:6147:1: warning: unused function 'lineXIncrementOf' [-Wunused-function]
[windows] lineXIncrementOf(sqInt line)
[windows] ^
[windows] /cygdrive/e/Builds/workspace/pharo-vm_headless/repository/extracted/plugins/B2DPlugin/src/common/B2DPlugin.c:6154:1: warning: unused function 'lineXIncrementOfput' [-Wunused-function]
[windows] lineXIncrementOfput(sqInt line, sqInt value)
[windows] ^
[windows] /cygdrive/e/Builds/workspace/pharo-vm_headless/repository/extracted/plugins/B2DPlugin/src/common/B2DPlugin.c:6161:1: warning: unused function 'lineYDirectionOf' [-Wunused-function]
[windows] lineYDirectionOf(sqInt line)
[windows] ^
[windows] /cygdrive/e/Builds/workspace/pharo-vm_headless/repository/extracted/plugins/B2DPlugin/src/common/B2DPlugin.c:6168:1: warning: unused function 'lineYDirectionOfput' [-Wunused-function]
[windows] lineYDirectionOfput(sqInt line, sqInt value)
[windows] ^
[windows] /cygdrive/e/Builds/workspace/pharo-vm_headless/repository/extracted/plugins/B2DPlugin/src/common/B2DPlugin.c:6237:1: warning: unused function 'loadArrayPolygonnPointsfilllineWidthlineFill' [-Wunused-function]
[windows] loadArrayPolygonnPointsfilllineWidthlineFill(sqInt points, sqInt nPoints, sqInt fillIndex, sqInt lineWidth, sqInt lineFill)
[windows] ^
[windows] /cygdrive/e/Builds/workspace/pharo-vm_headless/repository/extracted/plugins/B2DPlugin/src/common/B2DPlugin.c:6691:1: warning: unused function 'loadBitmapFillcolormaptilefromalongnormalxIndex' [-Wunused-function]
[windows] loadBitmapFillcolormaptilefromalongnormalxIndex(sqInt formOop, sqInt cmOop, sqInt tileFlag, int *point1, int *point2, int *point3, sqInt xIndex)
[windows] ^
[windows] /cygdrive/e/Builds/workspace/pharo-vm_headless/repository/extracted/plugins/B2DPlugin/src/common/B2DPlugin.c:6834:1: warning: unused function 'loadColorTransformFrom' [-Wunused-function]
[windows] loadColorTransformFrom(sqInt transformOop)
[windows] ^
[windows] /cygdrive/e/Builds/workspace/pharo-vm_headless/repository/extracted/plugins/B2DPlugin/src/common/B2DPlugin.c:6861:1: warning: unused function 'loadCompressedSegmentfromshortleftFillrightFilllineWidthlineColor' [-Wunused-function]
[windows] loadCompressedSegmentfromshortleftFillrightFilllineWidthlineColor(sqInt segmentIndex, sqInt points, sqInt pointsShort, sqInt leftFill, sqInt rightFill, sqInt lineWidth, sqInt lineFill)
[windows] ^
[windows] /cygdrive/e/Builds/workspace/pharo-vm_headless/repository/extracted/plugins/B2DPlugin/src/common/B2DPlugin.c:7868:1: warning: unused function 'loadLinefromtooffsetleftFillrightFill' [-Wunused-function]
[windows] loadLinefromtooffsetleftFillrightFill(sqInt line, int *point1, int *point2, sqInt yOffset, sqInt leftFill, sqInt rightFill)
[windows] ^
[windows] /cygdrive/e/Builds/workspace/pharo-vm_headless/repository/extracted/plugins/B2DPlugin/src/common/B2DPlugin.c:8093:1: warning: unused function 'loadPointIntAtfrom' [-Wunused-function]
[windows] loadPointIntAtfrom(sqInt index, sqInt intArray)
[windows] ^
[windows] /cygdrive/e/Builds/workspace/pharo-vm_headless/repository/extracted/plugins/B2DPlugin/src/common/B2DPlugin.c:8103:1: warning: unused function 'loadPointShortAtfrom' [-Wunused-function]
[windows] loadPointShortAtfrom(sqInt index, sqInt shortArray)
[windows] ^
[windows] /cygdrive/e/Builds/workspace/pharo-vm_headless/repository/extracted/plugins/B2DPlugin/src/common/B2DPlugin.c:8147:1: warning: unused function 'loadPolygonnPointsfilllineWidthlineFillpointsShort' [-Wunused-function]
[windows] loadPolygonnPointsfilllineWidthlineFillpointsShort(int *points, sqInt nPoints, sqInt fillIndex, sqInt lineWidth, sqInt lineFill, sqInt isShort)
[windows] ^
[windows] /cygdrive/e/Builds/workspace/pharo-vm_headless/repository/extracted/plugins/B2DPlugin/src/common/B2DPlugin.c:8316:1: warning: unused function 'loadRectanglelineFillleftFillrightFill' [-Wunused-function]
[windows] loadRectanglelineFillleftFillrightFill(sqInt lineWidth, sqInt lineFill, sqInt leftFill, sqInt rightFill)
[windows] ^
[windows] /cygdrive/e/Builds/workspace/pharo-vm_headless/repository/extracted/plugins/B2DPlugin/src/common/B2DPlugin.c:8973:1: warning: unused function 'magicNumberGet' [-Wunused-function]
[windows] magicNumberGet(void)
[windows] ^
[windows] /cygdrive/e/Builds/workspace/pharo-vm_headless/repository/extracted/plugins/B2DPlugin/src/common/B2DPlugin.c:8980:1: warning: unused function 'magicNumberPut' [-Wunused-function]
[windows] magicNumberPut(sqInt value)
[windows] ^
[windows] /cygdrive/e/Builds/workspace/pharo-vm_headless/repository/extracted/plugins/B2DPlugin/src/common/B2DPlugin.c:8987:1: warning: unused function 'makeRectFromPoints' [-Wunused-function]
[windows] makeRectFromPoints(void)
[windows] ^
[windows] /cygdrive/e/Builds/workspace/pharo-vm_headless/repository/extracted/plugins/B2DPlugin/src/common/B2DPlugin.c:8998:1: warning: unused function 'makeUnsignedFrom' [-Wunused-function]
[windows] makeUnsignedFrom(sqInt someIntegerValue)
[windows] ^
[windows] /cygdrive/e/Builds/workspace/pharo-vm_headless/repository/extracted/plugins/B2DPlugin/src/common/B2DPlugin.c:9058:1: warning: unused function 'needsFlush' [-Wunused-function]
[windows] needsFlush(void)
[windows] ^
[windows] /cygdrive/e/Builds/workspace/pharo-vm_headless/repository/extracted/plugins/B2DPlugin/src/common/B2DPlugin.c:9065:1: warning: unused function 'needsFlushGet' [-Wunused-function]
[windows] needsFlushGet(void)
[windows] ^
[windows] /cygdrive/e/Builds/workspace/pharo-vm_headless/repository/extracted/plugins/B2DPlugin/src/common/B2DPlugin.c:9072:1: warning: unused function 'needsFlushPut' [-Wunused-function]
[windows] needsFlushPut(sqInt value)
[windows] ^
[windows] /cygdrive/e/Builds/workspace/pharo-vm_headless/repository/extracted/plugins/B2DPlugin/src/common/B2DPlugin.c:9079:1: warning: unused function 'objectHeaderOf' [-Wunused-function]
[windows] objectHeaderOf(sqInt obj)
[windows] ^
[windows] /cygdrive/e/Builds/workspace/pharo-vm_headless/repository/extracted/plugins/B2DPlugin/src/common/B2DPlugin.c:9090:1: warning: unused function 'objectIndexOf' [-Wunused-function]
[windows] objectIndexOf(sqInt obj)
[windows] ^
[windows] /cygdrive/e/Builds/workspace/pharo-vm_headless/repository/extracted/plugins/B2DPlugin/src/common/B2DPlugin.c:9097:1: warning: unused function 'objectIndexOfput' [-Wunused-function]
[windows] objectIndexOfput(sqInt obj, sqInt value)
[windows] ^
[windows] /cygdrive/e/Builds/workspace/pharo-vm_headless/repository/extracted/plugins/B2DPlugin/src/common/B2DPlugin.c:9104:1: warning: unused function 'objectLengthOf' [-Wunused-function]
[windows] objectLengthOf(sqInt obj)
[windows] ^
[windows] /cygdrive/e/Builds/workspace/pharo-vm_headless/repository/extracted/plugins/B2DPlugin/src/common/B2DPlugin.c:9111:1: warning: unused function 'objectLengthOfput' [-Wunused-function]
[windows] objectLengthOfput(sqInt obj, sqInt value)
[windows] ^
[windows] /cygdrive/e/Builds/workspace/pharo-vm_headless/repository/extracted/plugins/B2DPlugin/src/common/B2DPlugin.c:9118:1: warning: unused function 'objectTypeOf' [-Wunused-function]
[windows] objectTypeOf(sqInt obj)
[windows] ^
[windows] /cygdrive/e/Builds/workspace/pharo-vm_headless/repository/extracted/plugins/B2DPlugin/src/common/B2DPlugin.c:9125:1: warning: unused function 'objectTypeOfput' [-Wunused-function]
[windows] objectTypeOfput(sqInt obj, sqInt value)
[windows] ^
[windows] /cygdrive/e/Builds/workspace/pharo-vm_headless/repository/extracted/plugins/B2DPlugin/src/common/B2DPlugin.c:9132:1: warning: unused function 'objStartGet' [-Wunused-function]
[windows] objStartGet(void)
[windows] ^
[windows] /cygdrive/e/Builds/workspace/pharo-vm_headless/repository/extracted/plugins/B2DPlugin/src/common/B2DPlugin.c:9139:1: warning: unused function 'objStartPut' [-Wunused-function]
[windows] objStartPut(sqInt value)
[windows] ^
[windows] /cygdrive/e/Builds/workspace/pharo-vm_headless/repository/extracted/plugins/B2DPlugin/src/common/B2DPlugin.c:9146:1: warning: unused function 'objUsedGet' [-Wunused-function]
[windows] objUsedGet(void)
[windows] ^
[windows] /cygdrive/e/Builds/workspace/pharo-vm_headless/repository/extracted/plugins/B2DPlugin/src/common/B2DPlugin.c:9153:1: warning: unused function 'objUsedPut' [-Wunused-function]
[windows] objUsedPut(sqInt value)
[windows] ^
[windows] /cygdrive/e/Builds/workspace/pharo-vm_headless/repository/extracted/plugins/B2DPlugin/src/common/B2DPlugin.c:9160:1: warning: unused function 'objat' [-Wunused-function]
[windows] objat(sqInt object, sqInt index)
[windows] ^
[windows] /cygdrive/e/Builds/workspace/pharo-vm_headless/repository/extracted/plugins/B2DPlugin/src/common/B2DPlugin.c:9167:1: warning: unused function 'objatput' [-Wunused-function]
[windows] objatput(sqInt object, sqInt index, sqInt value)
[windows] ^
[windows] /cygdrive/e/Builds/workspace/pharo-vm_headless/repository/extracted/plugins/B2DPlugin/src/common/B2DPlugin.c:9178:1: warning: unused function 'offsetFromWidth' [-Wunused-function]
[windows] offsetFromWidth(sqInt lineWidth)
[windows] ^
[windows] /cygdrive/e/Builds/workspace/pharo-vm_headless/repository/extracted/plugins/B2DPlugin/src/common/B2DPlugin.c:9185:1: warning: unused function 'point1Get' [-Wunused-function]
[windows] point1Get(void)
[windows] ^
[windows] /cygdrive/e/Builds/workspace/pharo-vm_headless/repository/extracted/plugins/B2DPlugin/src/common/B2DPlugin.c:9192:1: warning: unused function 'point2Get' [-Wunused-function]
[windows] point2Get(void)
[windows] ^
[windows] /cygdrive/e/Builds/workspace/pharo-vm_headless/repository/extracted/plugins/B2DPlugin/src/common/B2DPlugin.c:9199:1: warning: unused function 'point3Get' [-Wunused-function]
[windows] point3Get(void)
[windows] ^
[windows] /cygdrive/e/Builds/workspace/pharo-vm_headless/repository/extracted/plugins/B2DPlugin/src/common/B2DPlugin.c:9206:1: warning: unused function 'point4Get' [-Wunused-function]
[windows] point4Get(void)
[windows] ^
[windows] /cygdrive/e/Builds/workspace/pharo-vm_headless/repository/extracted/plugins/B2DPlugin/src/common/B2DPlugin.c:12282:1: warning: unused function 'quickRemoveInvalidFillsAt' [-Wunused-function]
[windows] quickRemoveInvalidFillsAt(sqInt leftX)
[windows] ^
[windows] /cygdrive/e/Builds/workspace/pharo-vm_headless/repository/extracted/plugins/B2DPlugin/src/common/B2DPlugin.c:12428:1: warning: unused function 'repeatValuemax' [-Wunused-function]
[windows] repeatValuemax(sqInt delta, sqInt maxValue)
[windows] ^
[windows] /cygdrive/e/Builds/workspace/pharo-vm_headless/repository/extracted/plugins/B2DPlugin/src/common/B2DPlugin.c:12495:1: warning: unused function 'returnWideBezierFill' [-Wunused-function]
[windows] returnWideBezierFill(void)
[windows] ^
[windows] /cygdrive/e/Builds/workspace/pharo-vm_headless/repository/extracted/plugins/B2DPlugin/src/common/B2DPlugin.c:12502:1: warning: unused function 'returnWideBezierWidth' [-Wunused-function]
[windows] returnWideBezierWidth(void)
[windows] ^
[windows] /cygdrive/e/Builds/workspace/pharo-vm_headless/repository/extracted/plugins/B2DPlugin/src/common/B2DPlugin.c:12512:1: warning: unused function 'returnWideLineFill' [-Wunused-function]
[windows] returnWideLineFill(void)
[windows] ^
[windows] /cygdrive/e/Builds/workspace/pharo-vm_headless/repository/extracted/plugins/B2DPlugin/src/common/B2DPlugin.c:12522:1: warning: unused function 'returnWideLineWidth' [-Wunused-function]
[windows] returnWideLineWidth(void)
[windows] ^
[windows] /cygdrive/e/Builds/workspace/pharo-vm_headless/repository/extracted/plugins/B2DPlugin/src/common/B2DPlugin.c:12668:1: warning: unused function 'shortRunLengthAtfrom' [-Wunused-function]
[windows] shortRunLengthAtfrom(sqInt i, sqInt runArray)
[windows] ^
[windows] /cygdrive/e/Builds/workspace/pharo-vm_headless/repository/extracted/plugins/B2DPlugin/src/common/B2DPlugin.c:12680:1: warning: unused function 'shortRunValueAtfrom' [-Wunused-function]
[windows] shortRunValueAtfrom(sqInt i, sqInt runArray)
[windows] ^
[windows] /cygdrive/e/Builds/workspace/pharo-vm_headless/repository/extracted/plugins/B2DPlugin/src/common/B2DPlugin.c:12748:1: warning: unused function 'sortGlobalEdgeTable' [-Wunused-function]
[windows] sortGlobalEdgeTable(void)
[windows] ^
[windows] /cygdrive/e/Builds/workspace/pharo-vm_headless/repository/extracted/plugins/B2DPlugin/src/common/B2DPlugin.c:12756:1: warning: unused function 'spanEndAAGet' [-Wunused-function]
[windows] spanEndAAGet(void)
[windows] ^
[windows] /cygdrive/e/Builds/workspace/pharo-vm_headless/repository/extracted/plugins/B2DPlugin/src/common/B2DPlugin.c:12763:1: warning: unused function 'spanEndAAPut' [-Wunused-function]
[windows] spanEndAAPut(sqInt value)
[windows] ^
[windows] /cygdrive/e/Builds/workspace/pharo-vm_headless/repository/extracted/plugins/B2DPlugin/src/common/B2DPlugin.c:12770:1: warning: unused function 'spanEndGet' [-Wunused-function]
[windows] spanEndGet(void)
[windows] ^
[windows] /cygdrive/e/Builds/workspace/pharo-vm_headless/repository/extracted/plugins/B2DPlugin/src/common/B2DPlugin.c:12777:1: warning: unused function 'spanEndPut' [-Wunused-function]
[windows] spanEndPut(sqInt value)
[windows] ^
[windows] /cygdrive/e/Builds/workspace/pharo-vm_headless/repository/extracted/plugins/B2DPlugin/src/common/B2DPlugin.c:12784:1: warning: unused function 'spanSizeGet' [-Wunused-function]
[windows] spanSizeGet(void)
[windows] ^
[windows] /cygdrive/e/Builds/workspace/pharo-vm_headless/repository/extracted/plugins/B2DPlugin/src/common/B2DPlugin.c:12791:1: warning: unused function 'spanSizePut' [-Wunused-function]
[windows] spanSizePut(sqInt value)
[windows] ^
[windows] /cygdrive/e/Builds/workspace/pharo-vm_headless/repository/extracted/plugins/B2DPlugin/src/common/B2DPlugin.c:12798:1: warning: unused function 'spanStartGet' [-Wunused-function]
[windows] spanStartGet(void)
[windows] ^
[windows] /cygdrive/e/Builds/workspace/pharo-vm_headless/repository/extracted/plugins/B2DPlugin/src/common/B2DPlugin.c:12805:1: warning: unused function 'spanStartPut' [-Wunused-function]
[windows] spanStartPut(sqInt value)
[windows] ^
[windows] /cygdrive/e/Builds/workspace/pharo-vm_headless/repository/extracted/plugins/B2DPlugin/src/common/B2DPlugin.c:12812:1: warning: unused function 'squaredLengthOfwith' [-Wunused-function]
[windows] squaredLengthOfwith(sqInt deltaX, sqInt deltaY)
[windows] ^
[windows] /cygdrive/e/Builds/workspace/pharo-vm_headless/repository/extracted/plugins/B2DPlugin/src/common/B2DPlugin.c:12819:1: warning: unused function 'stackFillDepth' [-Wunused-function]
[windows] stackFillDepth(sqInt index)
[windows] ^
[windows] /cygdrive/e/Builds/workspace/pharo-vm_headless/repository/extracted/plugins/B2DPlugin/src/common/B2DPlugin.c:12826:1: warning: unused function 'stackFillDepthput' [-Wunused-function]
[windows] stackFillDepthput(sqInt index, sqInt value)
[windows] ^
[windows] /cygdrive/e/Builds/workspace/pharo-vm_headless/repository/extracted/plugins/B2DPlugin/src/common/B2DPlugin.c:12833:1: warning: unused function 'stackFillEntryLength' [-Wunused-function]
[windows] stackFillEntryLength(void)
[windows] ^
[windows] /cygdrive/e/Builds/workspace/pharo-vm_headless/repository/extracted/plugins/B2DPlugin/src/common/B2DPlugin.c:12840:1: warning: unused function 'stackFillRightX' [-Wunused-function]
[windows] stackFillRightX(sqInt index)
[windows] ^
[windows] /cygdrive/e/Builds/workspace/pharo-vm_headless/repository/extracted/plugins/B2DPlugin/src/common/B2DPlugin.c:12847:1: warning: unused function 'stackFillRightXput' [-Wunused-function]
[windows] stackFillRightXput(sqInt index, sqInt value)
[windows] ^
[windows] /cygdrive/e/Builds/workspace/pharo-vm_headless/repository/extracted/plugins/B2DPlugin/src/common/B2DPlugin.c:12854:1: warning: unused function 'stackFillSize' [-Wunused-function]
[windows] stackFillSize(void)
[windows] ^
[windows] /cygdrive/e/Builds/workspace/pharo-vm_headless/repository/extracted/plugins/B2DPlugin/src/common/B2DPlugin.c:12861:1: warning: unused function 'stackFillValue' [-Wunused-function]
[windows] stackFillValue(sqInt index)
[windows] ^
[windows] /cygdrive/e/Builds/workspace/pharo-vm_headless/repository/extracted/plugins/B2DPlugin/src/common/B2DPlugin.c:12868:1: warning: unused function 'stackFillValueput' [-Wunused-function]
[windows] stackFillValueput(sqInt index, sqInt value)
[windows] ^
[windows] /cygdrive/e/Builds/workspace/pharo-vm_headless/repository/extracted/plugins/B2DPlugin/src/common/B2DPlugin.c:12875:1: warning: unused function 'stateGet' [-Wunused-function]
[windows] stateGet(void)
[windows] ^
[windows] /cygdrive/e/Builds/workspace/pharo-vm_headless/repository/extracted/plugins/B2DPlugin/src/common/B2DPlugin.c:12882:1: warning: unused function 'statePut' [-Wunused-function]
[windows] statePut(sqInt value)
[windows] ^
[windows] /cygdrive/e/Builds/workspace/pharo-vm_headless/repository/extracted/plugins/B2DPlugin/src/common/B2DPlugin.c:12894:1: warning: unused function 'stepToFirstBezier' [-Wunused-function]
[windows] stepToFirstBezier(void)
[windows] ^
[windows] /cygdrive/e/Builds/workspace/pharo-vm_headless/repository/extracted/plugins/B2DPlugin/src/common/B2DPlugin.c:13033:1: warning: unused function 'stepToFirstLine' [-Wunused-function]
[windows] stepToFirstLine(void)
[windows] ^
[windows] /cygdrive/e/Builds/workspace/pharo-vm_headless/repository/extracted/plugins/B2DPlugin/src/common/B2DPlugin.c:13140:1: warning: unused function 'stepToFirstWideBezier' [-Wunused-function]
[windows] stepToFirstWideBezier(void)
[windows] ^
[windows] /cygdrive/e/Builds/workspace/pharo-vm_headless/repository/extracted/plugins/B2DPlugin/src/common/B2DPlugin.c:13244:1: warning: unused function 'stepToFirstWideLine' [-Wunused-function]
[windows] stepToFirstWideLine(void)
[windows] ^
[windows] /cygdrive/e/Builds/workspace/pharo-vm_headless/repository/extracted/plugins/B2DPlugin/src/common/B2DPlugin.c:13388:1: warning: unused function 'stepToNextBezier' [-Wunused-function]
[windows] stepToNextBezier(void)
[windows] ^
[windows] /cygdrive/e/Builds/workspace/pharo-vm_headless/repository/extracted/plugins/B2DPlugin/src/common/B2DPlugin.c:13434:1: warning: unused function 'stepToNextBezierForwardat' [-Wunused-function]
[windows] stepToNextBezierForwardat(int *updateData, sqInt yValue)
[windows] ^
[windows] /cygdrive/e/Builds/workspace/pharo-vm_headless/repository/extracted/plugins/B2DPlugin/src/common/B2DPlugin.c:13515:1: warning: unused function 'stepToNextLine' [-Wunused-function]
[windows] stepToNextLine(void)
[windows] ^
[windows] /cygdrive/e/Builds/workspace/pharo-vm_headless/repository/extracted/plugins/B2DPlugin/src/common/B2DPlugin.c:13686:1: warning: unused function 'stepToNextWideLine' [-Wunused-function]
[windows] stepToNextWideLine(void)
[windows] ^
[windows] /cygdrive/e/Builds/workspace/pharo-vm_headless/repository/extracted/plugins/B2DPlugin/src/common/B2DPlugin.c:13814:1: warning: unused function 'stopBecauseOf' [-Wunused-function]
[windows] stopBecauseOf(sqInt stopReason)
[windows] ^
[windows] /cygdrive/e/Builds/workspace/pharo-vm_headless/repository/extracted/plugins/B2DPlugin/src/common/B2DPlugin.c:13823:1: warning: unused function 'stopReasonGet' [-Wunused-function]
[windows] stopReasonGet(void)
[windows] ^
[windows] /cygdrive/e/Builds/workspace/pharo-vm_headless/repository/extracted/plugins/B2DPlugin/src/common/B2DPlugin.c:13830:1: warning: unused function 'stopReasonPut' [-Wunused-function]
[windows] stopReasonPut(sqInt value)
[windows] ^
[windows] /cygdrive/e/Builds/workspace/pharo-vm_headless/repository/extracted/plugins/B2DPlugin/src/common/B2DPlugin.c:13854:1: warning: unused function 'storeEngineStateInto' [-Wunused-function]
[windows] storeEngineStateInto(sqInt oop)
[windows] ^
[windows] /cygdrive/e/Builds/workspace/pharo-vm_headless/repository/extracted/plugins/B2DPlugin/src/common/B2DPlugin.c:13930:1: warning: unused function 'storeStopStateIntoEdgefill' [-Wunused-function]
[windows] storeStopStateIntoEdgefill(sqInt edgeOop, sqInt fillOop)
[windows] ^
[windows] /cygdrive/e/Builds/workspace/pharo-vm_headless/repository/extracted/plugins/B2DPlugin/src/common/B2DPlugin.c:14334:1: warning: unused function 'topFillDepth' [-Wunused-function]
[windows] topFillDepth(void)
[windows] ^
[windows] /cygdrive/e/Builds/workspace/pharo-vm_headless/repository/extracted/plugins/B2DPlugin/src/common/B2DPlugin.c:14345:1: warning: unused function 'topFillDepthPut' [-Wunused-function]
[windows] topFillDepthPut(sqInt value)
[windows] ^
[windows] /cygdrive/e/Builds/workspace/pharo-vm_headless/repository/extracted/plugins/B2DPlugin/src/common/B2DPlugin.c:14356:1: warning: unused function 'topFillRightX' [-Wunused-function]
[windows] topFillRightX(void)
[windows] ^
[windows] /cygdrive/e/Builds/workspace/pharo-vm_headless/repository/extracted/plugins/B2DPlugin/src/common/B2DPlugin.c:14367:1: warning: unused function 'topFillRightXPut' [-Wunused-function]
[windows] topFillRightXPut(sqInt value)
[windows] ^
[windows] /cygdrive/e/Builds/workspace/pharo-vm_headless/repository/extracted/plugins/B2DPlugin/src/common/B2DPlugin.c:14378:1: warning: unused function 'topFillValue' [-Wunused-function]
[windows] topFillValue(void)
[windows] ^
[windows] /cygdrive/e/Builds/workspace/pharo-vm_headless/repository/extracted/plugins/B2DPlugin/src/common/B2DPlugin.c:14389:1: warning: unused function 'topFillValuePut' [-Wunused-function]
[windows] topFillValuePut(sqInt value)
[windows] ^
[windows] /cygdrive/e/Builds/workspace/pharo-vm_headless/repository/extracted/plugins/B2DPlugin/src/common/B2DPlugin.c:14468:1: warning: unused function 'transformPoints' [-Wunused-function]
[windows] transformPoints(sqInt n)
[windows] ^
[windows] /cygdrive/e/Builds/workspace/pharo-vm_headless/repository/extracted/plugins/B2DPlugin/src/common/B2DPlugin.c:14597:1: warning: unused function 'transformPointXyinto' [-Wunused-function]
[windows] transformPointXyinto(double xValue, double yValue, int *dstPoint)
[windows] ^
[windows] /cygdrive/e/Builds/workspace/pharo-vm_headless/repository/extracted/plugins/B2DPlugin/src/common/B2DPlugin.c:14619:1: warning: unused function 'transformPoint' [-Wunused-function]
[windows] transformPoint(int *point)
[windows] ^
[windows] /cygdrive/e/Builds/workspace/pharo-vm_headless/repository/extracted/plugins/B2DPlugin/src/common/B2DPlugin.c:14658:1: warning: unused function 'transformPointinto' [-Wunused-function]
[windows] transformPointinto(sqInt srcPoint, sqInt dstPoint)
[windows] ^
[windows] /cygdrive/e/Builds/workspace/pharo-vm_headless/repository/extracted/plugins/B2DPlugin/src/common/B2DPlugin.c:14872:1: warning: unused function 'wbSizeGet' [-Wunused-function]
[windows] wbSizeGet(void)
[windows] ^
[windows] /cygdrive/e/Builds/workspace/pharo-vm_headless/repository/extracted/plugins/B2DPlugin/src/common/B2DPlugin.c:14879:1: warning: unused function 'wbSizePut' [-Wunused-function]
[windows] wbSizePut(sqInt value)
[windows] ^
[windows] /cygdrive/e/Builds/workspace/pharo-vm_headless/repository/extracted/plugins/B2DPlugin/src/common/B2DPlugin.c:14886:1: warning: unused function 'wbStackClear' [-Wunused-function]
[windows] wbStackClear(void)
[windows] ^
[windows] /cygdrive/e/Builds/workspace/pharo-vm_headless/repository/extracted/plugins/B2DPlugin/src/common/B2DPlugin.c:14895:1: warning: unused function 'wbStackPop' [-Wunused-function]
[windows] wbStackPop(sqInt nItems)
[windows] ^
[windows] /cygdrive/e/Builds/workspace/pharo-vm_headless/repository/extracted/plugins/B2DPlugin/src/common/B2DPlugin.c:14916:1: warning: unused function 'wbStackSize' [-Wunused-function]
[windows] wbStackSize(void)
[windows] ^
[windows] /cygdrive/e/Builds/workspace/pharo-vm_headless/repository/extracted/plugins/B2DPlugin/src/common/B2DPlugin.c:14923:1: warning: unused function 'wbStackValue' [-Wunused-function]
[windows] wbStackValue(sqInt index)
[windows] ^
[windows] /cygdrive/e/Builds/workspace/pharo-vm_headless/repository/extracted/plugins/B2DPlugin/src/common/B2DPlugin.c:14930:1: warning: unused function 'wbStackValueput' [-Wunused-function]
[windows] wbStackValueput(sqInt index, sqInt value)
[windows] ^
[windows] /cygdrive/e/Builds/workspace/pharo-vm_headless/repository/extracted/plugins/B2DPlugin/src/common/B2DPlugin.c:14937:1: warning: unused function 'wbTopGet' [-Wunused-function]
[windows] wbTopGet(void)
[windows] ^
[windows] /cygdrive/e/Builds/workspace/pharo-vm_headless/repository/extracted/plugins/B2DPlugin/src/common/B2DPlugin.c:14944:1: warning: unused function 'wbTopPut' [-Wunused-function]
[windows] wbTopPut(sqInt value)
[windows] ^
[windows] /cygdrive/e/Builds/workspace/pharo-vm_headless/repository/extracted/plugins/B2DPlugin/src/common/B2DPlugin.c:14951:1: warning: unused function 'wideBezierEntryOf' [-Wunused-function]
[windows] wideBezierEntryOf(sqInt line)
[windows] ^
[windows] /cygdrive/e/Builds/workspace/pharo-vm_headless/repository/extracted/plugins/B2DPlugin/src/common/B2DPlugin.c:14959:1: warning: unused function 'wideBezierEntryOfput' [-Wunused-function]
[windows] wideBezierEntryOfput(sqInt line, sqInt value)
[windows] ^
[windows] /cygdrive/e/Builds/workspace/pharo-vm_headless/repository/extracted/plugins/B2DPlugin/src/common/B2DPlugin.c:14967:1: warning: unused function 'wideBezierExitOf' [-Wunused-function]
[windows] wideBezierExitOf(sqInt line)
[windows] ^
[windows] /cygdrive/e/Builds/workspace/pharo-vm_headless/repository/extracted/plugins/B2DPlugin/src/common/B2DPlugin.c:14975:1: warning: unused function 'wideBezierExitOfput' [-Wunused-function]
[windows] wideBezierExitOfput(sqInt line, sqInt value)
[windows] ^
[windows] /cygdrive/e/Builds/workspace/pharo-vm_headless/repository/extracted/plugins/B2DPlugin/src/common/B2DPlugin.c:14983:1: warning: unused function 'wideBezierExtentOf' [-Wunused-function]
[windows] wideBezierExtentOf(sqInt bezier)
[windows] ^
[windows] /cygdrive/e/Builds/workspace/pharo-vm_headless/repository/extracted/plugins/B2DPlugin/src/common/B2DPlugin.c:14991:1: warning: unused function 'wideBezierExtentOfput' [-Wunused-function]
[windows] wideBezierExtentOfput(sqInt bezier, sqInt value)
[windows] ^
[windows] /cygdrive/e/Builds/workspace/pharo-vm_headless/repository/extracted/plugins/B2DPlugin/src/common/B2DPlugin.c:15007:1: warning: unused function 'wideBezierFillOfput' [-Wunused-function]
[windows] wideBezierFillOfput(sqInt bezier, sqInt value)
[windows] ^
[windows] /cygdrive/e/Builds/workspace/pharo-vm_headless/repository/extracted/plugins/B2DPlugin/src/common/B2DPlugin.c:15015:1: warning: unused function 'wideBezierUpdateDataOf' [-Wunused-function]
[windows] wideBezierUpdateDataOf(sqInt bezier)
[windows] ^
[windows] /cygdrive/e/Builds/workspace/pharo-vm_headless/repository/extracted/plugins/B2DPlugin/src/common/B2DPlugin.c:15030:1: warning: unused function 'wideBezierWidthOfput' [-Wunused-function]
[windows] wideBezierWidthOfput(sqInt line, sqInt value)
[windows] ^
[windows] /cygdrive/e/Builds/workspace/pharo-vm_headless/repository/extracted/plugins/B2DPlugin/src/common/B2DPlugin.c:15038:1: warning: unused function 'wideLineEntryOf' [-Wunused-function]
[windows] wideLineEntryOf(sqInt line)
[windows] ^
[windows] /cygdrive/e/Builds/workspace/pharo-vm_headless/repository/extracted/plugins/B2DPlugin/src/common/B2DPlugin.c:15046:1: warning: unused function 'wideLineEntryOfput' [-Wunused-function]
[windows] wideLineEntryOfput(sqInt line, sqInt value)
[windows] ^
[windows] /cygdrive/e/Builds/workspace/pharo-vm_headless/repository/extracted/plugins/B2DPlugin/src/common/B2DPlugin.c:15054:1: warning: unused function 'wideLineExitOf' [-Wunused-function]
[windows] wideLineExitOf(sqInt line)
[windows] ^
[windows] /cygdrive/e/Builds/workspace/pharo-vm_headless/repository/extracted/plugins/B2DPlugin/src/common/B2DPlugin.c:15062:1: warning: unused function 'wideLineExitOfput' [-Wunused-function]
[windows] wideLineExitOfput(sqInt line, sqInt value)
[windows] ^
[windows] /cygdrive/e/Builds/workspace/pharo-vm_headless/repository/extracted/plugins/B2DPlugin/src/common/B2DPlugin.c:15070:1: warning: unused function 'wideLineExtentOf' [-Wunused-function]
[windows] wideLineExtentOf(sqInt line)
[windows] ^
[windows] /cygdrive/e/Builds/workspace/pharo-vm_headless/repository/extracted/plugins/B2DPlugin/src/common/B2DPlugin.c:15078:1: warning: unused function 'wideLineExtentOfput' [-Wunused-function]
[windows] wideLineExtentOfput(sqInt line, sqInt value)
[windows] ^
[windows] /cygdrive/e/Builds/workspace/pharo-vm_headless/repository/extracted/plugins/B2DPlugin/src/common/B2DPlugin.c:15094:1: warning: unused function 'wideLineFillOfput' [-Wunused-function]
[windows] wideLineFillOfput(sqInt line, sqInt value)
[windows] ^
[windows] /cygdrive/e/Builds/workspace/pharo-vm_headless/repository/extracted/plugins/B2DPlugin/src/common/B2DPlugin.c:15110:1: warning: unused function 'wideLineWidthOfput' [-Wunused-function]
[windows] wideLineWidthOfput(sqInt line, sqInt value)
[windows] ^
[windows] /cygdrive/e/Builds/workspace/pharo-vm_headless/repository/extracted/plugins/B2DPlugin/src/common/B2DPlugin.c:15118:1: warning: unused function 'workBufferPut' [-Wunused-function]
[windows] workBufferPut(sqInt wbOop)
[windows] ^
[StackVM] 2019-09-10 16:42:16.039 Pharo[1589:507] 16:42:16.039 ERROR:     [0x7fff74f2c310] AQMEIO.cpp:377: _FindIOUnit: error -66680
[StackVM] 2019-09-10 16:42:16.039 Pharo[1589:507] 16:42:16.039 ERROR:     [0x7fff74f2c310] >aq> AudioQueueObject.cpp:1590: Prime: failed (-66680); will stop (5512/0 frames)
[StackVM] 2019-09-10 16:42:16.039 Pharo[1589:507] 16:42:16.039 ERROR:     [0x7fff74f2c310] AQMEIO.cpp:377: _FindIOUnit: error -66680
[StackVM] 2019-09-10 16:42:16.040 Pharo[1589:507] 16:42:16.040 ERROR:     [0x7fff74f2c310] >aq> AudioQueueObject.cpp:1590: Prime: failed (-66680); will stop (33075/0 frames)
[StackVM] 
[StackVM] UndefinedObject>>DoIt (path is Undeclared) 
[StackVM] 
[StackVM] UndefinedObject>>DoIt (path is Undeclared) 
[StackVM] 
[StackVM] Fetched -> BaselineOfVMMaker-CompatibleUserName.1568126004 --- https://github.com/pharo-project/opensmalltalk-vm.git[Detached at 42f33b4] --- https://github.com/pharo-project/opensmalltalk-vm.git[Detached at 42f33b4]
[StackVM] Loaded -> BaselineOfVMMaker-CompatibleUserName.1568126004 --- https://github.com/pharo-project/opensmalltalk-vm.git[Detached at 42f33b4] --- https://github.com/pharo-project/opensmalltalk-vm.git[Detached at 42f33b4]
[windows] 325 warnings generated.
[windows] [ 87%] Linking C shared library build/vm/B2DPlugin.dll
[windows] [ 87%] Built target B2DPlugin
[windows] Scanning dependencies of target pixman-0.34.0
[windows] [ 88%] Generating build/third-party/pixman-0.34.0.zip
[StackVM] Loading baseline of BaselineOfVMMaker...
[StackVM] Fetched -> VMMakerCompatibilityForPharo6-CompatibleUserName.1568126004 --- https://github.com/pharo-project/opensmalltalk-vm.git[Detached at 42f33b4] --- https://github.com/pharo-project/opensmalltalk-vm.git[Detached at 42f33b4]
[windows] --2019-09-10 14:42:21--  https://files.pharo.org/vm/pharo-spur64/win/third-party/pixman-0.34.0.zip
[windows] Resolving files.pharo.org... 164.132.235.17
[windows] Connecting to files.pharo.org|164.132.235.17|:443... connected.
[windows] WARNING: cannot verify files.pharo.org’s certificate, issued by “/C=GB/ST=Greater Manchester/L=Salford/O=COMODO CA Limited/CN=COMODO RSA Domain Validation Secure Server CA�:
[windows]   Self-signed certificate encountered.
[windows] WARNING: certificate common name “cluster023.hosting.ovh.net� doesn’t match requested host name “files.pharo.org�.
[windows] HTTP request sent, awaiting response... 200 OK
[windows] Length: 272706 (266K) [application/zip]
[windows] Saving to: “pixman-0.34.0.zip�
[windows] 
[windows]      0K .......... .......... .......... .......... .......... 18% 2.38M 0s
[windows]     50K .......... .......... .......... .......... .......... 37% 4.87M 0s
[windows]    100K .......... .......... .......... .......... .......... 56% 4.86M 0s
[windows]    150K .......... .......... .......... .......... .......... 75% 4.75M 0s
[windows]    200K .......... .......... .......... .......... .......... 93% 6.18M 0s
[windows]    250K .......... ......                                     100% 4.21M=0.06s
[windows] 
[windows] 2019-09-10 14:42:21 (4.16 MB/s) - “pixman-0.34.0.zip� saved [272706/272706]
[windows] 
[windows] [ 88%] Generating build/third-party/pixman-0.34.0.done
[windows] Archive:  pixman-0.34.0.zip
[windows]   inflating: /cygdrive/e/Builds/workspace/pharo-vm_headless/build/build/vm/libpixman-1-0.dll  
[windows] [ 88%] Built target pixman-0.34.0
[windows] Scanning dependencies of target libgit2-0.25.1-fixLibGit
[windows] [ 89%] Generating build/third-party/libgit2-0.25.1-fixLibGit.zip
[windows] --2019-09-10 14:42:21--  https://files.pharo.org/vm/pharo-spur64/win/third-party/libgit2-0.25.1-fixLibGit.zip
[windows] Resolving files.pharo.org... 164.132.235.17
[windows] Connecting to files.pharo.org|164.132.235.17|:443... connected.
[windows] WARNING: cannot verify files.pharo.org’s certificate, issued by “/C=GB/ST=Greater Manchester/L=Salford/O=COMODO CA Limited/CN=COMODO RSA Domain Validation Secure Server CA�:
[windows]   Self-signed certificate encountered.
[windows] WARNING: certificate common name “cluster023.hosting.ovh.net� doesn’t match requested host name “files.pharo.org�.
[windows] HTTP request sent, awaiting response... 404 Not Found
[windows] 2019-09-10 14:42:21 ERROR 404: Not Found.
[windows] 
[windows] make[2]: *** [CMakeFiles/libgit2-0.25.1-fixLibGit.dir/build.make:68: build/third-party/libgit2-0.25.1-fixLibGit.zip] Error 8
[windows] make[1]: *** [CMakeFiles/Makefile2:888: CMakeFiles/libgit2-0.25.1-fixLibGit.dir/all] Error 2
[windows] make: *** [Makefile:152: all] Error 2
[Pipeline] [windows] }
[Pipeline] [windows] // withEnv
[Pipeline] [windows] }
[Pipeline] [windows] // stage
[StackVM] Fetched -> VMMakerTests-CompatibleUserName.1568126004 --- https://github.com/pharo-project/opensmalltalk-vm.git[Detached at 42f33b4] --- https://github.com/pharo-project/opensmalltalk-vm.git[Detached at 42f33b4]
[Pipeline] [windows] }
[Pipeline] [windows] // timeout
[Pipeline] [windows] }
[Pipeline] [windows] // node
[Pipeline] [windows] }
[windows] Failed in branch windows
[StackVM] Fetched -> Printf-eem.10 --- http://www.squeaksource.com/Printf --- http://www.squeaksource.com/Printf
[StackVM] Fetched -> VMMaker-CompatibleUserName.1568126004 --- https://github.com/pharo-project/opensmalltalk-vm.git[Detached at 42f33b4] --- https://github.com/pharo-project/opensmalltalk-vm.git[Detached at 42f33b4]
[StackVM] *** Warning: Warning: This package depends on the following classes:
[StackVM]   VMStructType
[StackVM]   VMThreadingConstants
[StackVM]   VMBasicConstants
[StackVM] You must resolve these dependencies before you will be able to load these definitions: 
[StackVM]   MockEmptyVMStruct
[StackVM]   MockEmptyVMStruct>>#instVarNamesAndTypesForTranslationDo:
[StackVM]   MockEmptyVMStructWithRedefinedStructName
[StackVM]   MockEmptyVMStructWithRedefinedStructName>>#structTypeName
[StackVM]   VMMTTests
[StackVM]   VMMTTests>>#runCaseManaged
[StackVM]   VMMTTests>>#setUp
[StackVM]   VMMTTests>>#testAssignableThreadIsNotVMOwner
[StackVM]   VMMTTests>>#testAssignableThreadIsWilling
[StackVM]   VMMTTests>>#testDisownOnRelinquishPutsVMInRelinquishingState
[StackVM]   VMMTTests>>#testDisownRemembersLastDisownedThread
[StackVM]   VMMTTests>>#testDisownVMReleasesVM
[StackVM]   VMMTTests>>#testDisownVMSetsCurrentThreadToUnavailable
[StackVM]   VMMTTests>>#testHeartbeatReleasesVMWhenNoProcessIsWilling
[StackVM]   VMMTTests>>#testHeartbeatWakesUpWaitingVMThread
[StackVM]   VMMTTests>>#testInitialThreadIsAssignableOrInVM
[StackVM]   VMMTTests>>#testInitialVMHasManyThreads
[StackVM]   VMMTTests>>#testInitialVMHasNoDisowningVMThread
[StackVM]   VMMTTests>>#testInitialVMThreadsAreUinitialized
[StackVM]   VMMTTests>>#testOwnFreeVMOwnsSameThread
[StackVM]   VMMTTests>>#testPreemptedProcessIsMarkedInExternalCode
[StackVM]   VMMTTests>>#testPreemptedProcessSetsCurrentMethodInThread
[StackVM]   VMMTTests>>#testPreemptedVMThreadHasPreemptedProcessPriority
[StackVM]   VMMTTests>>#testPreemptedVMThreadIsListedInAWOLProcesses
[StackVM]   VMMTTests>>#testPreemptedVMThreadIsTemporarilyAffinedToProcess
[StackVM]   VMMTTests>>#testTryOwningOwnedVMLeavesThreadInWaitingState
[StackVM]   VMMTTests>>#testWantingThreadIsWilling
[StackVM]   VMMTTests>>#testWantingThreadIsWillingOverAssignableThread
[StackVM] 
[StackVM] 
[StackVM] RBVariableNode>>asTranslatorNodeIn: (TConstantNode is Undeclared) 
[StackVM] 
[StackVM] RBVariableNode>>asTranslatorNodeIn: (TConstantNode is Undeclared) 
[StackVM] 
[StackVM] RBVariableNode>>asTranslatorNodeIn: (TVariableNode is Undeclared) 
[StackVM] 
[StackVM] RBCascadeNode>>asTranslatorNodeIn: (TStmtListNode is Undeclared) 
[StackVM] 
[StackVM] RBCascadeNode>>asTranslatorNodeIn: (TVariableNode is Undeclared) 
[StackVM] 
[StackVM] RBCascadeNode>>asTranslatorNodeIn: (TAssignmentNode is Undeclared) 
[StackVM] 
[StackVM] PharoVMMaker>>generateCoInterpreter (VMMaker is Undeclared) 
[StackVM] 
[StackVM] PharoVMMaker>>generateCoInterpreter (CoInterpreter is Undeclared) 
[StackVM] 
[StackVM] PharoVMMaker>>generateCoInterpreter (VMMaker is Undeclared) 
[StackVM] 
[StackVM] PharoVMMaker>>generateCoInterpreter (CoInterpreter is Undeclared) 
[StackVM] 
[StackVM] PharoVMMaker>>generateCoInterpreter (StackToRegisterMappingCogit is Undeclared) 
[StackVM] 
[StackVM] PharoVMMaker>>generateCoInterpreterMT (VMMaker is Undeclared) 
[StackVM] 
[StackVM] PharoVMMaker>>generateCoInterpreterMT (VMMaker is Undeclared) 
[StackVM] 
[StackVM] PharoVMMaker>>generateCoInterpreterMT (CoInterpreterMT is Undeclared) 
[StackVM] 
[StackVM] PharoVMMaker>>generateCoInterpreterMT (StackToRegisterMappingCogit is Undeclared) 
[StackVM] 
[StackVM] PharoVMMaker>>generateCoInterpreterWithQueueFFI (VMMaker is Undeclared) 
[StackVM] 
[StackVM] PharoVMMaker>>generateCoInterpreterWithQueueFFI (CoInterpreterWithQueueFFI is Undeclared) 
[StackVM] 
[StackVM] PharoVMMaker>>generateCoInterpreterWithQueueFFI (VMMaker is Undeclared) 
[StackVM] 
[StackVM] PharoVMMaker>>generateCoInterpreterWithQueueFFI (StackToRegisterMappingCogit is Undeclared) 
[StackVM] 
[StackVM] PharoVMMaker>>generateStackVM (VMMaker is Undeclared) 
[StackVM] 
[StackVM] PharoVMMaker>>generateStackVM (StackInterpreter is Undeclared) 
[StackVM] 
[StackVM] PharoVMMaker>>generateStackVM (VMMaker is Undeclared) 
[StackVM] 
[StackVM] PharoVMMaker>>generateStackVM (StackToRegisterMappingCogit is Undeclared) 
[StackVM] 
[StackVM] RBReturnNode>>asTranslatorNodeIn: (TReturnNode is Undeclared) 
[StackVM] 
[StackVM] RBReturnNode>>asTranslatorNodeIn: (TReturnNode is Undeclared) 
[StackVM] 
[StackVM] VMCodeGenerationTest>>testCommentsInBlocks (TMethod is Undeclared) 
[StackVM] 
[StackVM] VMCodeGenerationTest>>testCommentsInBlocks (CCodeGeneratorGlobalStructure is Undeclared) 
[StackVM] 
[StackVM] VMCodeGenerationTest>>testCommentsInInlinedBlocks (TMethod is Undeclared) 
[StackVM] 
[StackVM] VMCodeGenerationTest>>testCommentsInInlinedBlocks (CCodeGeneratorGlobalStructure is Undeclared) 
[StackVM] 
[StackVM] VMCodeGenerationTest>>testComplexIfNilAssignment (TMethod is Undeclared) 
[StackVM] 
[StackVM] VMCodeGenerationTest>>testComplexIfNilAssignment (CCodeGeneratorGlobalStructure is Undeclared) 
[StackVM] 
[StackVM] VMCodeGenerationTest>>testEmptyStructTypeDef (MockEmptyVMStruct is Undeclared) 
[StackVM] 
[StackVM] VMCodeGenerationTest>>testEmptyStructWithRedefinedStructNameTypeDef (MockEmptyVMStructWithRedefinedStructName is Undeclared) 
[StackVM] 
[StackVM] VMCodeGenerationTest>>testLoopVariableIsTemp (TMethod is Undeclared) 
[StackVM] 
[StackVM] VMCodeGenerationTest>>testLoopVariableIsTemp (CCodeGeneratorGlobalStructure is Undeclared) 
[StackVM] 
[StackVM] VMCodeGenerationTest>>testNilIfNilGeneratesOnlyFirstBranch (TMethod is Undeclared) 
[StackVM] 
[StackVM] VMCodeGenerationTest>>testNilIfNilGeneratesOnlyFirstBranch (CCodeGeneratorGlobalStructure is Undeclared) 
[StackVM] 
[StackVM] VMCodeGenerationTest>>testSimpleIfNil (TMethod is Undeclared) 
[StackVM] 
[StackVM] VMCodeGenerationTest>>testSimpleIfNil (CCodeGeneratorGlobalStructure is Undeclared) 
[StackVM] 
[StackVM] VMCodeGenerationTest>>testSimpleIfNilAssignment (TMethod is Undeclared) 
[StackVM] 
[StackVM] VMCodeGenerationTest>>testSimpleIfNilAssignment (CCodeGeneratorGlobalStructure is Undeclared) 
[StackVM] 
[StackVM] VMMASTTranslationTest>>testArgumentIsNoTemp (TMethod is Undeclared) 
[StackVM] 
[StackVM] VMMASTTranslationTest>>testComplexIfNilIfNotNilWithArgument (TMethod is Undeclared) 
[StackVM] 
[StackVM] VMMASTTranslationTest>>testComplexIfNilIfNotNilWithArgument (CCodeGeneratorGlobalStructure is Undeclared) 
[StackVM] 
[StackVM] VMMASTTranslationTest>>testComplexIfNotNilIfNilWithArgument (TMethod is Undeclared) 
[StackVM] 
[StackVM] VMMASTTranslationTest>>testComplexIfNotNilIfNilWithArgument (CCodeGeneratorGlobalStructure is Undeclared) 
[StackVM] 
[StackVM] VMMASTTranslationTest>>testComplexIfNotNilWithArgument (TMethod is Undeclared) 
[StackVM] 
[StackVM] VMMASTTranslationTest>>testComplexIfNotNilWithArgument (CCodeGeneratorGlobalStructure is Undeclared) 
[StackVM] 
[StackVM] VMMASTTranslationTest>>testEmptyBlockGeneratesSingleNilStatement (TMethod is Undeclared) 
[StackVM] 
[StackVM] VMMASTTranslationTest>>testEmptyBlockGeneratesSingleNilStatement (CCodeGeneratorGlobalStructure is Undeclared) 
[StackVM] 
[StackVM] VMMASTTranslationTest>>testIfNilIfNotNilBecomesIfTrueIfFalse (TMethod is Undeclared) 
[StackVM] 
[StackVM] VMMASTTranslationTest>>testIfNilIfNotNilDoesNotInvertBlocks (TMethod is Undeclared) 
[StackVM] 
[StackVM] VMMASTTranslationTest>>testIfNotNilIfNilInversesBlocks (TMethod is Undeclared) 
[StackVM] 
[StackVM] VMMASTTranslationTest>>testInlineMethodWithLoopDeclaresLoopIndexVariable (TMethod is Undeclared) 
[StackVM] 
[StackVM] VMMASTTranslationTest>>testInlineMethodWithLoopDeclaresLoopIndexVariable (TMethod is Undeclared) 
[StackVM] 
[StackVM] VMMASTTranslationTest>>testInlineMethodWithLoopDeclaresLoopIndexVariable (CCodeGeneratorGlobalStructure is Undeclared) 
[StackVM] 
[StackVM] VMMASTTranslationTest>>testInlineSecondLevelMethodWithLoopDeclaresLoopIndexVariable (TMethod is Undeclared) 
[StackVM] 
[StackVM] VMMASTTranslationTest>>testInlineSecondLevelMethodWithLoopDeclaresLoopIndexVariable (TMethod is Undeclared) 
[StackVM] 
[StackVM] VMMASTTranslationTest>>testInlineSecondLevelMethodWithLoopDeclaresLoopIndexVariable (CCodeGeneratorGlobalStructure is Undeclared) 
[StackVM] 
[StackVM] VMMASTTranslationTest>>testInlineTwiceMethodWithLoopDeclaresTwiceLoopIndexVariable (TMethod is Undeclared) 
[StackVM] 
[StackVM] VMMASTTranslationTest>>testInlineTwiceMethodWithLoopDeclaresTwiceLoopIndexVariable (TMethod is Undeclared) 
[StackVM] 
[StackVM] VMMASTTranslationTest>>testInlineTwiceMethodWithLoopDeclaresTwiceLoopIndexVariable (CCodeGeneratorGlobalStructure is Undeclared) 
[StackVM] 
[StackVM] VMMASTTranslationTest>>testInlineTwiceSecondLevelMethodWithLoopDeclaresLoopIndexVariable (TMethod is Undeclared) 
[StackVM] 
[StackVM] VMMASTTranslationTest>>testInlineTwiceSecondLevelMethodWithLoopDeclaresLoopIndexVariable (TMethod is Undeclared) 
[StackVM] 
[StackVM] VMMASTTranslationTest>>testInlineTwiceSecondLevelMethodWithLoopDeclaresLoopIndexVariable (CCodeGeneratorGlobalStructure is Undeclared) 
[StackVM] 
[StackVM] VMMASTTranslationTest>>testKeywordMethodHasArgument (TMethod is Undeclared) 
[StackVM] 
[StackVM] VMMASTTranslationTest>>testMethodWithConditionInLoopLimitHasLimitVariable (TMethod is Undeclared) 
[StackVM] 
[StackVM] VMMASTTranslationTest>>testMethodWithConstantConditionInLoopHasNoLimitVariable (TMethod is Undeclared) 
[StackVM] 
[StackVM] VMMASTTranslationTest>>testMethodWithLoopDeclaresLoopIndexVariable (TMethod is Undeclared) 
[StackVM] 
[StackVM] VMMASTTranslationTest>>testTranslateBinaryMethodHasSameName (TMethod is Undeclared) 
[StackVM] 
[StackVM] VMMASTTranslationTest>>testTranslateKeywordMethodHasSameName (TMethod is Undeclared) 
[StackVM] 
[StackVM] VMMASTTranslationTest>>testTranslateUnaryMethodHasSameName (TMethod is Undeclared) 
[StackVM] 
[StackVM] VMMTGenerationTests>>generate: (CCodeGeneratorGlobalStructure is Undeclared) 
[StackVM] 
[StackVM] VMMTGenerationTests>>generate: (CoInterpreter is Undeclared) 
[StackVM] 
[StackVM] VMMTGenerationTests>>generate: (InterpreterPrimitives is Undeclared) 
[StackVM] 
[StackVM] VMMTGenerationTests>>generate: (StackInterpreterPrimitives is Undeclared) 
[StackVM] 
[StackVM] VMMTGenerationTests>>generate: (StackInterpreter is Undeclared) 
[StackVM] 
[StackVM] VMMTGenerationTests>>generate: (CoInterpreter is Undeclared) 
[StackVM] 
[StackVM] VMMTGenerationTests>>generate: (CogStackPages is Undeclared) 
[StackVM] 
[StackVM] VMMTGenerationTests>>generate: (SpurMemoryManager is Undeclared) 
[StackVM] 
[StackVM] VMMTGenerationTests>>generate: (Spur64BitMemoryManager is Undeclared) 
[StackVM] 
[StackVM] VMMTGenerationTests>>generate: (SpurGenerationScavenger is Undeclared) 
[StackVM] 
[StackVM] RBAssignmentNode>>asTranslatorNodeIn: (TAssignmentNode is Undeclared) 
[StackVM] 
[StackVM] RBAssignmentNode>>asTranslatorNodeIn: (TStmtListNode is Undeclared) 
[StackVM] 
[StackVM] RBAssignmentNode>>asTranslatorNodeIn: (TAssignmentNode is Undeclared) 
[StackVM] 
[StackVM] RBBlockNode>>asTranslatorNodeIn: (TVariableNode is Undeclared) 
[StackVM] 
[StackVM] RBBlockNode>>asTranslatorNodeIn: (TStmtListNode is Undeclared) 
[StackVM] 
[StackVM] RBLiteralNode>>asTranslatorNodeIn: (TConstantNode is Undeclared) 
[StackVM] 
[StackVM] RBArrayNode>>asTranslatorNodeIn: (TBraceCaseNode is Undeclared) 
[StackVM] 
[StackVM] RBMessageNode>>asTranslatorNodeIn: (TConstantNode is Undeclared) 
[StackVM] 
[StackVM] RBMessageNode>>asTranslatorNodeIn: (TAssignmentNode is Undeclared) 
[StackVM] 
[StackVM] RBMessageNode>>asTranslatorNodeIn: (TConstantNode is Undeclared) 
[StackVM] 
[StackVM] RBMessageNode>>asTranslatorNodeIn: (TSendNode is Undeclared) 
[StackVM] 
[StackVM] RBMessageNode>>asTranslatorNodeIn: (TVariableNode is Undeclared) 
[StackVM] 
[StackVM] RBMessageNode>>asTranslatorNodeIn: (TAssignmentNode is Undeclared) 
[StackVM] 
[StackVM] RBMessageNode>>asTranslatorNodeIn: (TVariableNode is Undeclared) 
[StackVM] 
[StackVM] RBMessageNode>>asTranslatorNodeIn: (TSendNode is Undeclared) 
[StackVM] 
[StackVM] RBMessageNode>>asTranslatorNodeIn: (TVariableNode is Undeclared) 
[StackVM] 
[StackVM] RBMessageNode>>asTranslatorNodeIn: (TConstantNode is Undeclared) 
[StackVM] 
[StackVM] RBMessageNode>>asTranslatorNodeIn: (TConstantNode is Undeclared) 
[StackVM] 
[StackVM] RBMessageNode>>asTranslatorNodeIn: (TVariableNode is Undeclared) 
[StackVM] 
[StackVM] RBMessageNode>>asTranslatorNodeIn: (TStmtListNode is Undeclared) 
[StackVM] 
[StackVM] RBMessageNode>>asTranslatorNodeIn: (TAssignmentNode is Undeclared) 
[StackVM] 
[StackVM] RBMessageNode>>asTranslatorNodeIn: (TVariableNode is Undeclared) 
[StackVM] 
[StackVM] RBMessageNode>>asTranslatorNodeIn: (TSendNode is Undeclared) 
[StackVM] 
[StackVM] RBMessageNode>>asTranslatorNodeIn: (TSendNode is Undeclared) 
[StackVM] 
[StackVM] RBMessageNode>>asTranslatorNodeIn: (TVariableNode is Undeclared) 
[StackVM] 
[StackVM] RBMessageNode>>asTranslatorNodeIn: (TVariableNode is Undeclared) 
[StackVM] 
[StackVM] RBMessageNode>>asTranslatorNodeIn: (TVariableNode is Undeclared) 
[StackVM] 
[StackVM] RBMessageNode>>asTranslatorNodeIn: (TSendNode is Undeclared) 
[StackVM] 
[StackVM] RBMessageNode>>asTranslatorNodeIn: (TVariableNode is Undeclared) 
[StackVM] 
[StackVM] RBMessageNode>>asTranslatorNodeIn: (TStmtListNode is Undeclared) 
[StackVM] 
[StackVM] RBMessageNode>>asTranslatorNodeIn: (TAssignmentNode is Undeclared) 
[StackVM] 
[StackVM] RBMessageNode>>asTranslatorNodeIn: (TVariableNode is Undeclared) 
[StackVM] 
[StackVM] RBMessageNode>>asTranslatorNodeIn: (TSendNode is Undeclared) 
[StackVM] 
[StackVM] RBMessageNode>>asTranslatorNodeIn: (TSendNode is Undeclared) 
[StackVM] 
[StackVM] RBMessageNode>>asTranslatorNodeIn: (TVariableNode is Undeclared) 
[StackVM] 
[StackVM] RBMessageNode>>asTranslatorNodeIn: (CCodeGenerator is Undeclared) 
[StackVM] 
[StackVM] RBMessageNode>>asTranslatorNodeIn: (TSendNode is Undeclared) 
[StackVM] 
[StackVM] DisplayText class>>text: (DefaultTextStyle is Undeclared) 
[StackVM] 
[StackVM] RBSequenceNode>>asTranslatorNodeIn: (TStmtListNode is Undeclared) 
[StackVM] 
[StackVM] Loaded -> VMMakerCompatibilityForPharo6-CompatibleUserName.1568126004 --- https://github.com/pharo-project/opensmalltalk-vm.git[Detached at 42f33b4] --- cache
[StackVM] *** Warning: Warning: This package depends on the following classes:
[StackVM]   StackMTInterpreterSimulator
[StackVM]   VMClass
[StackVM]   CogThreadManager
[StackVM] You must resolve these dependencies before you will be able to load these definitions: 
[StackVM]   SpurMockMemory
[StackVM]   SpurMockMemory>>#hasSpurMemoryManagerAPI
[StackVM]   SpurMockMemory>>#initializeWithOptions:
[StackVM]   SpurMockMemory>>#numSmallIntegerTagBits
[StackVM]   SpurMockMemory>>#simulatorClass
[StackVM]   SpurMockMemory>>#wordSize
[StackVM]   SpurMockMemory>>#addressCouldBeObj:
[StackVM]   SpurMockMemory>>#addressOf:
[StackVM]   SpurMockMemory>>#baseHeaderSize
[StackVM]   SpurMockMemory>>#bytesPerOop
[StackVM]   SpurMockMemory>>#coInterpreter:
[StackVM]   SpurMockMemory>>#fetchPointer:ofObject:
[StackVM]   SpurMockMemory>>#followField:ofObject:
[StackVM]   SpurMockMemory>>#followObjField:ofObject:
[StackVM]   SpurMockMemory>>#goodContextSize:
[StackVM]   SpurMockMemory>>#hasSpurMemoryManagerAPI
[StackVM]   SpurMockMemory>>#headerIndicatesAlternateBytecodeSet:
[StackVM]   SpurMockMemory>>#initialize
[StackVM]   SpurMockMemory>>#integerObjectOf:
[StackVM]   SpurMockMemory>>#integerValueOf:
[StackVM]   SpurMockMemory>>#isContext:
[StackVM]   SpurMockMemory>>#isForwarded:
[StackVM]   SpurMockMemory>>#isIntegerObject:
[StackVM]   SpurMockMemory>>#isNonImmediate:
[StackVM]   SpurMockMemory>>#isOopCompiledMethod:
[StackVM]   SpurMockMemory>>#isOopForwarded:
[StackVM]   SpurMockMemory>>#lastPointerOf:
[StackVM]   SpurMockMemory>>#lengthOf:
[StackVM]   SpurMockMemory>>#literalCountOf:
[StackVM]   SpurMockMemory>>#maxCInteger
[StackVM]   SpurMockMemory>>#memoryActiveProcess
[StackVM]   SpurMockMemory>>#methodHeaderOf:
[StackVM]   SpurMockMemory>>#nextAddress
[StackVM]   SpurMockMemory>>#nilObject
[StackVM]   SpurMockMemory>>#numBytesOfBytes:
[StackVM]   SpurMockMemory>>#numSlotsOf:
[StackVM]   SpurMockMemory>>#objectFor:
[StackVM]   SpurMockMemory>>#processorSchedulerMock
[StackVM]   SpurMockMemory>>#shiftForWord
[StackVM]   SpurMockMemory>>#smallIntegerTag
[StackVM]   SpurMockMemory>>#splObj:
[StackVM]   SpurMockMemory>>#startOfMemory
[StackVM]   SpurMockMemory>>#storePointer:ofObject:withValue:
[StackVM]   SpurMockMemory>>#storePointerUnchecked:ofObject:withValue:
[StackVM]   SpurMockMemory>>#wordSize
[StackVM]   StackMTInterpreterSimulatorForTest
[StackVM]   StackMTInterpreterSimulatorForTest>>#onObjectMemory:options:
[StackVM]   StackMTInterpreterSimulatorForTest>>#enterSmalltalkExecutiveImplementation
[StackVM]   StackMTInterpreterSimulatorForTest>>#ioNewOS:Thread:
[StackVM]   StackMTInterpreterSimulatorForTest>>#methodCallingPush
[StackVM]   VMMockCogThreadManager
[StackVM]   VMMockCogThreadManager>>#ioWaitOnOSSemaphore:
[StackVM] 
[StackVM] 
[StackVM] Loaded -> VMMakerTests-CompatibleUserName.1568126004 --- https://github.com/pharo-project/opensmalltalk-vm.git[Detached at 42f33b4] --- cache
[StackVM] Loaded -> Printf-eem.10 --- http://www.squeaksource.com/Printf --- http://www.squeaksource.com/Printf
[StackVM] SimulatorMorph>>contextPanel (ObjectExplorerWrapper is Undeclared) 
[StackVM] 
[StackVM] DetailedInstructionPrinter>>printInstructionsOn: (fullBlockRecursionSelector is Undeclared) 
[StackVM] 
[StackVM] Pragmatizer>>newConvertToMessageSendStamp: (Utilities is Undeclared) 
[StackVM] 
[StackVM] Pragmatizer>>newConvertToPragmaStamp: (Utilities is Undeclared) 
[StackVM] 
[StackVM] TMethod>>statementsFor:varName: (Compiler is Undeclared) 
[StackVM] 
[StackVM] RiscOSVMMaker>>export:forExternalPlugin: (FileStreamException is Undeclared) 
[StackVM] 
[StackVM] SpurImageTestResource class>>preenImage (Spur32BitPreen is Undeclared) 
[StackVM] 
[StackVM] VMMakerTool class>>unload (TheWorldMenu is Undeclared) 
[StackVM] 
[StackVM] VMMakerTool>>addSecondButtonRowToWindow:startingAt: (UpdatingThreePhaseButtonMorph is Undeclared) 
[StackVM] 
[StackVM] VMMakerTool>>findPlatformsPath (FileList2 is Undeclared) 
[StackVM] 
[StackVM] VMMakerTool>>helpText (StringHolder is Undeclared) 
[StackVM] 
[StackVM] VMMakerTool>>loadConfig (StandardFileMenu is Undeclared) 
[StackVM] 
[StackVM] VMMakerTool>>platformsListMenu (PopUpMenu is Undeclared) 
[StackVM] 
[StackVM] VMMakerTool>>saveConfig (StandardFileMenu is Undeclared) 
[StackVM] 
[StackVM] CCodeGenerator class>>removeCompilerMethods (ParseNode is Undeclared) 
[StackVM] 
[StackVM] ADPCMCodecPlugin class>>monticelloDescription (ADPCMCodec is Undeclared) 
[StackVM] 
[StackVM] ADPCMCodecPlugin class>>translatedPrimitives (ADPCMCodec is Undeclared) 
[StackVM] 
[StackVM] InterpreterPlugin class>>allCodeOlderThan: (TimeStamp is Undeclared) 
[StackVM] 
[StackVM] JPEGReadWriter2Plugin>>compressStructSize (JPEGReadWriter2 is Undeclared) 
[StackVM] 
[StackVM] JPEGReadWriter2Plugin>>decompressStructSize (JPEGReadWriter2 is Undeclared) 
[StackVM] 
[StackVM] JPEGReadWriter2Plugin>>errorMgr2StructSize (JPEGReadWriter2 is Undeclared) 
[StackVM] 
[StackVM] JPEGReadWriter2Plugin>>primImageHeight: (JPEGReadWriter2 is Undeclared) 
[StackVM] 
[StackVM] JPEGReadWriter2Plugin>>primImageNumComponents: (JPEGReadWriter2 is Undeclared) 
[StackVM] 
[StackVM] JPEGReadWriter2Plugin>>primImageWidth: (JPEGReadWriter2 is Undeclared) 
[StackVM] 
[StackVM] JPEGReadWriter2Plugin>>primJPEGPluginIsPresent (JPEGReadWriter2 is Undeclared) 
[StackVM] 
[StackVM] JPEGReadWriter2Plugin>>primJPEGReadHeader:fromByteArray:size:errorMgrReadHeader: (JPEGReadWriter2 is Undeclared) 
[StackVM] 
[StackVM] JPEGReadWriter2Plugin>>primJPEGReadImagefromByteArrayonFormdoDitheringerrorMgrReadScanlines:_:_:_:_:_:_:_:_: (JPEGReadWriter2 is Undeclared) 
[StackVM] 
[StackVM] JPEGReadWriter2Plugin>>primJPEGWriteImageonByteArrayformqualityprogressiveJPEGerrorMgrWriteScanlines:_:_:_:_:_:_:_:_:_:_:_: (JPEGReadWriter2 is Undeclared) 
[StackVM] 
[StackVM] TestOSAPlugin>>primOpenDefaultConfiguration:subtype: (ComponentInstance is Undeclared) 
[StackVM] 
[StackVM] SoundGenerationPlugin class>>monticelloDescription (AbstractSound is Undeclared) 
[StackVM] 
[StackVM] SoundGenerationPlugin class>>translatedPrimitives (AbstractSound is Undeclared) 
[StackVM] 
[StackVM] VMClass class>>initialize (Utilities is Undeclared) 
[StackVM] 
[StackVM] VMClass class>>openCogMultiWindowBrowser (Browser is Undeclared) 
[StackVM] 
[StackVM] VMClass class>>openCogSpurMultiWindowBrowser (Browser is Undeclared) 
[StackVM] 
[StackVM] VMClass class>>openCogTestsMultiWindowBrowser (PackageInfo is Undeclared) 
[StackVM] 
[StackVM] VMClass class>>openCogTestsMultiWindowBrowser (Browser is Undeclared) 
[StackVM] 
[StackVM] VMClass class>>openCogitMultiWindowBrowser (Browser is Undeclared) 
[StackVM] 
[StackVM] VMClass class>>openObjectMemoriesInterpretersBrowser (Browser is Undeclared) 
[StackVM] 
[StackVM] VMClass class>>openSpurMultiWindowBrowser (Browser is Undeclared) 
[StackVM] 
[StackVM] Cogit class>>genAndDis:options: (Compiler is Undeclared) 
[StackVM] 
[StackVM] Cogit class>>initializeMiscConstants (BochsX64Alien is Undeclared) 
[StackVM] 
[StackVM] Cogit class>>initializeMiscConstants (BochsIA32Alien is Undeclared) 
[StackVM] 
[StackVM] Cogit class>>initializeMiscConstants (GdbARMAlien is Undeclared) 
[StackVM] 
[StackVM] Cogit class>>initializeMiscConstants (MIPSELSimulator is Undeclared) 
[StackVM] 
[StackVM] Cogit>>initializeProcessor (MultiProcessor is Undeclared) 
[StackVM] 
[StackVM] Cogit>>setClickStepBreakBlock (Debugger is Undeclared) 
[StackVM] 
[StackVM] Cogit>>simulateCogCodeAt: (ProcessorSimulationTrap is Undeclared) 
[StackVM] 
[StackVM] Cogit>>simulateLeafCallOf: (ProcessorSimulationTrap is Undeclared) 
[StackVM] 
[StackVM] StackToRegisterMappingCogit>>widthInDefaultFontOf: (NewParagraph is Undeclared) 
[StackVM] 
[StackVM] StackInterpreterSimulator>>setClickStepBreakBlock (Debugger is Undeclared) 
[StackVM] 
[StackVM] CogVMSimulator>>ensureMultiThreadingOverridesAreUpToDate (Parser is Undeclared) 
[StackVM] 
[StackVM] CogVMSimulator>>setBreakBlockFromString: (Compiler is Undeclared) 
[StackVM] 
[StackVM] StackMTInterpreterSimulator>>setClickStepBreakBlock (Debugger is Undeclared) 
[StackVM] 
[StackVM] CogARMCompilerTests>>processor (GdbARMAlien is Undeclared) 
[StackVM] 
[StackVM] CogIA32CompilerTests>>processor (BochsIA32Alien is Undeclared) 
[StackVM] 
[StackVM] CogMIPSELCompilerTests>>processor (MIPSELSimulator is Undeclared) 
[StackVM] 
[StackVM] CogX64CompilerTests>>processor (BochsX64Alien is Undeclared) 
[StackVM] 
[StackVM] IncludedMethodsTest>>testConvert8bitSignedFromTo16Bit (SoundBuffer is Undeclared) 
[StackVM] 
[StackVM] IncludedMethodsTest>>testConvert8bitSignedFromTo16Bit (SoundBuffer is Undeclared) 
[StackVM] 
[StackVM] JPEGReadWriter2PluginTest>>testPluginPresent (JPEGReadWriter2 is Undeclared) 
[StackVM] 
[StackVM] JPEGReadWriter2PluginTest>>testPrimJPEGReadImage (JPEGReadWriter2 is Undeclared) 
[StackVM] 
[StackVM] JPEGReadWriter2PluginTest>>testPrimJPEGWriteImage (JPEGReadWriter2 is Undeclared) 
[StackVM] 
[StackVM] JPEGReadWriter2PluginTest>>testPrimJPEGWriteImage (JPEGReadWriter2 is Undeclared) 
[StackVM] 
[StackVM] MiscPrimitivePluginTest>>testConvert8bitSignedFromTo16Bit (SoundBuffer is Undeclared) 
[StackVM] 
[StackVM] MiscPrimitivePluginTest>>testConvert8bitSignedFromTo16Bit (SoundBuffer is Undeclared) 
[StackVM] 
[StackVM] SpurPlanningCompactorTests class>>preenImage (Spur32BitPreen is Undeclared) 
[StackVM] 
[StackVM] SimulatorMorphicModel class>>registerInOpenMenu (TheWorldMenu is Undeclared) 
[StackVM] 
[StackVM] SimulatorMorphicModel class>>registerInOpenMenu (TheWorldMenu is Undeclared) 
[StackVM] 
[StackVM] SimulatorMorphicModel class>>registerInOpenMenu (TheWorldMenu is Undeclared) 
[StackVM] 
[StackVM] SimulatorMorphicModel class>>unregisterFromOpenMenu (TheWorldMenu is Undeclared) 
[StackVM] 
[StackVM] SimulatorMorphicModel class>>unregisterFromOpenMenu (TheWorldMenu is Undeclared) 
[StackVM] 
[StackVM] SimulatorMorphicModel>>hack (UserDialogBoxMorph is Undeclared) 
[StackVM] 
[StackVM] SimulatorMorphicModel>>loadImage (UserDialogBoxMorph is Undeclared) 
[StackVM] 
[StackVM] SimulatorMorphicModel>>options (UserDialogBoxMorph is Undeclared) 
[StackVM] 
[StackVM] SimulatorMorphicModel>>over (UserDialogBoxMorph is Undeclared) 
[StackVM] 
[StackVM] SimulatorMorphicModel>>reset (UserDialogBoxMorph is Undeclared) 
[StackVM] 
[StackVM] SimulatorMorphicModel>>return (UserDialogBoxMorph is Undeclared) 
[StackVM] 
[StackVM] SimulatorMorphicModel>>send (UserDialogBoxMorph is Undeclared) 
[StackVM] 
[StackVM] SimulatorMorphicModel>>step (UserDialogBoxMorph is Undeclared) 
[StackVM] 
[StackVM] BalloonEngineBase>>loadRenderingState (GEFBitBltLoadFailed is Undeclared) 
[StackVM] 
[StackVM] BalloonEngineBase>>loadRenderingState (GEFFormLoadFailed is Undeclared) 
[StackVM] 
[StackVM] BalloonEngineBase>>loadRenderingState (GEFEdgeDataTooSmall is Undeclared) 
[StackVM] 
[StackVM] BalloonEngineBase>>loadRenderingState (GEFFillDataTooSmall is Undeclared) 
[StackVM] 
[StackVM] BalloonEngineBase>>loadRenderingState (GEFWrongState is Undeclared) 
[StackVM] 
[StackVM] BalloonEngineBase>>loadSpanBufferFrom: (GEFClassMismatch is Undeclared) 
[StackVM] 
[StackVM] BalloonEngineBase>>loadWorkBufferFrom: (GEFWorkBufferIsInteger is Undeclared) 
[StackVM] 
[StackVM] BalloonEngineBase>>loadWorkBufferFrom: (GEFWorkBufferIsPointers is Undeclared) 
[StackVM] 
[StackVM] BalloonEngineBase>>loadWorkBufferFrom: (GEFWorkBufferTooSmall is Undeclared) 
[StackVM] 
[StackVM] BalloonEngineBase>>loadWorkBufferFrom: (GEFWorkBufferBadMagic is Undeclared) 
[StackVM] 
[StackVM] BalloonEngineBase>>loadWorkBufferFrom: (GEFWorkBufferWrongSize is Undeclared) 
[StackVM] 
[StackVM] BalloonEngineBase>>loadWorkBufferFrom: (GEFWorkBufferStartWrong is Undeclared) 
[StackVM] 
[StackVM] BalloonEngineBase>>loadWorkBufferFrom: (GEFWorkTooBig is Undeclared) 
[StackVM] 
[StackVM] BalloonEngineBase>>primitiveAddActiveEdgeEntry (GEFEdgeDataTooSmall is Undeclared) 
[StackVM] 
[StackVM] BalloonEngineBase>>primitiveAddActiveEdgeEntry (GEFWorkTooBig is Undeclared) 
[StackVM] 
[StackVM] BalloonEngineBase>>primitiveAddActiveEdgeEntry (GEFEngineStopped is Undeclared) 
[StackVM] 
[StackVM] BalloonEngineBase>>primitiveChangedActiveEdgeEntry (GEFEdgeDataTooSmall is Undeclared) 
[StackVM] 
[StackVM] BalloonEngineBase>>primitiveCopyBuffer (GEFClassMismatch is Undeclared) 
[StackVM] 
[StackVM] BalloonEngineBase>>primitiveCopyBuffer (GEFSizeMismatch is Undeclared) 
[StackVM] 
[StackVM] BalloonEngineBase>>primitiveDisplaySpanBuffer (GEFBitBltLoadFailed is Undeclared) 
[StackVM] 
[StackVM] BalloonEngineBase>>primitiveGetFailureReason (GEFEngineIsInteger is Undeclared) 
[StackVM] 
[StackVM] BalloonEngineBase>>primitiveGetFailureReason (GEFEngineIsWords is Undeclared) 
[StackVM] 
[StackVM] BalloonEngineBase>>primitiveGetFailureReason (GEFEngineTooSmall is Undeclared) 
[StackVM] 
[StackVM] BalloonEngineBase>>primitiveInitializeProcessing (GEFEngineStopped is Undeclared) 
[StackVM] 
[StackVM] BalloonEngineBase>>primitiveMergeFillFrom (GEFFillDataTooSmall is Undeclared) 
[StackVM] 
[StackVM] BalloonEngineBase>>primitiveMergeFillFrom (GEFWrongFill is Undeclared) 
[StackVM] 
[StackVM] BalloonEngineBase>>primitiveMergeFillFrom (GEFWrongFill is Undeclared) 
[StackVM] 
[StackVM] BalloonEngineBase>>primitiveMergeFillFrom (GEFWrongFill is Undeclared) 
[StackVM] 
[StackVM] BalloonEngineBase>>primitiveNextFillEntry (GEFFormLoadFailed is Undeclared) 
[StackVM] 
[StackVM] BalloonEngineBase>>primitiveNextFillEntry (GEFEngineStopped is Undeclared) 
[StackVM] 
[StackVM] BalloonEngineBase>>primitiveNextFillEntry (GEFWrongFill is Undeclared) 
[StackVM] 
[StackVM] BalloonEngineBase>>primitiveNextGlobalEdgeEntry (GEFWrongEdge is Undeclared) 
[StackVM] 
[StackVM] BalloonEngineBase>>primitiveRegisterExternalEdge (GEFWorkTooBig is Undeclared) 
[StackVM] 
[StackVM] BalloonEngineBase>>primitiveRegisterExternalEdge (GEFWrongFill is Undeclared) 
[StackVM] 
[StackVM] BalloonEngineBase>>primitiveRegisterExternalEdge (GEFEngineStopped is Undeclared) 
[StackVM] 
[StackVM] BalloonEngineBase>>primitiveRegisterExternalFill (GEFWorkTooBig is Undeclared) 
[StackVM] 
[StackVM] BalloonEngineBase>>primitiveSetColorTransform (GEFEntityLoadFailed is Undeclared) 
[StackVM] 
[StackVM] BalloonEngineBase>>quickLoadEngineFrom: (GEFAlreadyFailed is Undeclared) 
[StackVM] 
[StackVM] BalloonEngineBase>>quickLoadEngineFrom: (GEFEngineIsInteger is Undeclared) 
[StackVM] 
[StackVM] BalloonEngineBase>>quickLoadEngineFrom: (GEFEngineIsWords is Undeclared) 
[StackVM] 
[StackVM] BalloonEngineBase>>quickLoadEngineFrom: (GEFEngineTooSmall is Undeclared) 
[StackVM] 
[StackVM] BalloonEngineBase>>quickLoadEngineFrom:requiredState: (GEFWrongState is Undeclared) 
[StackVM] 
[StackVM] BalloonEngineBase>>quickLoadEngineFrom:requiredState:or: (GEFWrongState is Undeclared) 
[StackVM] 
[StackVM] BalloonEnginePlugin>>primitiveAddBezier (GEFWrongFill is Undeclared) 
[StackVM] 
[StackVM] BalloonEnginePlugin>>primitiveAddBezier (GEFEngineStopped is Undeclared) 
[StackVM] 
[StackVM] BalloonEnginePlugin>>primitiveAddBezier (GEFEntityLoadFailed is Undeclared) 
[StackVM] 
[StackVM] BalloonEnginePlugin>>primitiveAddBezierShape (GEFWorkTooBig is Undeclared) 
[StackVM] 
[StackVM] BalloonEnginePlugin>>primitiveAddBezierShape (GEFWrongFill is Undeclared) 
[StackVM] 
[StackVM] BalloonEnginePlugin>>primitiveAddBezierShape (GEFEngineStopped is Undeclared) 
[StackVM] 
[StackVM] BalloonEnginePlugin>>primitiveAddBezierShape (GEFEngineStopped is Undeclared) 
[StackVM] 
[StackVM] BalloonEnginePlugin>>primitiveAddBezierShape (GEFEntityLoadFailed is Undeclared) 
[StackVM] 
[StackVM] BalloonEnginePlugin>>primitiveAddBitmapFill (GEFBadPoint is Undeclared) 
[StackVM] 
[StackVM] BalloonEnginePlugin>>primitiveAddBitmapFill (GEFEngineStopped is Undeclared) 
[StackVM] 
[StackVM] BalloonEnginePlugin>>primitiveAddBitmapFill (GEFEntityLoadFailed is Undeclared) 
[StackVM] 
[StackVM] BalloonEnginePlugin>>primitiveAddCompressedShape (GEFEntityCheckFailed is Undeclared) 
[StackVM] 
[StackVM] BalloonEnginePlugin>>primitiveAddCompressedShape (GEFWorkTooBig is Undeclared) 
[StackVM] 
[StackVM] BalloonEnginePlugin>>primitiveAddCompressedShape (GEFEngineStopped is Undeclared) 
[StackVM] 
[StackVM] BalloonEnginePlugin>>primitiveAddCompressedShape (GEFEntityLoadFailed is Undeclared) 
[StackVM] 
[StackVM] BalloonEnginePlugin>>primitiveAddGradientFill (GEFBadPoint is Undeclared) 
[StackVM] 
[StackVM] BalloonEnginePlugin>>primitiveAddGradientFill (GEFEngineStopped is Undeclared) 
[StackVM] 
[StackVM] BalloonEnginePlugin>>primitiveAddGradientFill (GEFEntityLoadFailed is Undeclared) 
[StackVM] 
[StackVM] BalloonEnginePlugin>>primitiveAddLine (GEFWrongFill is Undeclared) 
[StackVM] 
[StackVM] BalloonEnginePlugin>>primitiveAddLine (GEFBadPoint is Undeclared) 
[StackVM] 
[StackVM] BalloonEnginePlugin>>primitiveAddLine (GEFEngineStopped is Undeclared) 
[StackVM] 
[StackVM] BalloonEnginePlugin>>primitiveAddLine (GEFEngineStopped is Undeclared) 
[StackVM] 
[StackVM] BalloonEnginePlugin>>primitiveAddLine (GEFEntityLoadFailed is Undeclared) 
[StackVM] 
[StackVM] BalloonEnginePlugin>>primitiveAddOval (GEFWrongFill is Undeclared) 
[StackVM] 
[StackVM] BalloonEnginePlugin>>primitiveAddOval (GEFEngineStopped is Undeclared) 
[StackVM] 
[StackVM] BalloonEnginePlugin>>primitiveAddOval (GEFWorkTooBig is Undeclared) 
[StackVM] 
[StackVM] BalloonEnginePlugin>>primitiveAddOval (GEFBadPoint is Undeclared) 
[StackVM] 
[StackVM] BalloonEnginePlugin>>primitiveAddOval (GEFEngineStopped is Undeclared) 
[StackVM] 
[StackVM] BalloonEnginePlugin>>primitiveAddOval (GEFEntityLoadFailed is Undeclared) 
[StackVM] 
[StackVM] BalloonEnginePlugin>>primitiveAddPolygon (GEFWrongFill is Undeclared) 
[StackVM] 
[StackVM] BalloonEnginePlugin>>primitiveAddPolygon (GEFEngineStopped is Undeclared) 
[StackVM] 
[StackVM] BalloonEnginePlugin>>primitiveAddPolygon (GEFEngineStopped is Undeclared) 
[StackVM] 
[StackVM] BalloonEnginePlugin>>primitiveAddPolygon (GEFEntityLoadFailed is Undeclared) 
[StackVM] 
[StackVM] BalloonEnginePlugin>>primitiveAddRect (GEFWrongFill is Undeclared) 
[StackVM] 
[StackVM] BalloonEnginePlugin>>primitiveAddRect (GEFEngineStopped is Undeclared) 
[StackVM] 
[StackVM] BalloonEnginePlugin>>primitiveAddRect (GEFWorkTooBig is Undeclared) 
[StackVM] 
[StackVM] BalloonEnginePlugin>>primitiveAddRect (GEFBadPoint is Undeclared) 
[StackVM] 
[StackVM] BalloonEnginePlugin>>primitiveAddRect (GEFEntityLoadFailed is Undeclared) 
[StackVM] 
[StackVM] Loaded -> VMMaker-CompatibleUserName.1568126004 --- https://github.com/pharo-project/opensmalltalk-vm.git[Detached at 42f33b4] --- cache
[StackVM] ...finished baseline2019-09-10 16:45:29.802 Pharo[2181:507] ApplePersistenceIgnoreState: Existing state will not be touched. New state will be written to /var/folders/w0/nn_htp7n6ddcydvkv21hjzhc0000gn/T/org.pharo.Pharo.savedState
[StackVM] 2019-09-10 16:45:30.537 Pharo[2181:507] 16:45:30.537 ERROR:     [0x7fff74f2c310] AQMEIO.cpp:377: _FindIOUnit: error -66680
[StackVM] 2019-09-10 16:45:30.537 Pharo[2181:507] 16:45:30.537 ERROR:     [0x7fff74f2c310] >aq> AudioQueueObject.cpp:1590: Prime: failed (-66680); will stop (5512/0 frames)
[StackVM] 2019-09-10 16:45:30.539 Pharo[2181:507] 16:45:30.539 ERROR:     [0x7fff74f2c310] AQMEIO.cpp:377: _FindIOUnit: error -66680
[StackVM] 2019-09-10 16:45:30.540 Pharo[2181:507] 16:45:30.539 ERROR:     [0x7fff74f2c310] >aq> AudioQueueObject.cpp:1590: Prime: failed (-66680); will stop (33075/0 frames)
[StackVM] [  2%] Generating VM files for flavour: StackVM
[StackVM] 2019-09-10 16:45:33.398 Pharo[2192:507] ApplePersistenceIgnoreState: Existing state will not be touched. New state will be written to /var/folders/w0/nn_htp7n6ddcydvkv21hjzhc0000gn/T/org.pharo.Pharo.savedState
[StackVM] 2019-09-10 16:45:33.977 Pharo[2192:507] 16:45:33.977 ERROR:     [0x7fff74f2c310] AQMEIO.cpp:377: _FindIOUnit: error -66680
[StackVM] 2019-09-10 16:45:33.978 Pharo[2192:507] 16:45:33.978 ERROR:     [0x7fff74f2c310] >aq> AudioQueueObject.cpp:1590: Prime: failed (-66680); will stop (5512/0 frames)
[StackVM] 2019-09-10 16:45:33.978 Pharo[2192:507] 16:45:33.978 ERROR:     [0x7fff74f2c310] AQMEIO.cpp:377: _FindIOUnit: error -66680
[StackVM] 2019-09-10 16:45:33.979 Pharo[2192:507] 16:45:33.979 ERROR:     [0x7fff74f2c310] >aq> AudioQueueObject.cpp:1590: Prime: failed (-66680); will stop (33075/0 frames)
[StackVM] Generating #StackVM in '/builds/workspace/pharo-vm_headless/build'...
[StackVM] 
[StackVM] conflicting return types sqInt, void in reverseDisplayFrom:to:
[StackVM] conflicting return types sqInt, void in internalExecuteNewMethod
[StackVM] conflicting return types sqInt, void in reverseDisplayFrom:to:
[StackVM] conflicting return types sqInt, void in extendedStoreBytecodePop:
[StackVM] conflicting return types sqInt, void in internalExecuteNewMethod
[StackVM] conflicting return types sqInt, void in reverseDisplayFrom:to:
[StackVM] conflicting return types sqInt, void in extendedStoreBytecodePop:
[StackVM] conflicting return types sqInt, void in internalExecuteNewMethod
[StackVM] conflicting return types sqInt, void in reverseDisplayFrom:to:
[StackVM] conflicting return types sqInt, void in extendedStoreBytecodePop:
[StackVM] conflicting return types sqInt, void in internalExecuteNewMethod
[StackVM] conflicting return types sqInt, void in reverseDisplayFrom:to:
[StackVM] conflicting return types sqInt, void in extendedStoreBytecodePop:
[StackVM] conflicting return types sqInt, void in internalExecuteNewMethod
[StackVM] conflicting return types sqInt, void in reverseDisplayFrom:to:
[StackVM] conflicting return types sqInt, void in extendedStoreBytecodePop:
[StackVM] 
[StackVM] compactionStartUsecs localised to fullGC
[StackVM] 
[StackVM] gcMarkEndUsecs localised to fullGC
[StackVM] 
[StackVM] extA localised to interpret
[StackVM] 
[StackVM] extB localised to interpret
[StackVM] 
[StackVM] lkupClassTag localised to interpret
[StackVM] 
[StackVM] numExtB localised to interpret
[StackVM] PharoVMMaker
[StackVM] Scanning dependencies of target PharoVMCore
[StackVM] [  2%] Building C object CMakeFiles/PharoVMCore.dir/src/debug.c.o
[StackVM] [  3%] Building C object CMakeFiles/PharoVMCore.dir/src/utils.c.o
[StackVM] /builds/workspace/pharo-vm_headless/repository/src/utils.c:423:30: warning: incompatible pointer types assigning to 'void (*)(int, struct __siginfo *, void *)' from 'void (int)' [-Wincompatible-pointer-types]
[StackVM]         handler_action.sa_sigaction = sighandler;
[StackVM]                                     ^ ~~~~~~~~~~
[StackVM] /builds/workspace/pharo-vm_headless/repository/src/utils.c:577:27: warning: passing 'const char *' to parameter of type 'char *' discards qualifiers [-Wincompatible-pointer-types-discards-qualifiers]
[StackVM]         strcpy(basePath, dirname(path));
[StackVM]                                  ^~~~
[StackVM] /usr/include/secure/_string.h:83:33: note: expanded from macro 'strcpy'
[StackVM]   __builtin___strcpy_chk (dest, src, __darwin_obsz (dest))
[StackVM]                                 ^
[StackVM] /usr/include/libgen.h:41:21: note: passing argument to parameter here
[StackVM] char    *dirname(char *);
[StackVM]                        ^
[StackVM] 2 warnings generated.
[StackVM] [  4%] Building C object CMakeFiles/PharoVMCore.dir/src/nullDisplay.c.o
[StackVM] [  4%] Building C object CMakeFiles/PharoVMCore.dir/src/externalPrimitives.c.o
[StackVM] [  5%] Building C object CMakeFiles/PharoVMCore.dir/src/client.c.o
[StackVM] [  5%] Downloading Pharo 70
[StackVM] --2019-09-10 16:45:56--  http://get.pharo.org/64/70
[StackVM] Resolving get.pharo.org... 164.132.235.17, 2001:41d0:301::23
[StackVM] Connecting to get.pharo.org|164.132.235.17|:80... connected.
[StackVM] HTTP request sent, awaiting response... 200 OK
[StackVM] Length: 3244 (3.2K) [application/octet-stream]
[StackVM] Saving to: 'STDOUT'
[StackVM] 
[StackVM]      0K ...                                                   100%  206M=0s
[StackVM] 
[StackVM] 2019-09-10 16:45:56 (206 MB/s) - written to stdout [3244/3244]
[StackVM] 
[StackVM] Downloading the latest 70 Image:
[StackVM]     http://files.pharo.org/get-files/70/pharo64.zip
[StackVM] overwrite Pharo7.0-32bit-ccd1f64.sources? (y/n [n]) not overwritten
[StackVM] --2019-09-10 16:45:59--  http://get.pharo.org/64/vm70
[StackVM] Resolving get.pharo.org... 164.132.235.17, 2001:41d0:301::23
[StackVM] Connecting to get.pharo.org|164.132.235.17|:80... connected.
[StackVM] HTTP request sent, awaiting response... 200 OK
[StackVM] Length: 5320 (5.2K) [application/octet-stream]
[StackVM] Saving to: 'STDOUT'
[StackVM] 
[StackVM]      0K .....                                                 100% 92.2M=0s
[StackVM] 
[StackVM] 2019-09-10 16:45:59 (92.2 MB/s) - written to stdout [5320/5320]
[StackVM] 
[StackVM] Downloading the latest pharoVM:
[StackVM] 	http://files.pharo.org/get-files/70/pharo64-mac-stable.zip
[StackVM] replace pharo-vm/Pharo.app/Contents/_CodeSignature/CodeResources? [y]es, [n]o, [A]ll, [N]one, [r]ename: new name: replace pharo-vm/Pharo.app/Contents/Info.plist? [y]es, [n]o, [A]ll, [N]one, [r]ename: error:  invalid response [
[StackVM] ]
[StackVM] replace pharo-vm/Pharo.app/Contents/Info.plist? [y]es, [n]o, [A]ll, [N]one, [r]ename: error:  invalid response [i]
[StackVM] replace pharo-vm/Pharo.app/Contents/Info.plist? [y]es, [n]o, [A]ll, [N]one, [r]ename: error:  invalid response [S]
[StackVM] replace pharo-vm/Pharo.app/Contents/Info.plist? [y]es, [n]o, [A]ll, [N]one, [r]ename: error:  invalid response [i]
[StackVM] replace pharo-vm/Pharo.app/Contents/Info.plist? [y]es, [n]o, [A]ll, [N]one, [r]ename: error:  invalid response [h]
[StackVM] replace pharo-vm/Pharo.app/Contents/Info.plist? [y]es, [n]o, [A]ll, [N]one, [r]ename: error:  invalid response [ ]
[StackVM] replace pharo-vm/Pharo.app/Contents/Info.plist? [y]es, [n]o, [A]ll, [N]one, [r]ename: error:  invalid response [O]
[StackVM] replace pharo-vm/Pharo.app/Contents/Info.plist? [y]es, [n]o, [A]ll, [N]one, [r]ename: replace pharo-vm/Pharo.app/Contents/MacOS/Pharo? [y]es, [n]o, [A]ll, [N]one, [r]ename: error:  invalid response [I]
[StackVM] replace pharo-vm/Pharo.app/Contents/MacOS/Pharo? [y]es, [n]o, [A]ll, [N]one, [r]ename: error:  invalid response [ ]
[StackVM] replace pharo-vm/Pharo.app/Contents/MacOS/Pharo? [y]es, [n]o, [A]ll, [N]one, [r]ename: [  6%] Building C object CMakeFiles/PharoVMCore.dir/generated/vm/src/gcc3x-interp.c.o
[StackVM] /builds/workspace/pharo-vm_headless/build/generated/vm/src/gcc3x-interp.c:5667:68: warning: expression result unused [-Wunused-value]
[StackVM]                                         localIP = pointerForOop(((GIV(newMethod) + ((LiteralStart + ((assert((((methodHeader) & 7) == 1)),
[StackVM]                                                                                                       ^~~~~~~~~~~~~~~~~~~~~~~~~~~~~~~~~~~
[StackVM] /builds/workspace/pharo-vm_headless/repository/extracted/vm/include/common/sqAssert.h:19:23: note: expanded from macro 'assert'
[StackVM] # define assert(expr) 0 /* hack disabling of asserts.  Better in makefile? */
[StackVM]                       ^
[StackVM] /builds/workspace/pharo-vm_headless/repository/extracted/vm/include/common/sqMemoryAccess.h:217:41: note: expanded from macro 'pointerForOop'
[StackVM] #  define pointerForOop(oop)            ((char *)(oop))
[StackVM]                                                   ^
[StackVM] /builds/workspace/pharo-vm_headless/build/generated/vm/src/gcc3x-interp.c:22093:3: warning: expression result unused [-Wunused-value]
[StackVM]                 !GIV(primFailCode);
[StackVM]                 ^    ~~~~~~~~~~~~
[StackVM] /builds/workspace/pharo-vm_headless/build/generated/vm/src/gcc3x-interp.c:24269:3: warning: expression result unused [-Wunused-value]
[StackVM]                 !GIV(primFailCode);
[StackVM]                 ^    ~~~~~~~~~~~~
[StackVM] /builds/workspace/pharo-vm_headless/build/generated/vm/src/gcc3x-interp.c:24505:3: warning: expression result unused [-Wunused-value]
[StackVM]                 !GIV(primFailCode);
[StackVM]                 ^    ~~~~~~~~~~~~
[StackVM] /builds/workspace/pharo-vm_headless/build/generated/vm/src/gcc3x-interp.c:32702:203: warning: data argument not used by format string [-Wformat-extra-args]
[StackVM]                 : "\ttenure below 0x%" PRIxSQINT "/%" PRIdSQINT " %s\n"), (GIV(scavengeLogRecord).tTenureThreshold), (GIV(scavengeLogRecord).tTenureThreshold), policyNames[(GIV(scavengeLogRecord).tTenureCriterion)], (GIV(scavengeLogRecord).tRefCountToShrinkRT));
[StackVM]                   ~~~~~~~~~~~~~~~~~~~~~~~~~~~~~~~~~~~~~~~~~~~~~~~~~~~~~                                                                                                                                                 ^
[StackVM] /builds/workspace/pharo-vm_headless/build/generated/vm/src/gcc3x-interp.c:41206:5: warning: expression result unused [-Wunused-value]
[StackVM]                                 -classIndex2;
[StackVM]                                 ^~~~~~~~~~~~
[StackVM] /builds/workspace/pharo-vm_headless/build/generated/vm/src/gcc3x-interp.c:41270:26: warning: expression result unused [-Wunused-value]
[StackVM]                 8 /* allocationUnit */ / BytesPerOop;
[StackVM]                 ~                      ^ ~~~~~~~~~~~
[StackVM] /builds/workspace/pharo-vm_headless/build/generated/vm/src/gcc3x-interp.c:47131:41: warning: expression result unused [-Wunused-value]
[StackVM]                 asserta((checkInterpreterIntegrity()) == 0);
[StackVM]                         ~~~~~~~~~~~~~~~~~~~~~~~~~~~~~ ^  ~
[StackVM] /builds/workspace/pharo-vm_headless/repository/extracted/vm/include/common/sqAssert.h:20:25: note: expanded from macro 'asserta'
[StackVM] # define asserta(expr) (expr)
[StackVM]                         ^
[StackVM] /builds/workspace/pharo-vm_headless/build/generated/vm/src/gcc3x-interp.c:47152:41: warning: expression result unused [-Wunused-value]
[StackVM]                 asserta((checkInterpreterIntegrity()) == 0);
[StackVM]                         ~~~~~~~~~~~~~~~~~~~~~~~~~~~~~ ^  ~
[StackVM] /builds/workspace/pharo-vm_headless/repository/extracted/vm/include/common/sqAssert.h:20:25: note: expanded from macro 'asserta'
[StackVM] # define asserta(expr) (expr)
[StackVM]                         ^
[StackVM] /builds/workspace/pharo-vm_headless/build/generated/vm/src/gcc3x-interp.c:50495:108: warning: passing 'usqInt *' (aka 'unsigned long *') to parameter of type 'sqInt *' (aka 'long *') converts between pointers to integer types with different sign [-Wpointer-sign]
[StackVM]         segAddress = sqAllocateMemorySegmentOfSizeAboveAllocatedSizeInto(ammount, firstGapOfSizeAtLeast(ammount), (&allocatedSize));
[StackVM]                                                                                                                   ^~~~~~~~~~~~~~~~
[StackVM] /builds/workspace/pharo-vm_headless/repository/extracted/vm/include/common/sq.h:100:98: note: passing argument to parameter 'asp' here
[StackVM] extern void *sqAllocateMemorySegmentOfSizeAboveAllocatedSizeInto(sqInt sz, void *minAddr, sqInt *asp);
[StackVM]                                                                                                  ^
[StackVM] /builds/workspace/pharo-vm_headless/build/generated/vm/src/gcc3x-interp.c:59255:27: warning: expression result unused [-Wunused-value]
[StackVM]                 printHex(oopForPointer((assert((((sender) & 7) == 1)),
[StackVM]                                         ^~~~~~~~~~~~~~~~~~~~~~~~~~~~~
[StackVM] /builds/workspace/pharo-vm_headless/repository/extracted/vm/include/common/sqAssert.h:19:23: note: expanded from macro 'assert'
[StackVM] # define assert(expr) 0 /* hack disabling of asserts.  Better in makefile? */
[StackVM]                       ^
[StackVM] /builds/workspace/pharo-vm_headless/repository/extracted/vm/include/common/sqMemoryAccess.h:218:40: note: expanded from macro 'oopForPointer'
[StackVM] #  define oopForPointer(ptr)            ((sqInt)(ptr))
[StackVM]                                                  ^
[StackVM] /builds/workspace/pharo-vm_headless/build/generated/vm/src/gcc3x-interp.c:59265:27: warning: expression result unused [-Wunused-value]
[StackVM]                 printHex(oopForPointer((assert((((ip) & 7) == 1)),
[StackVM]                                         ^~~~~~~~~~~~~~~~~~~~~~~~~
[StackVM] /builds/workspace/pharo-vm_headless/repository/extracted/vm/include/common/sqAssert.h:19:23: note: expanded from macro 'assert'
[StackVM] # define assert(expr) 0 /* hack disabling of asserts.  Better in makefile? */
[StackVM]                       ^
[StackVM] /builds/workspace/pharo-vm_headless/repository/extracted/vm/include/common/sqMemoryAccess.h:218:40: note: expanded from macro 'oopForPointer'
[StackVM] #  define oopForPointer(ptr)            ((sqInt)(ptr))
[StackVM]                                                  ^
[StackVM] /builds/workspace/pharo-vm_headless/build/generated/vm/src/gcc3x-interp.c:68075:2: warning: expression result unused [-Wunused-value]
[StackVM]         !GIV(primFailCode);
[StackVM]         ^    ~~~~~~~~~~~~
[StackVM] /builds/workspace/pharo-vm_headless/build/generated/vm/src/gcc3x-interp.c:68215:3: warning: expression result unused [-Wunused-value]
[StackVM]                 !GIV(primFailCode);
[StackVM]                 ^    ~~~~~~~~~~~~
[StackVM] /builds/workspace/pharo-vm_headless/build/generated/vm/src/gcc3x-interp.c:68439:3: warning: expression result unused [-Wunused-value]
[StackVM]                 !GIV(primFailCode);
[StackVM]                 ^    ~~~~~~~~~~~~
[StackVM] /builds/workspace/pharo-vm_headless/build/generated/vm/src/gcc3x-interp.c:69938:3: warning: expression result unused [-Wunused-value]
[StackVM]                 !GIV(primFailCode);
[StackVM]                 ^    ~~~~~~~~~~~~
[StackVM] 16 warnings generated.
[StackVM] [  6%] Building C object CMakeFiles/PharoVMCore.dir/extracted/vm/src/common/sqHeapMap.c.o
[StackVM] [  7%] Building C object CMakeFiles/PharoVMCore.dir/extracted/vm/src/common/sqVirtualMachine.c.o
[StackVM] /builds/workspace/pharo-vm_headless/repository/extracted/vm/src/common/sqVirtualMachine.c:431:37: warning: incompatible pointer types assigning to 'void *(*)(sqInt, sqInt, sqInt)' from 'void *(sqInt, sqInt, void *)' [-Wincompatible-pointer-types]
[StackVM]         VM->ioLoadSymbolOfLengthFromModule = ioLoadSymbolOfLengthFromModule;
[StackVM]                                            ^ ~~~~~~~~~~~~~~~~~~~~~~~~~~~~~~
[StackVM] /builds/workspace/pharo-vm_headless/repository/extracted/vm/src/common/sqVirtualMachine.c:509:22: warning: incompatible pointer types assigning to 'volatile unsigned long (*)(void)' from 'volatile unsigned long long (void)' [-Wincompatible-pointer-types]
[StackVM]         VM->utcMicroseconds = ioUTCMicroseconds;
[StackVM]                             ^ ~~~~~~~~~~~~~~~~~
[StackVM] 2 warnings generated.
[StackVM] [  8%] Building C object CMakeFiles/PharoVMCore.dir/extracted/vm/src/common/sqNamedPrims.c.o
[StackVM] [  9%] Building C object CMakeFiles/PharoVMCore.dir/extracted/vm/src/common/sqExternalSemaphores.c.o
[StackVM] [  9%] Building C object CMakeFiles/PharoVMCore.dir/extracted/vm/src/common/sqTicker.c.o
[StackVM] [ 10%] Building C object CMakeFiles/PharoVMCore.dir/extracted/vm/src/unix/aio.c.o
[StackVM] [ 11%] Building C object CMakeFiles/PharoVMCore.dir/extracted/vm/src/unix/sqUnixHeartbeat.c.o
[StackVM] [ 11%] Building C object CMakeFiles/PharoVMCore.dir/src/debugUnix.c.o
[StackVM] /builds/workspace/pharo-vm_headless/repository/src/debugUnix.c:304:2: warning: implicit declaration of function 'dumpPrimTraceLog' is invalid in C99 [-Wimplicit-function-declaration]
[StackVM]         dumpPrimTraceLog();
[StackVM]         ^
[StackVM] 1 warning generated.
[StackVM] [ 12%] Building CXX object CMakeFiles/PharoVMCore.dir/src/utilsMac.mm.o
[StackVM] [ 13%] Building C object CMakeFiles/PharoVMCore.dir/src/memoryUnix.c.o
[StackVM] [ 13%] Linking CXX shared library build/vm/libPharoVMCore.dylib
[StackVM] [ 13%] Built target PharoVMCore
[StackVM] Scanning dependencies of target Pharo
[StackVM] [ 13%] Building C object CMakeFiles/Pharo.dir/src/main.c.o
[StackVM] [ 14%] Building C object CMakeFiles/Pharo.dir/src/parameters.c.o
[StackVM] [ 15%] Building CXX object CMakeFiles/Pharo.dir/src/macOpenFileDialog.mm.o
[StackVM] [ 16%] Linking CXX executable build/vm/Pharo
[StackVM] [ 16%] Built target Pharo
[StackVM] Scanning dependencies of target SDL2-2.0.7
[StackVM] [ 17%] Generating build/third-party/SDL2-2.0.7.zip
[StackVM] --2019-09-10 16:46:45--  https://files.pharo.org/vm/pharo-spur64/mac/third-party/SDL2-2.0.7.zip
[StackVM] Resolving files.pharo.org... 164.132.235.17, 2001:41d0:301::23
[StackVM] Connecting to files.pharo.org|164.132.235.17|:443... connected.
[StackVM] HTTP request sent, awaiting response... 200 OK
[StackVM] Length: 961356 (939K) [application/zip]
[StackVM] Saving to: 'SDL2-2.0.7.zip'
[StackVM] 
[StackVM]      0K .......... .......... .......... .......... ..........  5% 4.02M 0s
[StackVM]     50K .......... .......... .......... .......... .......... 10% 8.98M 0s
[StackVM]    100K .......... .......... .......... .......... .......... 15% 36.0M 0s
[StackVM]    150K .......... .......... .......... .......... .......... 21% 9.94M 0s
[StackVM]    200K .......... .......... .......... .......... .......... 26% 28.2M 0s
[StackVM]    250K .......... .......... .......... .......... .......... 31% 21.9M 0s
[StackVM]    300K .......... .......... .......... .......... .......... 37% 15.4M 0s
[StackVM]    350K .......... .......... .......... .......... .......... 42% 30.4M 0s
[StackVM]    400K .......... .......... .......... .......... .......... 47% 11.7M 0s
[StackVM]    450K .......... .......... .......... .......... .......... 53% 29.1M 0s
[StackVM]    500K .......... .......... .......... .......... .......... 58% 33.7M 0s
[StackVM]    550K .......... .......... .......... .......... .......... 63% 14.7M 0s
[StackVM]    600K .......... .......... .......... .......... .......... 69% 24.3M 0s
[StackVM]    650K .......... .......... .......... .......... .......... 74% 55.1M 0s
[StackVM]    700K .......... .......... .......... .......... .......... 79% 13.5M 0s
[StackVM]    750K .......... .......... .......... .......... .......... 85% 31.3M 0s
[StackVM]    800K .......... .......... .......... .......... .......... 90% 40.2M 0s
[StackVM]    850K .......... .......... .......... .......... .......... 95% 8.55M 0s
[StackVM]    900K .......... .......... .......... ........             100% 83.5M=0.06s
[StackVM] 
[StackVM] 2019-09-10 16:46:45 (15.6 MB/s) - 'SDL2-2.0.7.zip' saved [961356/961356]
[StackVM] 
[StackVM] [ 18%] Generating build/third-party/SDL2-2.0.7.done
[StackVM] Archive:  SDL2-2.0.7.zip
[StackVM]   inflating: /builds/workspace/pharo-vm_headless/build/build/vm/libSDL2-2.0.0.dylib  
[StackVM]   inflating: /builds/workspace/pharo-vm_headless/build/build/vm/libSDL2.dylib  
[StackVM] [ 18%] Built target SDL2-2.0.7
[StackVM] Scanning dependencies of target libgit2-0.25.1
[StackVM] [ 19%] Generating build/third-party/libgit2-0.25.1.zip
[StackVM] --2019-09-10 16:46:45--  https://files.pharo.org/vm/pharo-spur64/mac/third-party/libgit2-0.25.1.zip
[StackVM] Resolving files.pharo.org... 164.132.235.17, 2001:41d0:301::23
[StackVM] Connecting to files.pharo.org|164.132.235.17|:443... connected.
[StackVM] HTTP request sent, awaiting response... 200 OK
[StackVM] Length: 1846137 (1.8M) [application/zip]
[StackVM] Saving to: 'libgit2-0.25.1.zip'
[StackVM] 
[StackVM]      0K .......... .......... .......... .......... ..........  2% 3.05M 1s
[StackVM]     50K .......... .......... .......... .......... ..........  5% 38.8M 0s
[StackVM]    100K .......... .......... .......... .......... ..........  8% 12.2M 0s
[StackVM]    150K .......... .......... .......... .......... .......... 11% 13.3M 0s
[StackVM]    200K .......... .......... .......... .......... .......... 13% 22.7M 0s
[StackVM]    250K .......... .......... .......... .......... .......... 16% 29.0M 0s
[StackVM]    300K .......... .......... .......... .......... .......... 19% 16.0M 0s
[StackVM]    350K .......... .......... .......... .......... .......... 22% 20.3M 0s
[StackVM]    400K .......... .......... .......... .......... .......... 24% 20.8M 0s
[StackVM]    450K .......... .......... .......... .......... .......... 27% 24.3M 0s
[StackVM]    500K .......... .......... .......... .......... .......... 30% 24.9M 0s
[StackVM]    550K .......... .......... .......... .......... .......... 33% 15.4M 0s
[StackVM]    600K .......... .......... .......... .......... .......... 36% 38.2M 0s
[StackVM]    650K .......... .......... .......... .......... .......... 38% 17.8M 0s
[StackVM]    700K .......... .......... .......... .......... .......... 41% 10.2M 0s
[StackVM]    750K .......... .......... .......... .......... .......... 44% 13.8M 0s
[StackVM]    800K .......... .......... .......... .......... .......... 47% 8.92M 0s
[StackVM]    850K .......... .......... .......... .......... .......... 49% 12.4M 0s
[StackVM]    900K .......... .......... .......... .......... .......... 52% 10.9M 0s
[StackVM]    950K .......... .......... .......... .......... .......... 55% 12.5M 0s
[StackVM]   1000K .......... .......... .......... .......... .......... 58% 10.6M 0s
[StackVM]   1050K .......... .......... .......... .......... .......... 61% 15.1M 0s
[StackVM]   1100K .......... .......... .......... .......... .......... 63% 7.73M 0s
[StackVM]   1150K .......... .......... .......... .......... .......... 66% 17.0M 0s
[StackVM]   1200K .......... .......... .......... .......... .......... 69% 13.1M 0s
[StackVM]   1250K .......... .......... .......... .......... .......... 72% 12.2M 0s
[StackVM]   1300K .......... .......... .......... .......... .......... 74% 25.5M 0s
[StackVM]   1350K .......... .......... .......... .......... .......... 77% 18.7M 0s
[StackVM]   1400K .......... .......... .......... .......... .......... 80% 29.3M 0s
[StackVM]   1450K .......... .......... .......... .......... .......... 83% 32.6M 0s
[StackVM]   1500K .......... .......... .......... .......... .......... 85% 17.6M 0s
[StackVM]   1550K .......... .......... .......... .......... .......... 88% 30.9M 0s
[StackVM]   1600K .......... .......... .......... .......... .......... 91% 28.7M 0s
[StackVM]   1650K .......... .......... .......... .......... .......... 94% 20.3M 0s
[StackVM]   1700K .......... .......... .......... .......... .......... 97% 26.7M 0s
[StackVM]   1750K .......... .......... .......... .......... .......... 99% 8.04M 0s
[StackVM]   1800K ..                                                    100% 45.2M=0.1s
[StackVM] 
[StackVM] 2019-09-10 16:46:45 (14.3 MB/s) - 'libgit2-0.25.1.zip' saved [1846137/1846137]
[StackVM] 
[StackVM] [ 20%] Generating build/third-party/libgit2-0.25.1.done
[StackVM] Archive:  libgit2-0.25.1.zip
[StackVM]   inflating: /builds/workspace/pharo-vm_headless/build/build/vm/libgit2.0.25.1.dylib  
[StackVM]   inflating: /builds/workspace/pharo-vm_headless/build/build/vm/libgit2.25.dylib  
[StackVM]   inflating: /builds/workspace/pharo-vm_headless/build/build/vm/libgit2.dylib  
[StackVM] [ 20%] Built target libgit2-0.25.1
[StackVM] Scanning dependencies of target freetype-2.9.1
[StackVM] [ 21%] Generating build/third-party/freetype-2.9.1.zip
[StackVM] --2019-09-10 16:46:46--  https://files.pharo.org/vm/pharo-spur64/mac/third-party/freetype-2.9.1.zip
[StackVM] Resolving files.pharo.org... 164.132.235.17, 2001:41d0:301::23
[StackVM] Connecting to files.pharo.org|164.132.235.17|:443... connected.
[StackVM] HTTP request sent, awaiting response... 200 OK
[StackVM] Length: 744194 (727K) [application/zip]
[StackVM] Saving to: 'freetype-2.9.1.zip'
[StackVM] 
[StackVM]      0K .......... .......... .......... .......... ..........  6% 7.96M 0s
[StackVM]     50K .......... .......... .......... .......... .......... 13% 8.34M 0s
[StackVM]    100K .......... .......... .......... .......... .......... 20% 5.08M 0s
[StackVM]    150K .......... .......... .......... .......... .......... 27% 53.3M 0s
[StackVM]    200K .......... .......... .......... .......... .......... 34% 13.0M 0s
[StackVM]    250K .......... .......... .......... .......... .......... 41% 15.2M 0s
[StackVM]    300K .......... .......... .......... .......... .......... 48% 9.65M 0s
[StackVM]    350K .......... .......... .......... .......... .......... 55% 11.8M 0s
[StackVM]    400K .......... .......... .......... .......... .......... 61% 61.3M 0s
[StackVM]    450K .......... .......... .......... .......... .......... 68% 11.7M 0s
[StackVM]    500K .......... .......... .......... .......... .......... 75% 17.8M 0s
[StackVM]    550K .......... .......... .......... .......... .......... 82% 18.9M 0s
[StackVM]    600K .......... .......... .......... .......... .......... 89% 15.0M 0s
[StackVM]    650K .......... .......... .......... .......... .......... 96%  137M 0s
[StackVM]    700K .......... .......... ......                          100% 4.98M=0.06s
[StackVM] 
[StackVM] 2019-09-10 16:46:46 (12.3 MB/s) - 'freetype-2.9.1.zip' saved [744194/744194]
[StackVM] 
[StackVM] [ 22%] Generating build/third-party/freetype-2.9.1.done
[StackVM] Archive:  freetype-2.9.1.zip
[StackVM]   inflating: /builds/workspace/pharo-vm_headless/build/build/vm/libfreetype.6.dylib  
[StackVM]   inflating: /builds/workspace/pharo-vm_headless/build/build/vm/libfreetype.dylib  
[StackVM] [ 22%] Built target freetype-2.9.1
[StackVM] Scanning dependencies of target SqueakSSL
[StackVM] [ 22%] Building C object CMakeFiles/SqueakSSL.dir/extracted/plugins/SqueakSSL/src/common/SqueakSSL.c.o
[StackVM] [ 23%] Building C object CMakeFiles/SqueakSSL.dir/extracted/plugins/SqueakSSL/src/osx/sqMacSSL.c.o
[StackVM] [ 24%] Linking C shared library build/vm/libSqueakSSL.dylib
[StackVM] [ 24%] Built target SqueakSSL
[StackVM] Scanning dependencies of target cairo-1.15.4
[StackVM] [ 24%] Generating build/third-party/cairo-1.15.4.zip
[StackVM] --2019-09-10 16:46:47--  https://files.pharo.org/vm/pharo-spur64/mac/third-party/cairo-1.15.4.zip
[StackVM] Resolving files.pharo.org... 164.132.235.17, 2001:41d0:301::23
[StackVM] Connecting to files.pharo.org|164.132.235.17|:443... connected.
[StackVM] HTTP request sent, awaiting response... 200 OK
[StackVM] Length: 1017920 (994K) [application/zip]
[StackVM] Saving to: 'cairo-1.15.4.zip'
[StackVM] 
[StackVM]      0K .......... .......... .......... .......... ..........  5% 4.23M 0s
[StackVM]     50K .......... .......... .......... .......... .......... 10% 8.08M 0s
[StackVM]    100K .......... .......... .......... .......... .......... 15% 8.48M 0s
[StackVM]    150K .......... .......... .......... .......... .......... 20% 36.6M 0s
[StackVM]    200K .......... .......... .......... .......... .......... 25% 49.5M 0s
[StackVM]    250K .......... .......... .......... .......... .......... 30% 6.77M 0s
[StackVM]    300K .......... .......... .......... .......... .......... 35% 52.9M 0s
[StackVM]    350K .......... .......... .......... .......... .......... 40% 13.7M 0s
[StackVM]    400K .......... .......... .......... .......... .......... 45% 15.1M 0s
[StackVM]    450K .......... .......... .......... .......... .......... 50% 15.7M 0s
[StackVM]    500K .......... .......... .......... .......... .......... 55% 18.5M 0s
[StackVM]    550K .......... .......... .......... .......... .......... 60% 24.8M 0s
[StackVM]    600K .......... .......... .......... .......... .......... 65% 15.3M 0s
[StackVM]    650K .......... .......... .......... .......... .......... 70% 51.7M 0s
[StackVM]    700K .......... .......... .......... .......... .......... 75% 9.72M 0s
[StackVM]    750K .......... .......... .......... .......... .......... 80% 31.0M 0s
[StackVM]    800K .......... .......... .......... .......... .......... 85% 62.1M 0s
[StackVM]    850K .......... .......... .......... .......... .......... 90% 11.3M 0s
[StackVM]    900K .......... .......... .......... .......... .......... 95% 8.40M 0s
[StackVM]    950K .......... .......... .......... .......... ....      100%  135M=0.07s
[StackVM] 
[StackVM] 2019-09-10 16:46:47 (13.8 MB/s) - 'cairo-1.15.4.zip' saved [1017920/1017920]
[StackVM] 
[StackVM] [ 25%] Generating build/third-party/cairo-1.15.4.done
[StackVM] Archive:  cairo-1.15.4.zip
[StackVM]   inflating: /builds/workspace/pharo-vm_headless/build/build/vm/libcairo.2.dylib  
[StackVM]   inflating: /builds/workspace/pharo-vm_headless/build/build/vm/libcairo.dylib  
[StackVM] [ 25%] Built target cairo-1.15.4
[StackVM] Scanning dependencies of target B2DPlugin
[StackVM] [ 25%] Building C object CMakeFiles/B2DPlugin.dir/extracted/plugins/B2DPlugin/src/common/B2DPlugin.c.o
[StackVM] /builds/workspace/pharo-vm_headless/repository/extracted/plugins/B2DPlugin/src/common/B2DPlugin.c:13646:18: warning: expression result unused [-Wunused-value]
[StackVM]                 ((signed)lastX >> 8);
[StackVM]                  ~~~~~~~~~~~~~ ^  ~
[StackVM] /builds/workspace/pharo-vm_headless/repository/extracted/plugins/B2DPlugin/src/common/B2DPlugin.c:13676:18: warning: expression result unused [-Wunused-value]
[StackVM]         ((signed)lastX1 >> 8);
[StackVM]          ~~~~~~~~~~~~~~ ^  ~
[StackVM] 2 warnings generated.
[StackVM] [ 26%] Linking C shared library build/vm/libB2DPlugin.dylib
[StackVM] [ 26%] Built target B2DPlugin
[StackVM] Scanning dependencies of target pthreadedPlugin-0.0.1
[StackVM] [ 27%] Generating build/third-party/pthreadedPlugin-0.0.1.zip
[StackVM] --2019-09-10 16:46:50--  https://files.pharo.org/vm/pharo-spur64/mac/third-party/pthreadedPlugin-0.0.1.zip
[StackVM] Resolving files.pharo.org... 164.132.235.17, 2001:41d0:301::23
[StackVM] Connecting to files.pharo.org|164.132.235.17|:443... connected.
[StackVM] HTTP request sent, awaiting response... 200 OK
[StackVM] Length: 438839 (429K) [application/zip]
[StackVM] Saving to: 'pthreadedPlugin-0.0.1.zip'
[StackVM] 
[StackVM]      0K .......... .......... .......... .......... .......... 11% 3.13M 0s
[StackVM]     50K .......... .......... .......... .......... .......... 23% 11.2M 0s
[StackVM]    100K .......... .......... .......... .......... .......... 35% 52.6M 0s
[StackVM]    150K .......... .......... .......... .......... .......... 46% 36.6M 0s
[StackVM]    200K .......... .......... .......... .......... .......... 58% 7.59M 0s
[StackVM]    250K .......... .......... .......... .......... .......... 70% 53.5M 0s
[StackVM]    300K .......... .......... .......... .......... .......... 81% 15.1M 0s
[StackVM]    350K .......... .......... .......... .......... .......... 93% 14.7M 0s
[StackVM]    400K .......... .......... ........                        100% 49.5M=0.04s
[StackVM] 
[StackVM] 2019-09-10 16:46:50 (11.4 MB/s) - 'pthreadedPlugin-0.0.1.zip' saved [438839/438839]
[StackVM] 
[StackVM] [ 28%] Generating build/third-party/pthreadedPlugin-0.0.1.done
[StackVM] Archive:  pthreadedPlugin-0.0.1.zip
[StackVM]   inflating: /builds/workspace/pharo-vm_headless/build/build/vm/cygffi-7.dll  
[StackVM]   inflating: /builds/workspace/pharo-vm_headless/build/build/vm/PThreadedPlugin.dll  
[StackVM]   inflating: /builds/workspace/pharo-vm_headless/build/build/vm/libPThreadedPlugin.dylib  
[StackVM] [ 28%] Built target pthreadedPlugin-0.0.1
[StackVM] Scanning dependencies of target FilePlugin
[StackVM] [ 29%] Building C object CMakeFiles/FilePlugin.dir/extracted/plugins/FilePlugin/src/common/FilePlugin.c.o
[StackVM] /builds/workspace/pharo-vm_headless/repository/extracted/plugins/FilePlugin/src/common/FilePlugin.c:579:10: warning: incompatible integer to pointer conversion returning 'sqInt' (aka 'long') from a function with result type 'void *' [-Wint-conversion]
[StackVM]                 return primitiveFailFor(PrimErrBadArgument);
[StackVM]                        ^~~~~~~~~~~~~~~~~~~~~~~~~~~~~~~~~~~~
[StackVM] /builds/workspace/pharo-vm_headless/repository/extracted/plugins/FilePlugin/src/common/FilePlugin.c:1735:21: warning: incompatible pointer types assigning to 'sqInt (*)(sqInt)' from 'sqInt (*)(int)' [-Wincompatible-pointer-types]
[StackVM]                 characterObjectOf = interpreterProxy->characterObjectOf;
[StackVM]                                   ^ ~~~~~~~~~~~~~~~~~~~~~~~~~~~~~~~~~~~
[StackVM] /builds/workspace/pharo-vm_headless/repository/extracted/plugins/FilePlugin/src/common/FilePlugin.c:1749:10: warning: incompatible pointer types assigning to 'sqInt (*)(void)' from 'void (*)(void)' [-Wincompatible-pointer-types]
[StackVM]                 fullGC = interpreterProxy->fullGC;
[StackVM]                        ^ ~~~~~~~~~~~~~~~~~~~~~~~~
[StackVM] 3 warnings generated.
[StackVM] [ 30%] Building C object CMakeFiles/FilePlugin.dir/extracted/plugins/FilePlugin/src/common/sqFilePluginBasicPrims.c.o
[StackVM] [ 31%] Building C object CMakeFiles/FilePlugin.dir/extracted/plugins/FilePlugin/src/unix/sqUnixFile.c.o
[StackVM] [ 31%] Building C object CMakeFiles/FilePlugin.dir/extracted/vm/src/unix/sqUnixCharConv.c.o
[StackVM] [ 32%] Building C object CMakeFiles/FilePlugin.dir/src/fileUtils.c.o
[StackVM] [ 33%] Linking C shared library build/vm/libFilePlugin.dylib
[StackVM] [ 33%] Built target FilePlugin
[StackVM] Scanning dependencies of target UnixOSProcessPlugin
[StackVM] [ 33%] Building C object CMakeFiles/UnixOSProcessPlugin.dir/extracted/plugins/UnixOSProcessPlugin/src/common/UnixOSProcessPlugin.c.o
[StackVM] /builds/workspace/pharo-vm_headless/repository/extracted/plugins/UnixOSProcessPlugin/src/common/UnixOSProcessPlugin.c:461:2: warning: expression result unused [-Wunused-value]
[StackVM]         (char *) strncpy (cString, sPtr, len);
[StackVM]         ^        ~~~~~~~~~~~~~~~~~~~~~~~~~~~~
[StackVM] /builds/workspace/pharo-vm_headless/repository/extracted/plugins/UnixOSProcessPlugin/src/common/UnixOSProcessPlugin.c:4622:36: warning: incompatible pointer types assigning to 'void (*)(int, struct __siginfo *, void *)' from 'void (int)' [-Wincompatible-pointer-types]
[StackVM]         sigchldHandlerAction.sa_sigaction = reapChildProcess;
[StackVM]                                           ^ ~~~~~~~~~~~~~~~~
[StackVM] /builds/workspace/pharo-vm_headless/repository/extracted/plugins/UnixOSProcessPlugin/src/common/UnixOSProcessPlugin.c:4628:53: warning: comparison between pointer and integer ('int' and 'void *')
[StackVM]         if ((sigaction(SIGCHLD, &sigchldHandlerAction, 0)) == (sigErrorNumber())) {
[StackVM]             ~~~~~~~~~~~~~~~~~~~~~~~~~~~~~~~~~~~~~~~~~~~~~~ ^  ~~~~~~~~~~~~~~~~~~
[StackVM] /builds/workspace/pharo-vm_headless/repository/extracted/plugins/UnixOSProcessPlugin/src/common/UnixOSProcessPlugin.c:4671:74: warning: comparison between pointer and integer ('int' and 'void *')
[StackVM]         if ((sigaction(signalNumber, (&sigHandlerAction), (&oldHandlerAction))) == (sigErrorNumber())) {
[StackVM]             ~~~~~~~~~~~~~~~~~~~~~~~~~~~~~~~~~~~~~~~~~~~~~~~~~~~~~~~~~~~~~~~~~~~ ^  ~~~~~~~~~~~~~~~~~~
[StackVM] /builds/workspace/pharo-vm_headless/repository/extracted/plugins/UnixOSProcessPlugin/src/common/UnixOSProcessPlugin.c:5063:2: warning: expression result unused [-Wunused-value]
[StackVM]         (char *)strncpy(cString, stringPtr, len);
[StackVM]         ^       ~~~~~~~~~~~~~~~~~~~~~~~~~~~~~~~~
[StackVM] 5 warnings generated.
[StackVM] [ 34%] Linking C shared library build/vm/libUnixOSProcessPlugin.dylib
[StackVM] [ 34%] Built target UnixOSProcessPlugin
[StackVM] Scanning dependencies of target libffi-3.3-rc0
[StackVM] [ 35%] Generating build/third-party/libffi-3.3-rc0.zip
[StackVM] --2019-09-10 16:46:53--  https://files.pharo.org/vm/pharo-spur64/mac/third-party/libffi-3.3-rc0.zip
[StackVM] Resolving files.pharo.org... 164.132.235.17, 2001:41d0:301::23
[StackVM] Connecting to files.pharo.org|164.132.235.17|:443... connected.
[StackVM] HTTP request sent, awaiting response... 200 OK
[StackVM] Length: 16182 (16K) [application/zip]
[StackVM] Saving to: 'libffi-3.3-rc0.zip'
[StackVM] 
[StackVM]      0K .......... .....                                      100% 2.10M=0.007s
[StackVM] 
[StackVM] 2019-09-10 16:46:53 (2.10 MB/s) - 'libffi-3.3-rc0.zip' saved [16182/16182]
[StackVM] 
[StackVM] [ 35%] Generating build/third-party/libffi-3.3-rc0.done
[StackVM] Archive:  libffi-3.3-rc0.zip
[StackVM]   inflating: /builds/workspace/pharo-vm_headless/build/build/vm/libffi.7.dylib  
[StackVM] [ 35%] Built target libffi-3.3-rc0
[StackVM] Scanning dependencies of target MiscPrimitivePlugin
[StackVM] [ 36%] Building C object CMakeFiles/MiscPrimitivePlugin.dir/extracted/plugins/MiscPrimitivePlugin/src/common/MiscPrimitivePlugin.c.o
[StackVM] [ 37%] Linking C shared library build/vm/libMiscPrimitivePlugin.dylib
[StackVM] [ 37%] Built target MiscPrimitivePlugin
[StackVM] Scanning dependencies of target JPEGReaderPlugin
[StackVM] [ 37%] Building C object CMakeFiles/JPEGReaderPlugin.dir/extracted/plugins/JPEGReaderPlugin/src/common/JPEGReaderPlugin.c.o
[StackVM] [ 38%] Linking C shared library build/vm/libJPEGReaderPlugin.dylib
[StackVM] [ 38%] Built target JPEGReaderPlugin
[StackVM] Scanning dependencies of target pixman-0.34.0
[StackVM] [ 39%] Generating build/third-party/pixman-0.34.0.zip
[StackVM] --2019-09-10 16:46:54--  https://files.pharo.org/vm/pharo-spur64/mac/third-party/pixman-0.34.0.zip
[StackVM] Resolving files.pharo.org... 164.132.235.17, 2001:41d0:301::23
[StackVM] Connecting to files.pharo.org|164.132.235.17|:443... connected.
[StackVM] HTTP request sent, awaiting response... 200 OK
[StackVM] Length: 1343558 (1.3M) [application/zip]
[StackVM] Saving to: 'pixman-0.34.0.zip'
[StackVM] 
[StackVM]      0K .......... .......... .......... .......... ..........  3% 6.05M 0s
[StackVM]     50K .......... .......... .......... .......... ..........  7% 9.04M 0s
[StackVM]    100K .......... .......... .......... .......... .......... 11% 40.4M 0s
[StackVM]    150K .......... .......... .......... .......... .......... 15% 10.7M 0s
[StackVM]    200K .......... .......... .......... .......... .......... 19% 20.1M 0s
[StackVM]    250K .......... .......... .......... .......... .......... 22% 49.9M 0s
[StackVM]    300K .......... .......... .......... .......... .......... 26% 6.81M 0s
[StackVM]    350K .......... .......... .......... .......... .......... 30% 90.1M 0s
[StackVM]    400K .......... .......... .......... .......... .......... 34% 35.1M 0s
[StackVM]    450K .......... .......... .......... .......... .......... 38% 10.5M 0s
[StackVM]    500K .......... .......... .......... .......... .......... 41% 14.7M 0s
[StackVM]    550K .......... .......... .......... .......... .......... 45% 39.2M 0s
[StackVM]    600K .......... .......... .......... .......... .......... 49% 24.1M 0s
[StackVM]    650K .......... .......... .......... .......... .......... 53% 14.7M 0s
[StackVM]    700K .......... .......... .......... .......... .......... 57% 10.4M 0s
[StackVM]    750K .......... .......... .......... .......... .......... 60% 8.23M 0s
[StackVM]    800K .......... .......... .......... .......... .......... 64% 71.4M 0s
[StackVM]    850K .......... .......... .......... .......... .......... 68% 16.2M 0s
[StackVM]    900K .......... .......... .......... .......... .......... 72% 69.9M 0s
[StackVM]    950K .......... .......... .......... .......... .......... 76% 16.2M 0s
[StackVM]   1000K .......... .......... .......... .......... .......... 80% 66.2M 0s
[StackVM]   1050K .......... .......... .......... .......... .......... 83% 18.0M 0s
[StackVM]   1100K .......... .......... .......... .......... .......... 87% 9.96M 0s
[StackVM]   1150K .......... .......... .......... .......... .......... 91% 31.8M 0s
[StackVM]   1200K .......... .......... .......... .......... .......... 95% 28.8M 0s
[StackVM]   1250K .......... .......... .......... .......... .......... 99% 13.8M 0s
[StackVM]   1300K .......... ..                                         100%  218M=0.08s
[StackVM] 
[StackVM] 2019-09-10 16:46:55 (16.1 MB/s) - 'pixman-0.34.0.zip' saved [1343558/1343558]
[StackVM] 
[StackVM] [ 39%] Generating build/third-party/pixman-0.34.0.done
[StackVM] Archive:  pixman-0.34.0.zip
[StackVM]   inflating: /builds/workspace/pharo-vm_headless/build/build/vm/libpixman-1.0.dylib  
[StackVM]   inflating: /builds/workspace/pharo-vm_headless/build/build/vm/libpixman-1.dylib  
[StackVM] [ 39%] Built target pixman-0.34.0
[StackVM] Scanning dependencies of target BitBltPlugin
[StackVM] [ 40%] Building C object CMakeFiles/BitBltPlugin.dir/extracted/plugins/BitBltPlugin/src/common/BitBltPlugin.c.o
[StackVM] [ 40%] Linking C shared library build/vm/libBitBltPlugin.dylib
[StackVM] [ 40%] Built target BitBltPlugin
[StackVM] Scanning dependencies of target libssh2-1.7.0
[StackVM] [ 40%] Generating build/third-party/libssh2-1.7.0.zip
[StackVM] --2019-09-10 16:46:57--  https://files.pharo.org/vm/pharo-spur64/mac/third-party/libssh2-1.7.0.zip
[StackVM] Resolving files.pharo.org... 164.132.235.17, 2001:41d0:301::23
[StackVM] Connecting to files.pharo.org|164.132.235.17|:443... connected.
[StackVM] HTTP request sent, awaiting response... 200 OK
[StackVM] Length: 184746 (180K) [application/zip]
[StackVM] Saving to: 'libssh2-1.7.0.zip'
[StackVM] 
[StackVM]      0K .......... .......... .......... .......... .......... 27% 4.18M 0s
[StackVM]     50K .......... .......... .......... .......... .......... 55% 9.10M 0s
[StackVM]    100K .......... .......... .......... .......... .......... 83% 22.4M 0s
[StackVM]    150K .......... .......... ..........                      100% 30.3M=0.02s
[StackVM] 
[StackVM] 2019-09-10 16:46:57 (8.72 MB/s) - 'libssh2-1.7.0.zip' saved [184746/184746]
[StackVM] 
[StackVM] [ 41%] Generating build/third-party/libssh2-1.7.0.done
[StackVM] Archive:  libssh2-1.7.0.zip
[StackVM]   inflating: /builds/workspace/pharo-vm_headless/build/build/vm/libssh2.1.dylib  
[StackVM]   inflating: /builds/workspace/pharo-vm_headless/build/build/vm/libssh2.dylib  
[StackVM] [ 41%] Built target libssh2-1.7.0
[StackVM] Scanning dependencies of target LargeIntegers
[StackVM] [ 42%] Building C object CMakeFiles/LargeIntegers.dir/extracted/plugins/LargeIntegers/src/common/LargeIntegers.c.o
[StackVM] [ 42%] Linking C shared library build/vm/libLargeIntegers.dylib
[StackVM] [ 42%] Built target LargeIntegers
[StackVM] Scanning dependencies of target openssl-1.0.2q
[StackVM] [ 43%] Generating build/third-party/openssl-1.0.2q.zip
[StackVM] --2019-09-10 16:46:58--  https://files.pharo.org/vm/pharo-spur64/mac/third-party/openssl-1.0.2q.zip
[StackVM] Resolving files.pharo.org... 164.132.235.17, 2001:41d0:301::23
[StackVM] Connecting to files.pharo.org|164.132.235.17|:443... connected.
[StackVM] HTTP request sent, awaiting response... 200 OK
[StackVM] Length: 1343688 (1.3M) [application/zip]
[StackVM] Saving to: 'openssl-1.0.2q.zip'
[StackVM] 
[StackVM]      0K .......... .......... .......... .......... ..........  3% 4.07M 0s
[StackVM]     50K .......... .......... .......... .......... ..........  7% 9.48M 0s
[StackVM]    100K .......... .......... .......... .......... .......... 11% 23.8M 0s
[StackVM]    150K .......... .......... .......... .......... .......... 15% 13.8M 0s
[StackVM]    200K .......... .......... .......... .......... .......... 19% 16.7M 0s
[StackVM]    250K .......... .......... .......... .......... .......... 22% 43.0M 0s
[StackVM]    300K .......... .......... .......... .......... .......... 26% 11.7M 0s
[StackVM]    350K .......... .......... .......... .......... .......... 30% 26.5M 0s
[StackVM]    400K .......... .......... .......... .......... .......... 34% 13.3M 0s
[StackVM]    450K .......... .......... .......... .......... .......... 38% 27.3M 0s
[StackVM]    500K .......... .......... .......... .......... .......... 41% 27.7M 0s
[StackVM]    550K .......... .......... .......... .......... .......... 45% 15.7M 0s
[StackVM]    600K .......... .......... .......... .......... .......... 49% 23.1M 0s
[StackVM]    650K .......... .......... .......... .......... .......... 53% 62.4M 0s
[StackVM]    700K .......... .......... .......... .......... .......... 57% 13.4M 0s
[StackVM]    750K .......... .......... .......... .......... .......... 60% 24.8M 0s
[StackVM]    800K .......... .......... .......... .......... .......... 64% 13.8M 0s
[StackVM]    850K .......... .......... .......... .......... .......... 68% 58.3M 0s
[StackVM]    900K .......... .......... .......... .......... .......... 72% 11.5M 0s
[StackVM]    950K .......... .......... .......... .......... .......... 76% 51.4M 0s
[StackVM]   1000K .......... .......... .......... .......... .......... 80% 41.1M 0s
[StackVM]   1050K .......... .......... .......... .......... .......... 83% 11.2M 0s
[StackVM]   1100K .......... .......... .......... .......... .......... 87% 52.6M 0s
[StackVM]   1150K .......... .......... .......... .......... .......... 91% 65.0M 0s
[StackVM]   1200K .......... .......... .......... .......... .......... 95% 10.3M 0s
[StackVM]   1250K .......... .......... .......... .......... .......... 99% 34.1M 0s
[StackVM]   1300K .......... ..                                         100% 32.3M=0.08s
[StackVM] 
[StackVM] 2019-09-10 16:46:58 (17.1 MB/s) - 'openssl-1.0.2q.zip' saved [1343688/1343688]
[StackVM] 
[StackVM] [ 44%] Generating build/third-party/openssl-1.0.2q.done
[StackVM] Archive:  openssl-1.0.2q.zip
[StackVM]   inflating: /builds/workspace/pharo-vm_headless/build/build/vm/libssl.1.0.0.dylib  
[StackVM]   inflating: /builds/workspace/pharo-vm_headless/build/build/vm/libssl.dylib  
[StackVM]   inflating: /builds/workspace/pharo-vm_headless/build/build/vm/libcrypto.1.0.0.dylib  
[StackVM] [ 44%] Built target openssl-1.0.2q
[StackVM] Scanning dependencies of target JPEGReadWriter2Plugin
[StackVM] [ 45%] Building C object CMakeFiles/JPEGReadWriter2Plugin.dir/extracted/plugins/JPEGReadWriter2Plugin/src/common/Error.c.o
[StackVM] [ 46%] Building C object CMakeFiles/JPEGReadWriter2Plugin.dir/extracted/plugins/JPEGReadWriter2Plugin/src/common/JPEGReadWriter2Plugin.c.o
[StackVM] [ 46%] Building C object CMakeFiles/JPEGReadWriter2Plugin.dir/extracted/plugins/JPEGReadWriter2Plugin/src/common/jcapimin.c.o
[StackVM] [ 47%] Building C object CMakeFiles/JPEGReadWriter2Plugin.dir/extracted/plugins/JPEGReadWriter2Plugin/src/common/jcapistd.c.o
[StackVM] [ 48%] Building C object CMakeFiles/JPEGReadWriter2Plugin.dir/extracted/plugins/JPEGReadWriter2Plugin/src/common/jccoefct.c.o
[StackVM] [ 49%] Building C object CMakeFiles/JPEGReadWriter2Plugin.dir/extracted/plugins/JPEGReadWriter2Plugin/src/common/jccolor.c.o
[StackVM] [ 49%] Building C object CMakeFiles/JPEGReadWriter2Plugin.dir/extracted/plugins/JPEGReadWriter2Plugin/src/common/jcdctmgr.c.o
[StackVM] [ 50%] Building C object CMakeFiles/JPEGReadWriter2Plugin.dir/extracted/plugins/JPEGReadWriter2Plugin/src/common/jchuff.c.o
[StackVM] [ 51%] Building C object CMakeFiles/JPEGReadWriter2Plugin.dir/extracted/plugins/JPEGReadWriter2Plugin/src/common/jcinit.c.o
[StackVM] [ 51%] Building C object CMakeFiles/JPEGReadWriter2Plugin.dir/extracted/plugins/JPEGReadWriter2Plugin/src/common/jcmainct.c.o
[StackVM] [ 52%] Building C object CMakeFiles/JPEGReadWriter2Plugin.dir/extracted/plugins/JPEGReadWriter2Plugin/src/common/jcmarker.c.o
[StackVM] [ 53%] Building C object CMakeFiles/JPEGReadWriter2Plugin.dir/extracted/plugins/JPEGReadWriter2Plugin/src/common/jcmaster.c.o
[StackVM] [ 53%] Building C object CMakeFiles/JPEGReadWriter2Plugin.dir/extracted/plugins/JPEGReadWriter2Plugin/src/common/jcomapi.c.o
[StackVM] [ 54%] Building C object CMakeFiles/JPEGReadWriter2Plugin.dir/extracted/plugins/JPEGReadWriter2Plugin/src/common/jcparam.c.o
[StackVM] [ 55%] Building C object CMakeFiles/JPEGReadWriter2Plugin.dir/extracted/plugins/JPEGReadWriter2Plugin/src/common/jcphuff.c.o
[StackVM] [ 56%] Building C object CMakeFiles/JPEGReadWriter2Plugin.dir/extracted/plugins/JPEGReadWriter2Plugin/src/common/jcprepct.c.o
[StackVM] [ 56%] Building C object CMakeFiles/JPEGReadWriter2Plugin.dir/extracted/plugins/JPEGReadWriter2Plugin/src/common/jcsample.c.o
[StackVM] [ 57%] Building C object CMakeFiles/JPEGReadWriter2Plugin.dir/extracted/plugins/JPEGReadWriter2Plugin/src/common/jctrans.c.o
[StackVM] [ 58%] Building C object CMakeFiles/JPEGReadWriter2Plugin.dir/extracted/plugins/JPEGReadWriter2Plugin/src/common/jdapimin.c.o
[StackVM] [ 58%] Building C object CMakeFiles/JPEGReadWriter2Plugin.dir/extracted/plugins/JPEGReadWriter2Plugin/src/common/jdapistd.c.o
[StackVM] [ 59%] Building C object CMakeFiles/JPEGReadWriter2Plugin.dir/extracted/plugins/JPEGReadWriter2Plugin/src/common/jdatadst.c.o
[StackVM] [ 60%] Building C object CMakeFiles/JPEGReadWriter2Plugin.dir/extracted/plugins/JPEGReadWriter2Plugin/src/common/jdatasrc.c.o
[StackVM] [ 60%] Building C object CMakeFiles/JPEGReadWriter2Plugin.dir/extracted/plugins/JPEGReadWriter2Plugin/src/common/jdcoefct.c.o
[StackVM] [ 61%] Building C object CMakeFiles/JPEGReadWriter2Plugin.dir/extracted/plugins/JPEGReadWriter2Plugin/src/common/jdcolor.c.o
[StackVM] [ 62%] Building C object CMakeFiles/JPEGReadWriter2Plugin.dir/extracted/plugins/JPEGReadWriter2Plugin/src/common/jddctmgr.c.o
[StackVM] [ 62%] Building C object CMakeFiles/JPEGReadWriter2Plugin.dir/extracted/plugins/JPEGReadWriter2Plugin/src/common/jdhuff.c.o
[StackVM] [ 63%] Building C object CMakeFiles/JPEGReadWriter2Plugin.dir/extracted/plugins/JPEGReadWriter2Plugin/src/common/jdinput.c.o
[StackVM] [ 64%] Building C object CMakeFiles/JPEGReadWriter2Plugin.dir/extracted/plugins/JPEGReadWriter2Plugin/src/common/jdmainct.c.o
[StackVM] [ 65%] Building C object CMakeFiles/JPEGReadWriter2Plugin.dir/extracted/plugins/JPEGReadWriter2Plugin/src/common/jdmarker.c.o
[StackVM] [ 65%] Building C object CMakeFiles/JPEGReadWriter2Plugin.dir/extracted/plugins/JPEGReadWriter2Plugin/src/common/jdmaster.c.o
[StackVM] [ 66%] Building C object CMakeFiles/JPEGReadWriter2Plugin.dir/extracted/plugins/JPEGReadWriter2Plugin/src/common/jdmerge.c.o
[StackVM] [ 67%] Building C object CMakeFiles/JPEGReadWriter2Plugin.dir/extracted/plugins/JPEGReadWriter2Plugin/src/common/jdphuff.c.o
[StackVM] [ 67%] Building C object CMakeFiles/JPEGReadWriter2Plugin.dir/extracted/plugins/JPEGReadWriter2Plugin/src/common/jdpostct.c.o
[StackVM] [ 68%] Building C object CMakeFiles/JPEGReadWriter2Plugin.dir/extracted/plugins/JPEGReadWriter2Plugin/src/common/jdsample.c.o
[StackVM] [ 69%] Building C object CMakeFiles/JPEGReadWriter2Plugin.dir/extracted/plugins/JPEGReadWriter2Plugin/src/common/jdtrans.c.o
[StackVM] [ 69%] Building C object CMakeFiles/JPEGReadWriter2Plugin.dir/extracted/plugins/JPEGReadWriter2Plugin/src/common/jerror.c.o
[StackVM] [ 70%] Building C object CMakeFiles/JPEGReadWriter2Plugin.dir/extracted/plugins/JPEGReadWriter2Plugin/src/common/jfdctflt.c.o
[StackVM] [ 71%] Building C object CMakeFiles/JPEGReadWriter2Plugin.dir/extracted/plugins/JPEGReadWriter2Plugin/src/common/jfdctfst.c.o
[StackVM] [ 71%] Building C object CMakeFiles/JPEGReadWriter2Plugin.dir/extracted/plugins/JPEGReadWriter2Plugin/src/common/jfdctint.c.o
[StackVM] [ 72%] Building C object CMakeFiles/JPEGReadWriter2Plugin.dir/extracted/plugins/JPEGReadWriter2Plugin/src/common/jidctflt.c.o
[StackVM] [ 73%] Building C object CMakeFiles/JPEGReadWriter2Plugin.dir/extracted/plugins/JPEGReadWriter2Plugin/src/common/jidctfst.c.o
[StackVM] [ 74%] Building C object CMakeFiles/JPEGReadWriter2Plugin.dir/extracted/plugins/JPEGReadWriter2Plugin/src/common/jidctint.c.o
[StackVM] [ 74%] Building C object CMakeFiles/JPEGReadWriter2Plugin.dir/extracted/plugins/JPEGReadWriter2Plugin/src/common/jidctred.c.o
[StackVM] [ 75%] Building C object CMakeFiles/JPEGReadWriter2Plugin.dir/extracted/plugins/JPEGReadWriter2Plugin/src/common/jmemdatadst.c.o
[StackVM] [ 76%] Building C object CMakeFiles/JPEGReadWriter2Plugin.dir/extracted/plugins/JPEGReadWriter2Plugin/src/common/jmemdatasrc.c.o
[StackVM] [ 76%] Building C object CMakeFiles/JPEGReadWriter2Plugin.dir/extracted/plugins/JPEGReadWriter2Plugin/src/common/jmemmgr.c.o
[StackVM] [ 77%] Building C object CMakeFiles/JPEGReadWriter2Plugin.dir/extracted/plugins/JPEGReadWriter2Plugin/src/common/jmemnobs.c.o
[StackVM] [ 78%] Building C object CMakeFiles/JPEGReadWriter2Plugin.dir/extracted/plugins/JPEGReadWriter2Plugin/src/common/jquant1.c.o
[StackVM] [ 78%] Building C object CMakeFiles/JPEGReadWriter2Plugin.dir/extracted/plugins/JPEGReadWriter2Plugin/src/common/jquant2.c.o
[StackVM] [ 79%] Building C object CMakeFiles/JPEGReadWriter2Plugin.dir/extracted/plugins/JPEGReadWriter2Plugin/src/common/jutils.c.o
[StackVM] [ 80%] Building C object CMakeFiles/JPEGReadWriter2Plugin.dir/extracted/plugins/JPEGReadWriter2Plugin/src/common/sqJPEGReadWriter2Plugin.c.o
[StackVM] [ 81%] Linking C shared library build/vm/libJPEGReadWriter2Plugin.dylib
[StackVM] [ 81%] Built target JPEGReadWriter2Plugin
[StackVM] Scanning dependencies of target FileAttributesPlugin
[StackVM] [ 81%] Building C object CMakeFiles/FileAttributesPlugin.dir/extracted/plugins/FileAttributesPlugin/src/common/FileAttributesPlugin.c.o
[StackVM] [ 82%] Building C object CMakeFiles/FileAttributesPlugin.dir/extracted/plugins/FileAttributesPlugin/src/common/faCommon.c.o
[StackVM] [ 83%] Building C object CMakeFiles/FileAttributesPlugin.dir/extracted/plugins/FileAttributesPlugin/src/unix/faSupport.c.o
[StackVM] [ 83%] Linking C shared library build/vm/libFileAttributesPlugin.dylib
[StackVM] [ 83%] Built target FileAttributesPlugin
[StackVM] Scanning dependencies of target libpng-1.2.49
[StackVM] [ 84%] Generating build/third-party/libpng-1.2.49.zip
[StackVM] --2019-09-10 16:47:07--  https://files.pharo.org/vm/pharo-spur64/mac/third-party/libpng-1.2.49.zip
[StackVM] Resolving files.pharo.org... 164.132.235.17, 2001:41d0:301::23
[StackVM] Connecting to files.pharo.org|164.132.235.17|:443... connected.
[StackVM] HTTP request sent, awaiting response... 200 OK
[StackVM] Length: 148996 (146K) [application/zip]
[StackVM] Saving to: 'libpng-1.2.49.zip'
[StackVM] 
[StackVM]      0K .......... .......... .......... .......... .......... 34% 4.37M 0s
[StackVM]     50K .......... .......... .......... .......... .......... 68% 9.01M 0s
[StackVM]    100K .......... .......... .......... .......... .....     100% 29.3M=0.02s
[StackVM] 
[StackVM] 2019-09-10 16:47:08 (7.85 MB/s) - 'libpng-1.2.49.zip' saved [148996/148996]
[StackVM] 
[StackVM] [ 84%] Generating build/third-party/libpng-1.2.49.done
[StackVM] Archive:  libpng-1.2.49.zip
[StackVM]   inflating: /builds/workspace/pharo-vm_headless/build/build/vm/libpng12.0.dylib  
[StackVM]   inflating: /builds/workspace/pharo-vm_headless/build/build/vm/libpng12.dylib  
[StackVM] [ 84%] Built target libpng-1.2.49
[StackVM] Scanning dependencies of target IA32ABI
[StackVM] [ 84%] Building C object CMakeFiles/IA32ABI.dir/extracted/plugins/IA32ABI/src/common/IA32ABI.c.o
[StackVM] /builds/workspace/pharo-vm_headless/repository/extracted/plugins/IA32ABI/src/common/IA32ABI.c:748:24: warning: incompatible integer to pointer conversion passing 'sqInt' (aka 'long') to parameter of type 'const void *' [-Wint-conversion]
[StackVM]         memcpy((&floatValue), addr, sizeof(floatValue));
[StackVM]                               ^~~~
[StackVM] /usr/include/secure/_string.h:65:33: note: expanded from macro 'memcpy'
[StackVM]   __builtin___memcpy_chk (dest, src, len, __darwin_obsz0 (dest))
[StackVM]                                 ^
[StackVM] /builds/workspace/pharo-vm_headless/repository/extracted/plugins/IA32ABI/src/common/IA32ABI.c:795:9: warning: incompatible integer to pointer conversion passing 'sqInt' (aka 'long') to parameter of type 'const void *' [-Wint-conversion]
[StackVM]         memcpy(addr, (&floatValue), sizeof(floatValue));
[StackVM]                ^~~~
[StackVM] /usr/include/secure/_string.h:65:59: note: expanded from macro 'memcpy'
[StackVM]   __builtin___memcpy_chk (dest, src, len, __darwin_obsz0 (dest))
[StackVM]                                                           ^
[StackVM] /usr/include/secure/_common.h:38:55: note: expanded from macro '__darwin_obsz0'
[StackVM] #define __darwin_obsz0(object) __builtin_object_size (object, 0)
[StackVM]                                                       ^
[StackVM] /builds/workspace/pharo-vm_headless/repository/extracted/plugins/IA32ABI/src/common/IA32ABI.c:795:9: warning: incompatible integer to pointer conversion passing 'sqInt' (aka 'long') to parameter of type 'void *' [-Wint-conversion]
[StackVM]         memcpy(addr, (&floatValue), sizeof(floatValue));
[StackVM]                ^~~~
[StackVM] /usr/include/secure/_string.h:65:27: note: expanded from macro 'memcpy'
[StackVM]   __builtin___memcpy_chk (dest, src, len, __darwin_obsz0 (dest))
[StackVM]                           ^
[StackVM] /builds/workspace/pharo-vm_headless/repository/extracted/plugins/IA32ABI/src/common/IA32ABI.c:840:24: warning: incompatible integer to pointer conversion passing 'sqInt' (aka 'long') to parameter of type 'const void *' [-Wint-conversion]
[StackVM]         memcpy((&floatValue), addr, sizeof(floatValue));
[StackVM]                               ^~~~
[StackVM] /usr/include/secure/_string.h:65:33: note: expanded from macro 'memcpy'
[StackVM]   __builtin___memcpy_chk (dest, src, len, __darwin_obsz0 (dest))
[StackVM]                                 ^
[StackVM] /builds/workspace/pharo-vm_headless/repository/extracted/plugins/IA32ABI/src/common/IA32ABI.c:887:9: warning: incompatible integer to pointer conversion passing 'sqInt' (aka 'long') to parameter of type 'const void *' [-Wint-conversion]
[StackVM]         memcpy(addr, (&floatValue), sizeof(floatValue));
[StackVM]                ^~~~
[StackVM] /usr/include/secure/_string.h:65:59: note: expanded from macro 'memcpy'
[StackVM]   __builtin___memcpy_chk (dest, src, len, __darwin_obsz0 (dest))
[StackVM]                                                           ^
[StackVM] /usr/include/secure/_common.h:38:55: note: expanded from macro '__darwin_obsz0'
[StackVM] #define __darwin_obsz0(object) __builtin_object_size (object, 0)
[StackVM]                                                       ^
[StackVM] /builds/workspace/pharo-vm_headless/repository/extracted/plugins/IA32ABI/src/common/IA32ABI.c:887:9: warning: incompatible integer to pointer conversion passing 'sqInt' (aka 'long') to parameter of type 'void *' [-Wint-conversion]
[StackVM]         memcpy(addr, (&floatValue), sizeof(floatValue));
[StackVM]                ^~~~
[StackVM] /usr/include/secure/_string.h:65:27: note: expanded from macro 'memcpy'
[StackVM]   __builtin___memcpy_chk (dest, src, len, __darwin_obsz0 (dest))
[StackVM]                           ^
[StackVM] /builds/workspace/pharo-vm_headless/repository/extracted/plugins/IA32ABI/src/common/IA32ABI.c:2253:34: warning: incompatible pointer types assigning to 'sqInt (*)(sqInt, VMCallbackContext *, sqInt)' from 'sqInt (*)(int, vmccp, sqInt)' [-Wincompatible-pointer-types]
[StackVM]                 returnAsThroughCallbackContext = interpreterProxy->returnAsThroughCallbackContext;
[StackVM]                                                ^ ~~~~~~~~~~~~~~~~~~~~~~~~~~~~~~~~~~~~~~~~~~~~~~~~
[StackVM] 7 warnings generated.
[StackVM] [ 85%] Building C object CMakeFiles/IA32ABI.dir/extracted/plugins/IA32ABI/src/common/AlienSUnitTestProcedures.c.o
[StackVM] [ 86%] Building C object CMakeFiles/IA32ABI.dir/extracted/plugins/IA32ABI/src/common/xabicc.c.o
[StackVM] In file included from /builds/workspace/pharo-vm_headless/repository/extracted/plugins/IA32ABI/src/common/xabicc.c:16:
[StackVM] /builds/workspace/pharo-vm_headless/repository/extracted/plugins/IA32ABI/src/common/x64sysvabicc.c:283:18: warning: implicit declaration of function 'getpagesize' is invalid in C99 [-Wimplicit-function-declaration]
[StackVM]         long pagesize = getpagesize();
[StackVM]                         ^
[StackVM] 1 warning generated.
[StackVM] [ 86%] Linking C shared library build/vm/libIA32ABI.dylib
[StackVM] [ 86%] Built target IA32ABI
[StackVM] Scanning dependencies of target SecurityPlugin
[StackVM] [ 87%] Building C object CMakeFiles/SecurityPlugin.dir/plugins/SecurityPlugin/common/DummySecurityPlugin.c.o
[StackVM] [ 87%] Linking C shared library build/vm/libSecurityPlugin.dylib
[StackVM] [ 87%] Built target SecurityPlugin
[StackVM] Scanning dependencies of target LocalePlugin
[StackVM] [ 88%] Building C object CMakeFiles/LocalePlugin.dir/extracted/plugins/LocalePlugin/src/common/LocalePlugin.c.o
[StackVM] [ 89%] Building C object CMakeFiles/LocalePlugin.dir/extracted/plugins/LocalePlugin/src/osx/sqIOSLocale.c.o
[StackVM] /builds/workspace/pharo-vm_headless/repository/extracted/plugins/LocalePlugin/src/osx/sqIOSLocale.c:133:17: warning: incompatible integer to pointer conversion passing 'time_t' (aka 'long') to parameter of type 'time_t *' (aka 'long *') [-Wint-conversion]
[StackVM]         theTime = time((time_t)NULL);
[StackVM]                        ^~~~~~~~~~~~
[StackVM] /usr/include/time.h:118:21: note: passing argument to parameter here
[StackVM] time_t time(time_t *);
[StackVM]                     ^
[StackVM] 1 warning generated.
[StackVM] [ 89%] Linking C shared library build/vm/libLocalePlugin.dylib
[StackVM] [ 89%] Built target LocalePlugin
[StackVM] Scanning dependencies of target SurfacePlugin
[StackVM] [ 90%] Building C object CMakeFiles/SurfacePlugin.dir/extracted/plugins/SurfacePlugin/src/common/SurfacePlugin.c.o
[StackVM] /builds/workspace/pharo-vm_headless/repository/extracted/plugins/SurfacePlugin/src/common/SurfacePlugin.c:135:3: warning: expression result unused [-Wunused-value]
[StackVM]                 -1;
[StackVM]                 ^~
[StackVM] 1 warning generated.
[StackVM] [ 90%] Linking C shared library build/vm/libSurfacePlugin.dylib
[StackVM] [ 90%] Built target SurfacePlugin
[StackVM] Scanning dependencies of target DSAPrims
[StackVM] [ 91%] Building C object CMakeFiles/DSAPrims.dir/extracted/plugins/DSAPrims/src/common/DSAPrims.c.o
[StackVM] [ 92%] Linking C shared library build/vm/libDSAPrims.dylib
[StackVM] [ 92%] Built target DSAPrims
[StackVM] Scanning dependencies of target SocketPlugin
[StackVM] [ 93%] Building C object CMakeFiles/SocketPlugin.dir/extracted/plugins/SocketPlugin/src/common/SocketPlugin.c.o
[StackVM] /builds/workspace/pharo-vm_headless/repository/extracted/plugins/SocketPlugin/src/common/SocketPlugin.c:2399:3: warning: pointer/integer type mismatch in conditional expression ('SocketPtr' (aka 'SQSocket *') and 'int') [-Wconditional-type-mismatch]
[StackVM]                 ? ((SocketPtr) (firstIndexableField(socketOop)))
[StackVM]                 ^ ~~~~~~~~~~~~~~~~~~~~~~~~~~~~~~~~~~~~~~~~~~~~~~
[StackVM] 1 warning generated.
[StackVM] [ 94%] Building C object CMakeFiles/SocketPlugin.dir/extracted/plugins/SocketPlugin/src/unix/sqUnixSocket.c.o
[StackVM] [ 94%] Linking C shared library build/vm/libSocketPlugin.dylib
[StackVM] [ 94%] Built target SocketPlugin
[StackVM] Scanning dependencies of target UUIDPlugin
[StackVM] [ 95%] Building C object CMakeFiles/UUIDPlugin.dir/plugins/UUIDPlugin/common/UUIDPlugin.c.o
[StackVM] /builds/workspace/pharo-vm_headless/repository/plugins/UUIDPlugin/common/UUIDPlugin.c:110:1: warning: control reaches end of non-void function [-Wreturn-type]
[StackVM] }
[StackVM] ^
[StackVM] 1 warning generated.
[StackVM] [ 96%] Linking C shared library build/vm/libUUIDPlugin.dylib
[StackVM] [ 96%] Built target UUIDPlugin
[StackVM] Scanning dependencies of target SqueakFFIPrims
[StackVM] [ 97%] Building C object CMakeFiles/SqueakFFIPrims.dir/extracted/plugins/SqueakFFIPrims/src/common/SqueakFFIPrims.c.o
[StackVM] In file included from /builds/workspace/pharo-vm_headless/repository/extracted/plugins/SqueakFFIPrims/src/common/SqueakFFIPrims.c:23:
[StackVM] /builds/workspace/pharo-vm_headless/repository/extracted/plugins/SqueakFFIPrims/src/common/X64SysVFFIPlugin.c:903:19: warning: incompatible pointer to integer conversion passing 'void *' to parameter of type 'sqInt' (aka 'long') [-Wint-conversion]
[StackVM]                         if (isInMemory(ptrAddress)) {
[StackVM]                                        ^~~~~~~~~~
[StackVM] /builds/workspace/pharo-vm_headless/repository/extracted/plugins/SqueakFFIPrims/src/common/X64SysVFFIPlugin.c:1156:19: warning: incompatible pointer to integer conversion passing 'void *' to parameter of type 'sqInt' (aka 'long') [-Wint-conversion]
[StackVM]                         if (isInMemory(ptrAddress)) {
[StackVM]                                        ^~~~~~~~~~
[StackVM] /builds/workspace/pharo-vm_headless/repository/extracted/plugins/SqueakFFIPrims/src/common/X64SysVFFIPlugin.c:2984:18: warning: incompatible pointer to integer conversion passing 'void *' to parameter of type 'sqInt' (aka 'long') [-Wint-conversion]
[StackVM]                 if (isInMemory(ptrAddress)) {
[StackVM]                                ^~~~~~~~~~
[StackVM] /builds/workspace/pharo-vm_headless/repository/extracted/plugins/SqueakFFIPrims/src/common/X64SysVFFIPlugin.c:3037:14: warning: incompatible integer to pointer conversion assigning to 'void *' from 'long' [-Wint-conversion]
[StackVM]                 ptrAddress = ((longAt(oop + BaseHeaderSize)) > 0
[StackVM]                            ^ ~~~~~~~~~~~~~~~~~~~~~~~~~~~~~~~~~~~
[StackVM] /builds/workspace/pharo-vm_headless/repository/extracted/plugins/SqueakFFIPrims/src/common/X64SysVFFIPlugin.c:3277:18: warning: incompatible pointer to integer conversion passing 'void *' to parameter of type 'sqInt' (aka 'long') [-Wint-conversion]
[StackVM]                 if (isInMemory(ptrAddress)) {
[StackVM]                                ^~~~~~~~~~
[StackVM] /builds/workspace/pharo-vm_headless/repository/extracted/plugins/SqueakFFIPrims/src/common/X64SysVFFIPlugin.c:3530:18: warning: incompatible pointer to integer conversion passing 'void *' to parameter of type 'sqInt' (aka 'long') [-Wint-conversion]
[StackVM]                 if (isInMemory(ptrAddress)) {
[StackVM]                                ^~~~~~~~~~
[StackVM] /builds/workspace/pharo-vm_headless/repository/extracted/plugins/SqueakFFIPrims/src/common/X64SysVFFIPlugin.c:6596:21: warning: incompatible pointer types assigning to 'sqInt (*)(sqInt)' from 'sqInt (*)(int)' [-Wincompatible-pointer-types]
[StackVM]                 characterObjectOf = interpreterProxy->characterObjectOf;
[StackVM]                                   ^ ~~~~~~~~~~~~~~~~~~~~~~~~~~~~~~~~~~~
[StackVM] 7 warnings generated.
[StackVM] [ 98%] Building C object CMakeFiles/SqueakFFIPrims.dir/extracted/plugins/SqueakFFIPrims/src/common/sqManualSurface.c.o
[StackVM] [ 98%] Building C object CMakeFiles/SqueakFFIPrims.dir/extracted/plugins/SqueakFFIPrims/src/common/sqFFIPlugin.c.o
[StackVM] [ 99%] Building C object CMakeFiles/SqueakFFIPrims.dir/extracted/plugins/SqueakFFIPrims/src/common/sqFFITestFuncs.c.o
[StackVM] [100%] Linking C shared library build/vm/libSqueakFFIPrims.dylib
[StackVM] [100%] Built target SqueakFFIPrims
[StackVM] Install the project...
[StackVM] -- Install configuration: ""
[StackVM] -- Installing: /builds/workspace/pharo-vm_headless/build/build/dist/Pharo.app/Contents/MacOS
[StackVM] -- Installing: /builds/workspace/pharo-vm_headless/build/build/dist/Pharo.app/Contents/MacOS/Pharo
[StackVM] -- Installing: /builds/workspace/pharo-vm_headless/build/build/dist/Pharo.app/Contents/MacOS/Plugins
[StackVM] -- Installing: /builds/workspace/pharo-vm_headless/build/build/dist/Pharo.app/Contents/MacOS/Plugins/libB2DPlugin.dylib
[StackVM] -- Installing: /builds/workspace/pharo-vm_headless/build/build/dist/Pharo.app/Contents/MacOS/Plugins/libBitBltPlugin.dylib
[StackVM] -- Installing: /builds/workspace/pharo-vm_headless/build/build/dist/Pharo.app/Contents/MacOS/Plugins/libcairo.2.dylib
[StackVM] -- Installing: /builds/workspace/pharo-vm_headless/build/build/dist/Pharo.app/Contents/MacOS/Plugins/libcairo.dylib
[StackVM] -- Installing: /builds/workspace/pharo-vm_headless/build/build/dist/Pharo.app/Contents/MacOS/Plugins/libcrypto.1.0.0.dylib
[StackVM] -- Installing: /builds/workspace/pharo-vm_headless/build/build/dist/Pharo.app/Contents/MacOS/Plugins/libDSAPrims.dylib
[StackVM] -- Installing: /builds/workspace/pharo-vm_headless/build/build/dist/Pharo.app/Contents/MacOS/Plugins/libffi.7.dylib
[StackVM] -- Installing: /builds/workspace/pharo-vm_headless/build/build/dist/Pharo.app/Contents/MacOS/Plugins/libFileAttributesPlugin.dylib
[StackVM] -- Installing: /builds/workspace/pharo-vm_headless/build/build/dist/Pharo.app/Contents/MacOS/Plugins/libFilePlugin.dylib
[StackVM] -- Installing: /builds/workspace/pharo-vm_headless/build/build/dist/Pharo.app/Contents/MacOS/Plugins/libfreetype.6.dylib
[StackVM] -- Installing: /builds/workspace/pharo-vm_headless/build/build/dist/Pharo.app/Contents/MacOS/Plugins/libfreetype.dylib
[StackVM] -- Installing: /builds/workspace/pharo-vm_headless/build/build/dist/Pharo.app/Contents/MacOS/Plugins/libgit2.0.25.1.dylib
[StackVM] -- Installing: /builds/workspace/pharo-vm_headless/build/build/dist/Pharo.app/Contents/MacOS/Plugins/libgit2.25.dylib
[StackVM] -- Installing: /builds/workspace/pharo-vm_headless/build/build/dist/Pharo.app/Contents/MacOS/Plugins/libgit2.dylib
[StackVM] -- Installing: /builds/workspace/pharo-vm_headless/build/build/dist/Pharo.app/Contents/MacOS/Plugins/libIA32ABI.dylib
[StackVM] -- Installing: /builds/workspace/pharo-vm_headless/build/build/dist/Pharo.app/Contents/MacOS/Plugins/libJPEGReaderPlugin.dylib
[StackVM] -- Installing: /builds/workspace/pharo-vm_headless/build/build/dist/Pharo.app/Contents/MacOS/Plugins/libJPEGReadWriter2Plugin.dylib
[StackVM] -- Installing: /builds/workspace/pharo-vm_headless/build/build/dist/Pharo.app/Contents/MacOS/Plugins/libLargeIntegers.dylib
[StackVM] -- Installing: /builds/workspace/pharo-vm_headless/build/build/dist/Pharo.app/Contents/MacOS/Plugins/libLocalePlugin.dylib
[StackVM] -- Installing: /builds/workspace/pharo-vm_headless/build/build/dist/Pharo.app/Contents/MacOS/Plugins/libMiscPrimitivePlugin.dylib
[StackVM] -- Installing: /builds/workspace/pharo-vm_headless/build/build/dist/Pharo.app/Contents/MacOS/Plugins/libPharoVMCore.dylib
[StackVM] -- Installing: /builds/workspace/pharo-vm_headless/build/build/dist/Pharo.app/Contents/MacOS/Plugins/libpixman-1.0.dylib
[StackVM] -- Installing: /builds/workspace/pharo-vm_headless/build/build/dist/Pharo.app/Contents/MacOS/Plugins/libpixman-1.dylib
[StackVM] -- Installing: /builds/workspace/pharo-vm_headless/build/build/dist/Pharo.app/Contents/MacOS/Plugins/libpng12.0.dylib
[StackVM] -- Installing: /builds/workspace/pharo-vm_headless/build/build/dist/Pharo.app/Contents/MacOS/Plugins/libpng12.dylib
[StackVM] -- Installing: /builds/workspace/pharo-vm_headless/build/build/dist/Pharo.app/Contents/MacOS/Plugins/libPThreadedPlugin.dylib
[StackVM] -- Installing: /builds/workspace/pharo-vm_headless/build/build/dist/Pharo.app/Contents/MacOS/Plugins/libSDL2-2.0.0.dylib
[StackVM] -- Installing: /builds/workspace/pharo-vm_headless/build/build/dist/Pharo.app/Contents/MacOS/Plugins/libSDL2.dylib
[StackVM] -- Installing: /builds/workspace/pharo-vm_headless/build/build/dist/Pharo.app/Contents/MacOS/Plugins/libSecurityPlugin.dylib
[StackVM] -- Installing: /builds/workspace/pharo-vm_headless/build/build/dist/Pharo.app/Contents/MacOS/Plugins/libSocketPlugin.dylib
[StackVM] -- Installing: /builds/workspace/pharo-vm_headless/build/build/dist/Pharo.app/Contents/MacOS/Plugins/libSqueakFFIPrims.dylib
[StackVM] -- Installing: /builds/workspace/pharo-vm_headless/build/build/dist/Pharo.app/Contents/MacOS/Plugins/libSqueakSSL.dylib
[StackVM] -- Installing: /builds/workspace/pharo-vm_headless/build/build/dist/Pharo.app/Contents/MacOS/Plugins/libssh2.1.dylib
[StackVM] -- Installing: /builds/workspace/pharo-vm_headless/build/build/dist/Pharo.app/Contents/MacOS/Plugins/libssh2.dylib
[StackVM] -- Installing: /builds/workspace/pharo-vm_headless/build/build/dist/Pharo.app/Contents/MacOS/Plugins/libssl.1.0.0.dylib
[StackVM] -- Installing: /builds/workspace/pharo-vm_headless/build/build/dist/Pharo.app/Contents/MacOS/Plugins/libssl.dylib
[StackVM] -- Installing: /builds/workspace/pharo-vm_headless/build/build/dist/Pharo.app/Contents/MacOS/Plugins/libSurfacePlugin.dylib
[StackVM] -- Installing: /builds/workspace/pharo-vm_headless/build/build/dist/Pharo.app/Contents/MacOS/Plugins/libUnixOSProcessPlugin.dylib
[StackVM] -- Installing: /builds/workspace/pharo-vm_headless/build/build/dist/Pharo.app/Contents/MacOS/Plugins/libUUIDPlugin.dylib
[StackVM] -- Installing: /builds/workspace/pharo-vm_headless/build/build/dist/Pharo.app/Contents/Info.plist
[StackVM] -- Installing: /builds/workspace/pharo-vm_headless/build/build/dist/Pharo.app/Contents/Resources/Pharo.icns
[StackVM] -- Installing: /builds/workspace/pharo-vm_headless/build/build/dist/include/sq.h
[StackVM] -- Installing: /builds/workspace/pharo-vm_headless/build/build/dist/include/sqMemoryAccess.h
[StackVM] -- Installing: /builds/workspace/pharo-vm_headless/build/build/dist/include/sqVirtualMachine.h
[StackVM] -- Installing: /builds/workspace/pharo-vm_headless/build/build/dist/include/interp.h
[StackVM] -- Installing: /builds/workspace/pharo-vm_headless/build/build/dist/include/vmCallback.h
[StackVM] -- Installing: /builds/workspace/pharo-vm_headless/build/build/dist/include/config.h
[Pipeline] [StackVM] sh
[StackVM] + make package
[StackVM] [ 13%] Built target PharoVMCore
[StackVM] [ 16%] Built target Pharo
[StackVM] [ 18%] Built target SDL2-2.0.7
[StackVM] [ 20%] Built target libgit2-0.25.1
[StackVM] [ 22%] Built target freetype-2.9.1
[StackVM] [ 24%] Built target SqueakSSL
[StackVM] [ 25%] Built target cairo-1.15.4
[StackVM] [ 26%] Built target B2DPlugin
[StackVM] [ 28%] Built target pthreadedPlugin-0.0.1
[StackVM] [ 33%] Built target FilePlugin
[StackVM] [ 34%] Built target UnixOSProcessPlugin
[StackVM] [ 35%] Built target libffi-3.3-rc0
[StackVM] [ 37%] Built target MiscPrimitivePlugin
[StackVM] [ 38%] Built target JPEGReaderPlugin
[StackVM] [ 39%] Built target pixman-0.34.0
[StackVM] [ 40%] Built target BitBltPlugin
[StackVM] [ 41%] Built target libssh2-1.7.0
[StackVM] [ 42%] Built target LargeIntegers
[StackVM] [ 44%] Built target openssl-1.0.2q
[StackVM] [ 81%] Built target JPEGReadWriter2Plugin
[StackVM] [ 83%] Built target FileAttributesPlugin
[StackVM] [ 84%] Built target libpng-1.2.49
[StackVM] [ 86%] Built target IA32ABI
[StackVM] [ 87%] Built target SecurityPlugin
[StackVM] [ 89%] Built target LocalePlugin
[StackVM] [ 90%] Built target SurfacePlugin
[StackVM] [ 92%] Built target DSAPrims
[StackVM] [ 94%] Built target SocketPlugin
[StackVM] [ 96%] Built target UUIDPlugin
[StackVM] [100%] Built target SqueakFFIPrims
[StackVM] Run CPack packaging tool...
[StackVM] CPack: Create package using ZIP
[StackVM] CPack: Install projects
[StackVM] CPack: - Run preinstall target for: PharoVM
[StackVM] CPack: - Install project: PharoVM
[StackVM] CPack: -   Install component: bin
[StackVM] CPack: -   Install component: include
[StackVM] CPack: Create package
[StackVM] CPack: - package: /builds/workspace/pharo-vm_headless/build/build/packages/PharoVM-8.1.0-42f33b4-mac64-bin.zip generated.
[StackVM] CPack: - checksum file: /builds/workspace/pharo-vm_headless/build/build/packages/PharoVM-8.1.0-42f33b4-mac64-bin.zip.sha1 generated.
[StackVM] CPack: - package: /builds/workspace/pharo-vm_headless/build/build/packages/PharoVM-8.1.0-42f33b4-mac64-include.zip generated.
[StackVM] CPack: - checksum file: /builds/workspace/pharo-vm_headless/build/build/packages/PharoVM-8.1.0-42f33b4-mac64-include.zip.sha1 generated.
[Pipeline] [StackVM] }
[Pipeline] [StackVM] // dir
[Pipeline] [StackVM] stash
[StackVM] Stashed 4 file(s)
[Pipeline] [StackVM] archiveArtifacts
[StackVM] Archiving artifacts
[Pipeline] [StackVM] }
[Pipeline] [StackVM] // stage
[Pipeline] [StackVM] }
[Pipeline] [StackVM] // timeout
[Pipeline] [StackVM] }
[Pipeline] [StackVM] // node
[Pipeline] [StackVM] }
[Pipeline] // parallel
[Pipeline] End of Pipeline

GitHub has been notified of this commit’s build result

ERROR: script returned exit code 2
Finished: FAILURE