FailedConsole Output

Started by an SCM change
Building remotely on pharo-contribution-linux64 (linux 64 32) in workspace /builds/workspace/BuildingUIWithSpec
[WS-CLEANUP] Deleting project workspace...
Cloning the remote Git repository
Cloning repository https://github.com/SquareBracketAssociates/BuildingUIWithSpec
 > git init /builds/workspace/BuildingUIWithSpec # timeout=10
Fetching upstream changes from https://github.com/SquareBracketAssociates/BuildingUIWithSpec
 > git --version # timeout=10
 > git fetch --tags --progress https://github.com/SquareBracketAssociates/BuildingUIWithSpec +refs/heads/*:refs/remotes/origin/*
 > git config remote.origin.url https://github.com/SquareBracketAssociates/BuildingUIWithSpec # timeout=10
 > git config --add remote.origin.fetch +refs/heads/*:refs/remotes/origin/* # timeout=10
 > git config remote.origin.url https://github.com/SquareBracketAssociates/BuildingUIWithSpec # timeout=10
Fetching upstream changes from https://github.com/SquareBracketAssociates/BuildingUIWithSpec
 > git fetch --tags --progress https://github.com/SquareBracketAssociates/BuildingUIWithSpec +refs/heads/*:refs/remotes/origin/*
 > git rev-parse refs/remotes/origin/master^{commit} # timeout=10
 > git rev-parse refs/remotes/origin/origin/master^{commit} # timeout=10
Checking out Revision 91655a7b6a3c749fae79b63a8558bf0596e80d2f (refs/remotes/origin/master)
 > git config core.sparsecheckout # timeout=10
 > git checkout -f 91655a7b6a3c749fae79b63a8558bf0596e80d2f
 > git rev-list 707ac5a2b4bec380b6675475fe8833da8310ffdb # timeout=10
[BuildingUIWithSpec] $ /bin/sh -xe /tmp/hudson2159647080613829081.sh
+ git log -n 10
+ tar zcf .BuildingUIWithSpec-src.tgz AdvancedWidgets BuildingUIWithSpec.gitlog DynamicSpec FirstContact Intro LayoutsContruction Makefile ManagingWindow Patterns README.md Reuse SpecBooklet.pillar ThreePillarsOfSpec TipsAndTricks copySupport.mk cover figures material mustache pillar.conf subdownload.sh support
+ mv .BuildingUIWithSpec-src.tgz BuildingUIWithSpec-src.tgz
+ ./subdownload.sh
--2018-11-02 23:04:14--  http://get.pharo.org/vm50
Resolving get.pharo.org (get.pharo.org)... 164.132.235.17, 2001:41d0:301::23
Connecting to get.pharo.org (get.pharo.org)|164.132.235.17|:80... connected.
HTTP request sent, awaiting response... 200 OK
Length: 5822 (5.7K) [application/octet-stream]
Saving to: ‘STDOUT’

     0K .....                                                 100%  661M=0s

2018-11-02 23:04:14 (661 MB/s) - written to stdout [5822/5822]

Downloading the latest pharoVM:
	http://files.pharo.org/get-files/50/pharo-linux-stable.zip
pharo-vm/pharo
Downloading PharoV50.sources:
	http://files.pharo.org/get-files/50/sources.zip
Creating starter scripts pharo and pharo-ui
--2018-11-02 23:04:15--  https://github.com/pillar-markup/pillar/releases/download/v5.0/Pillar-deployment50.zip
Resolving github.com (github.com)... 192.30.253.113, 192.30.253.112
Connecting to github.com (github.com)|192.30.253.113|:443... connected.
HTTP request sent, awaiting response... 302 Found
Location: https://github-production-release-asset-2e65be.s3.amazonaws.com/41843105/126e7608-59c7-11e8-87fb-c907ee513be3?X-Amz-Algorithm=AWS4-HMAC-SHA256&X-Amz-Credential=AKIAIWNJYAX4CSVEH53A%2F20181102%2Fus-east-1%2Fs3%2Faws4_request&X-Amz-Date=20181102T220415Z&X-Amz-Expires=300&X-Amz-Signature=0db90ec8f4a0eacd7ce62d5b5b4fae8dc45b3c46ea9d4d6f4826720e4f99ade0&X-Amz-SignedHeaders=host&actor_id=0&response-content-disposition=attachment%3B%20filename%3DPillar-deployment50.zip&response-content-type=application%2Foctet-stream [following]
--2018-11-02 23:04:15--  https://github-production-release-asset-2e65be.s3.amazonaws.com/41843105/126e7608-59c7-11e8-87fb-c907ee513be3?X-Amz-Algorithm=AWS4-HMAC-SHA256&X-Amz-Credential=AKIAIWNJYAX4CSVEH53A%2F20181102%2Fus-east-1%2Fs3%2Faws4_request&X-Amz-Date=20181102T220415Z&X-Amz-Expires=300&X-Amz-Signature=0db90ec8f4a0eacd7ce62d5b5b4fae8dc45b3c46ea9d4d6f4826720e4f99ade0&X-Amz-SignedHeaders=host&actor_id=0&response-content-disposition=attachment%3B%20filename%3DPillar-deployment50.zip&response-content-type=application%2Foctet-stream
Resolving github-production-release-asset-2e65be.s3.amazonaws.com (github-production-release-asset-2e65be.s3.amazonaws.com)... 52.216.98.139
Connecting to github-production-release-asset-2e65be.s3.amazonaws.com (github-production-release-asset-2e65be.s3.amazonaws.com)|52.216.98.139|:443... connected.
HTTP request sent, awaiting response... 200 OK
Length: 19578631 (19M) [application/octet-stream]
Saving to: ‘imageivtP3.zip’


imageivtP3.zip        0%[                    ]       0  --.-KB/s               
imageivtP3.zip        0%[                    ]  92.57K   371KB/s               
imageivtP3.zip        4%[                    ] 874.57K  1.71MB/s               
imageivtP3.zip       13%[=>                  ]   2.58M  3.69MB/s               
imageivtP3.zip       25%[====>               ]   4.75M  5.19MB/s               
imageivtP3.zip       34%[=====>              ]   6.45M  5.78MB/s               
imageivtP3.zip       45%[========>           ]   8.52M  6.41MB/s               
imageivtP3.zip       54%[=========>          ]  10.19M  6.65MB/s               
imageivtP3.zip       66%[============>       ]  12.44M  7.11MB/s               
imageivtP3.zip       75%[==============>     ]  14.18M  7.27MB/s               
imageivtP3.zip       88%[================>   ]  16.44M  7.65MB/s               
imageivtP3.zip       97%[==================> ]  18.18M  7.71MB/s               
imageivtP3.zip      100%[===================>]  18.67M  7.81MB/s    in 2.4s    

2018-11-02 23:04:18 (7.81 MB/s) - ‘imageivtP3.zip’ saved [19578631/19578631]

Pharo.image
Pharo.changes
pillar
mustache
Preparing Pillar image
StartupPreferencesLoader
'ok'
+ make chapters
git submodule update --init
Submodule 'support/latex/sbabook' (https://github.com/cdlm/sbabook.git) registered for path 'support/latex/sbabook'
Cloning into 'support/latex/sbabook'...
Submodule path 'support/latex/sbabook': checked out 'e0aeedb0760143ef781efd9078fd3f1bd9c11fd9'
mkdir -p ./book-result
find . -type d -path ./book-result/ -prune -o -wholename "*/figures" -exec rsync -rR {} ./book-result \;
find: warning: -path ./book-result/ will not match anything because it ends with /.
cp -R support ./book-result
cp .latexmkrc ./book-result
./pillar export --to="latex:sbabook" --outputFile=AdvancedWidgets/AdvancedWidgets AdvancedWidgets/AdvancedWidgets.pillar

*** Warning: PRReferenceNotFound: Can't find anchor named 'cha_dynamic_spec'

*** Warning: PRReferenceNotFound: Can't find anchor named 'sec_hacking_dynamic'

*** Warning: PRReferenceNotFound: Can't find anchor named 'cha_dynamic_spec'
./mustache --data=book-result/AdvancedWidgets/AdvancedWidgets.tex.json --template=./support/templates/chapter.latex.template > book-result/AdvancedWidgets/AdvancedWidgets.tex
latexmk -f -cd -use-make -pdf book-result/AdvancedWidgets/AdvancedWidgets.tex
make: latexmk: Command not found
Makefile:65: recipe for target 'book-result/AdvancedWidgets/AdvancedWidgets.pdf' failed
make: *** [book-result/AdvancedWidgets/AdvancedWidgets.pdf] Error 127
Build step 'Execute shell' marked build as failure
Archiving artifacts
Sending e-mails to: jfabry@dcc.uchile.cl
SSH: Current build result is [FAILURE], not going to run.
Started calculate disk usage of build
Finished Calculation of disk usage of build in 0 seconds
Started calculate disk usage of workspace
Finished Calculation of disk usage of workspace in 0 seconds
Finished: FAILURE