FailedConsole Output

Skipping 544 KB.. Full Log
.core.internal.booleanarrays.BooleanArrays_assertDoesNotHaveDuplicates_Test
[INFO] Running org.assertj.core.internal.booleanarrays.BooleanArrays_assertHasSameSizeAs_with_Iterable_Test
[INFO] Tests run: 3, Failures: 0, Errors: 0, Skipped: 0, Time elapsed: 0.001 s - in org.assertj.core.internal.booleanarrays.BooleanArrays_assertHasSameSizeAs_with_Iterable_Test
[INFO] Running org.assertj.core.internal.booleanarrays.BooleanArrays_assertContainsOnly_Test
[INFO] Tests run: 9, Failures: 0, Errors: 0, Skipped: 0, Time elapsed: 0.003 s - in org.assertj.core.internal.booleanarrays.BooleanArrays_assertContainsOnly_Test
[INFO] Running org.assertj.core.internal.booleanarrays.BooleanArrays_assertContains_at_Index_Test
[INFO] Tests run: 6, Failures: 0, Errors: 0, Skipped: 0, Time elapsed: 0.003 s - in org.assertj.core.internal.booleanarrays.BooleanArrays_assertContains_at_Index_Test
[INFO] Running org.assertj.core.internal.booleanarrays.BooleanArrays_assertHasSize_Test
[INFO] Tests run: 3, Failures: 0, Errors: 0, Skipped: 0, Time elapsed: 0.003 s - in org.assertj.core.internal.booleanarrays.BooleanArrays_assertHasSize_Test
[INFO] Running org.assertj.core.internal.booleanarrays.BooleanArrays_assertStartsWith_Test
[INFO] Tests run: 9, Failures: 0, Errors: 0, Skipped: 0, Time elapsed: 0.003 s - in org.assertj.core.internal.booleanarrays.BooleanArrays_assertStartsWith_Test
[INFO] Running org.assertj.core.internal.booleanarrays.BooleanArrays_assertNullOrEmpty_Test
[INFO] Tests run: 3, Failures: 0, Errors: 0, Skipped: 0, Time elapsed: 0.003 s - in org.assertj.core.internal.booleanarrays.BooleanArrays_assertNullOrEmpty_Test
[INFO] Running org.assertj.core.internal.booleanarrays.BooleanArrays_assertContainsExactly_Test
[INFO] Tests run: 9, Failures: 0, Errors: 0, Skipped: 0, Time elapsed: 0.004 s - in org.assertj.core.internal.booleanarrays.BooleanArrays_assertContainsExactly_Test
[INFO] Running org.assertj.core.internal.booleanarrays.BooleanArrays_assertContains_Test
[INFO] Tests run: 1, Failures: 0, Errors: 0, Skipped: 0, Time elapsed: 0 s - in org.assertj.core.internal.booleanarrays.BooleanArrays_assertContains_Test
[INFO] Running org.assertj.core.internal.booleanarrays.BooleanArrays_assertHasSizeGreaterThan_Test
[INFO] Tests run: 3, Failures: 0, Errors: 0, Skipped: 0, Time elapsed: 0.002 s - in org.assertj.core.internal.booleanarrays.BooleanArrays_assertHasSizeGreaterThan_Test
[INFO] Running org.assertj.core.internal.booleanarrays.BooleanArrays_assertContainsExactlyInAnyOrder_Test
[INFO] Tests run: 11, Failures: 0, Errors: 0, Skipped: 0, Time elapsed: 0.005 s - in org.assertj.core.internal.booleanarrays.BooleanArrays_assertContainsExactlyInAnyOrder_Test
[INFO] Running org.assertj.core.internal.StandardComparisonStrategy_stringEndsWith_Test
[INFO] Tests run: 1, Failures: 0, Errors: 0, Skipped: 0, Time elapsed: 0 s - in org.assertj.core.internal.StandardComparisonStrategy_stringEndsWith_Test
[INFO] Running org.assertj.core.internal.doublearrays.DoubleArrays_assertContainsSequence_Test
[INFO] Tests run: 17, Failures: 0, Errors: 0, Skipped: 0, Time elapsed: 0.009 s - in org.assertj.core.internal.doublearrays.DoubleArrays_assertContainsSequence_Test
[INFO] Running org.assertj.core.internal.doublearrays.DoubleArrays_assertEmpty_Test
[INFO] Tests run: 3, Failures: 0, Errors: 0, Skipped: 0, Time elapsed: 0.001 s - in org.assertj.core.internal.doublearrays.DoubleArrays_assertEmpty_Test
[INFO] Running org.assertj.core.internal.doublearrays.DoubleArrays_assertNotEmpty_Test
[INFO] Tests run: 3, Failures: 0, Errors: 0, Skipped: 0, Time elapsed: 0.002 s - in org.assertj.core.internal.doublearrays.DoubleArrays_assertNotEmpty_Test
[INFO] Running org.assertj.core.internal.doublearrays.DoubleArrays_assertHasSameSizeAs_with_Iterable_Test
[INFO] Tests run: 3, Failures: 0, Errors: 0, Skipped: 0, Time elapsed: 0.002 s - in org.assertj.core.internal.doublearrays.DoubleArrays_assertHasSameSizeAs_with_Iterable_Test
[INFO] Running org.assertj.core.internal.doublearrays.DoubleArrays_assertStartsWith_Test
[INFO] Tests run: 17, Failures: 0, Errors: 0, Skipped: 0, Time elapsed: 0.008 s - in org.assertj.core.internal.doublearrays.DoubleArrays_assertStartsWith_Test
[INFO] Running org.assertj.core.internal.doublearrays.DoubleArrays_assertNullOrEmpty_Test
[INFO] Tests run: 3, Failures: 0, Errors: 0, Skipped: 0, Time elapsed: 0.001 s - in org.assertj.core.internal.doublearrays.DoubleArrays_assertNullOrEmpty_Test
[INFO] Running org.assertj.core.internal.doublearrays.DoubleArrays_assertContains_Test
[INFO] Tests run: 1, Failures: 0, Errors: 0, Skipped: 0, Time elapsed: 0 s - in org.assertj.core.internal.doublearrays.DoubleArrays_assertContains_Test
[INFO] Running org.assertj.core.internal.doublearrays.DoubleArrays_assertDoesNotContain_Test
[INFO] Tests run: 12, Failures: 0, Errors: 0, Skipped: 0, Time elapsed: 0.005 s - in org.assertj.core.internal.doublearrays.DoubleArrays_assertDoesNotContain_Test
[INFO] Running org.assertj.core.internal.doublearrays.DoubleArrays_assertHasSameSizeAs_with_Array_Test
[INFO] Tests run: 3, Failures: 0, Errors: 0, Skipped: 0, Time elapsed: 0.001 s - in org.assertj.core.internal.doublearrays.DoubleArrays_assertHasSameSizeAs_with_Array_Test
[INFO] Running org.assertj.core.internal.doublearrays.DoubleArrays_assertDoesNotContain_at_Index_Test
[INFO] Tests run: 12, Failures: 0, Errors: 0, Skipped: 0, Time elapsed: 0.005 s - in org.assertj.core.internal.doublearrays.DoubleArrays_assertDoesNotContain_at_Index_Test
[INFO] Running org.assertj.core.internal.doublearrays.DoubleArrays_assertContains_at_Index_Test
[INFO] Tests run: 12, Failures: 0, Errors: 0, Skipped: 0, Time elapsed: 0.007 s - in org.assertj.core.internal.doublearrays.DoubleArrays_assertContains_at_Index_Test
[INFO] Running org.assertj.core.internal.doublearrays.DoubleArrays_assertDoesNotHaveDuplicates_Test
[INFO] Tests run: 8, Failures: 0, Errors: 0, Skipped: 0, Time elapsed: 0.004 s - in org.assertj.core.internal.doublearrays.DoubleArrays_assertDoesNotHaveDuplicates_Test
[INFO] Running org.assertj.core.internal.doublearrays.DoubleArrays_assertContainsOnlyOnce_Test
[INFO] Tests run: 17, Failures: 0, Errors: 0, Skipped: 0, Time elapsed: 0.007 s - in org.assertj.core.internal.doublearrays.DoubleArrays_assertContainsOnlyOnce_Test
[INFO] Running org.assertj.core.internal.doublearrays.DoubleArrays_assertEndsWith_Test
[INFO] Tests run: 17, Failures: 0, Errors: 0, Skipped: 0, Time elapsed: 0.008 s - in org.assertj.core.internal.doublearrays.DoubleArrays_assertEndsWith_Test
[INFO] Running org.assertj.core.internal.doublearrays.DoubleArrays_assertIsSorted_Test
[INFO] Tests run: 10, Failures: 0, Errors: 0, Skipped: 0, Time elapsed: 0.003 s - in org.assertj.core.internal.doublearrays.DoubleArrays_assertIsSorted_Test
[INFO] Running org.assertj.core.internal.doublearrays.DoubleArrays_assertContainsExactly_Test
[INFO] Tests run: 17, Failures: 0, Errors: 0, Skipped: 0, Time elapsed: 0.009 s - in org.assertj.core.internal.doublearrays.DoubleArrays_assertContainsExactly_Test
[INFO] Running org.assertj.core.internal.doublearrays.DoubleArrays_assertHasSize_Test
[INFO] Tests run: 3, Failures: 0, Errors: 0, Skipped: 0, Time elapsed: 0.001 s - in org.assertj.core.internal.doublearrays.DoubleArrays_assertHasSize_Test
[INFO] Running org.assertj.core.internal.doublearrays.DoubleArrays_assertHasSizeLessThan_Test
[INFO] Tests run: 3, Failures: 0, Errors: 0, Skipped: 0, Time elapsed: 0.002 s - in org.assertj.core.internal.doublearrays.DoubleArrays_assertHasSizeLessThan_Test
[INFO] Running org.assertj.core.internal.doublearrays.DoubleArrays_assertContainsOnly_Test
[INFO] Tests run: 17, Failures: 0, Errors: 0, Skipped: 0, Time elapsed: 0.007 s - in org.assertj.core.internal.doublearrays.DoubleArrays_assertContainsOnly_Test
[INFO] Running org.assertj.core.internal.doublearrays.DoubleArrays_assertIsSortedAccordingToComparator_Test
[INFO] Tests run: 5, Failures: 0, Errors: 0, Skipped: 0, Time elapsed: 0.004 s - in org.assertj.core.internal.doublearrays.DoubleArrays_assertIsSortedAccordingToComparator_Test
[INFO] Running org.assertj.core.internal.doublearrays.DoubleArrays_assertHasSizeGreaterThan_Test
[INFO] Tests run: 3, Failures: 0, Errors: 0, Skipped: 0, Time elapsed: 0.002 s - in org.assertj.core.internal.doublearrays.DoubleArrays_assertHasSizeGreaterThan_Test
[INFO] Running org.assertj.core.internal.doublearrays.DoubleArrays_assertHasSizeLessThanOrEqualTo_Test
[INFO] Tests run: 4, Failures: 0, Errors: 0, Skipped: 0, Time elapsed: 0.002 s - in org.assertj.core.internal.doublearrays.DoubleArrays_assertHasSizeLessThanOrEqualTo_Test
[INFO] Running org.assertj.core.internal.doublearrays.DoubleArrays_assertHasSizeBetween_Test
[INFO] Tests run: 5, Failures: 0, Errors: 0, Skipped: 0, Time elapsed: 0.002 s - in org.assertj.core.internal.doublearrays.DoubleArrays_assertHasSizeBetween_Test
[INFO] Running org.assertj.core.internal.doublearrays.DoubleArrays_assertHasSizeGreaterThanOrEqualTo_Test
[INFO] Tests run: 4, Failures: 0, Errors: 0, Skipped: 0, Time elapsed: 0.001 s - in org.assertj.core.internal.doublearrays.DoubleArrays_assertHasSizeGreaterThanOrEqualTo_Test
[INFO] Running org.assertj.core.internal.doublearrays.DoubleArrays_assertContainsAnyOf_Test
[INFO] Tests run: 1, Failures: 0, Errors: 0, Skipped: 0, Time elapsed: 0 s - in org.assertj.core.internal.doublearrays.DoubleArrays_assertContainsAnyOf_Test
[INFO] Running org.assertj.core.internal.doublearrays.DoubleArrays_assertContainsExactlyInAnyOrder_Test
[INFO] Tests run: 20, Failures: 0, Errors: 0, Skipped: 0, Time elapsed: 0.01 s - in org.assertj.core.internal.doublearrays.DoubleArrays_assertContainsExactlyInAnyOrder_Test
[INFO] Running org.assertj.core.internal.maps.Maps_assertAllSatisfyingConsumer_Test
[INFO] Tests run: 5, Failures: 0, Errors: 0, Skipped: 0, Time elapsed: 0.004 s - in org.assertj.core.internal.maps.Maps_assertAllSatisfyingConsumer_Test
[INFO] Running org.assertj.core.internal.maps.Maps_assertDoesNotContainKey_Test
[INFO] Tests run: 4, Failures: 0, Errors: 0, Skipped: 0, Time elapsed: 0.002 s - in org.assertj.core.internal.maps.Maps_assertDoesNotContainKey_Test
[INFO] Running org.assertj.core.internal.maps.Maps_assertContainsValue_Test
[INFO] Tests run: 4, Failures: 0, Errors: 0, Skipped: 0, Time elapsed: 0.001 s - in org.assertj.core.internal.maps.Maps_assertContainsValue_Test
[INFO] Running org.assertj.core.internal.maps.Maps_assertHasKeySatisfying_Test
[INFO] Tests run: 4, Failures: 0, Errors: 0, Skipped: 0, Time elapsed: 0.002 s - in org.assertj.core.internal.maps.Maps_assertHasKeySatisfying_Test
[INFO] Running org.assertj.core.internal.maps.Maps_assertContainsAnyOf_Test
[INFO] Tests run: 9, Failures: 0, Errors: 0, Skipped: 0, Time elapsed: 0.004 s - in org.assertj.core.internal.maps.Maps_assertContainsAnyOf_Test
[INFO] Running org.assertj.core.internal.maps.Maps_assertContainsOnly_Test
[INFO] Tests run: 9, Failures: 0, Errors: 0, Skipped: 0, Time elapsed: 0.004 s - in org.assertj.core.internal.maps.Maps_assertContainsOnly_Test
[INFO] Running org.assertj.core.internal.maps.Maps_assertHasSizeGreaterThanOrEqualTo_Test
[INFO] Tests run: 4, Failures: 0, Errors: 0, Skipped: 0, Time elapsed: 0.002 s - in org.assertj.core.internal.maps.Maps_assertHasSizeGreaterThanOrEqualTo_Test
[INFO] Running org.assertj.core.internal.maps.Maps_assertDoesNotContainValue_Test
[INFO] Tests run: 4, Failures: 0, Errors: 0, Skipped: 0, Time elapsed: 0 s - in org.assertj.core.internal.maps.Maps_assertDoesNotContainValue_Test
[INFO] Running org.assertj.core.internal.maps.Maps_assertHasSameSizeAs_with_Array_Test
[INFO] Tests run: 3, Failures: 0, Errors: 0, Skipped: 0, Time elapsed: 0 s - in org.assertj.core.internal.maps.Maps_assertHasSameSizeAs_with_Array_Test
[INFO] Running org.assertj.core.internal.maps.Maps_assertContainsKeys_Test
[INFO] Tests run: 5, Failures: 0, Errors: 0, Skipped: 0, Time elapsed: 0 s - in org.assertj.core.internal.maps.Maps_assertContainsKeys_Test
[INFO] Running org.assertj.core.internal.maps.Maps_assertHasEntrySatisfying_with_entry_condition_Test
[INFO] Tests run: 4, Failures: 0, Errors: 0, Skipped: 0, Time elapsed: 0 s - in org.assertj.core.internal.maps.Maps_assertHasEntrySatisfying_with_entry_condition_Test
[INFO] Running org.assertj.core.internal.maps.Maps_assertHasEntrySatisfyingConsumer_Test
[INFO] Tests run: 6, Failures: 0, Errors: 0, Skipped: 0, Time elapsed: 0 s - in org.assertj.core.internal.maps.Maps_assertHasEntrySatisfyingConsumer_Test
[INFO] Running org.assertj.core.internal.maps.Maps_assertDoesNotContainKeys_Test
[INFO] Tests run: 5, Failures: 0, Errors: 0, Skipped: 0, Time elapsed: 0 s - in org.assertj.core.internal.maps.Maps_assertDoesNotContainKeys_Test
[INFO] Running org.assertj.core.internal.maps.Maps_assertHasSameSizeAs_with_Iterable_Test
[INFO] Tests run: 3, Failures: 0, Errors: 0, Skipped: 0, Time elapsed: 0 s - in org.assertj.core.internal.maps.Maps_assertHasSameSizeAs_with_Iterable_Test
[INFO] Running org.assertj.core.internal.maps.Maps_assertContainsValues_Test
[INFO] Tests run: 6, Failures: 0, Errors: 0, Skipped: 0, Time elapsed: 0 s - in org.assertj.core.internal.maps.Maps_assertContainsValues_Test
[INFO] Running org.assertj.core.internal.maps.Maps_assertContainsKey_Test
[INFO] Tests run: 4, Failures: 0, Errors: 0, Skipped: 0, Time elapsed: 0 s - in org.assertj.core.internal.maps.Maps_assertContainsKey_Test
[INFO] Running org.assertj.core.internal.maps.Maps_assertHasSizeBetween_Test
[INFO] Tests run: 5, Failures: 0, Errors: 0, Skipped: 0, Time elapsed: 0.001 s - in org.assertj.core.internal.maps.Maps_assertHasSizeBetween_Test
[INFO] Running org.assertj.core.internal.maps.Maps_assertHasSizeLessThanOrEqualTo_Test
[INFO] Tests run: 4, Failures: 0, Errors: 0, Skipped: 0, Time elapsed: 0 s - in org.assertj.core.internal.maps.Maps_assertHasSizeLessThanOrEqualTo_Test
[INFO] Running org.assertj.core.internal.maps.Maps_assertHasSizeGreaterThan_Test
[INFO] Tests run: 3, Failures: 0, Errors: 0, Skipped: 0, Time elapsed: 0 s - in org.assertj.core.internal.maps.Maps_assertHasSizeGreaterThan_Test
[INFO] Running org.assertj.core.internal.maps.Maps_assertHasEntrySatisfyingCondition_Test
[INFO] Tests run: 6, Failures: 0, Errors: 0, Skipped: 0, Time elapsed: 0 s - in org.assertj.core.internal.maps.Maps_assertHasEntrySatisfyingCondition_Test
[INFO] Running org.assertj.core.internal.maps.Maps_assertHasSameSizeAs_with_Map_Test
[INFO] Tests run: 4, Failures: 0, Errors: 0, Skipped: 0, Time elapsed: 0.001 s - in org.assertj.core.internal.maps.Maps_assertHasSameSizeAs_with_Map_Test
[INFO] Running org.assertj.core.internal.maps.Maps_assertNullOrEmpty_Test
[INFO] Tests run: 3, Failures: 0, Errors: 0, Skipped: 0, Time elapsed: 0 s - in org.assertj.core.internal.maps.Maps_assertNullOrEmpty_Test
[INFO] Running org.assertj.core.internal.maps.Maps_assertHasSize_Test
[INFO] Tests run: 3, Failures: 0, Errors: 0, Skipped: 0, Time elapsed: 0 s - in org.assertj.core.internal.maps.Maps_assertHasSize_Test
[INFO] Running org.assertj.core.internal.maps.Maps_assertContainsExactly_Test
[INFO] Tests run: 9, Failures: 0, Errors: 0, Skipped: 0, Time elapsed: 0.001 s - in org.assertj.core.internal.maps.Maps_assertContainsExactly_Test
[INFO] Running org.assertj.core.internal.maps.Maps_assertContainsOnlyKeys_Test
[INFO] Tests run: 8, Failures: 0, Errors: 0, Skipped: 0, Time elapsed: 0.001 s - in org.assertj.core.internal.maps.Maps_assertContainsOnlyKeys_Test
[INFO] Running org.assertj.core.internal.maps.Maps_assertNotEmpty_Test
[INFO] Tests run: 3, Failures: 0, Errors: 0, Skipped: 0, Time elapsed: 0.001 s - in org.assertj.core.internal.maps.Maps_assertNotEmpty_Test
[INFO] Running org.assertj.core.internal.maps.Maps_assertContains_Test
[INFO] Tests run: 9, Failures: 0, Errors: 0, Skipped: 0, Time elapsed: 0.001 s - in org.assertj.core.internal.maps.Maps_assertContains_Test
[INFO] Running org.assertj.core.internal.maps.Maps_assertHasValueSatisfying_Test
[INFO] Tests run: 4, Failures: 0, Errors: 0, Skipped: 0, Time elapsed: 0 s - in org.assertj.core.internal.maps.Maps_assertHasValueSatisfying_Test
[INFO] Running org.assertj.core.internal.maps.Maps_assertHasEntrySatisfying_with_key_and_value_conditions_Test
[INFO] Tests run: 7, Failures: 0, Errors: 0, Skipped: 0, Time elapsed: 0.388 s - in org.assertj.core.internal.maps.Maps_assertHasEntrySatisfying_with_key_and_value_conditions_Test
[INFO] Running org.assertj.core.internal.maps.Maps_assertEmpty_Test
[INFO] Tests run: 3, Failures: 0, Errors: 0, Skipped: 0, Time elapsed: 0.005 s - in org.assertj.core.internal.maps.Maps_assertEmpty_Test
[INFO] Running org.assertj.core.internal.maps.Maps_assertHasSizeLessThan_Test
[INFO] Tests run: 3, Failures: 0, Errors: 0, Skipped: 0, Time elapsed: 0.001 s - in org.assertj.core.internal.maps.Maps_assertHasSizeLessThan_Test
[INFO] Running org.assertj.core.internal.maps.Maps_assertDoesNotContain_Test
[INFO] Tests run: 5, Failures: 0, Errors: 0, Skipped: 0, Time elapsed: 0.003 s - in org.assertj.core.internal.maps.Maps_assertDoesNotContain_Test
[INFO] Running org.assertj.core.internal.maps.Maps_assertHasEntrySatisfying_with_key_and_condition_Test
[INFO] Tests run: 6, Failures: 0, Errors: 0, Skipped: 0, Time elapsed: 0.003 s - in org.assertj.core.internal.maps.Maps_assertHasEntrySatisfying_with_key_and_condition_Test
[INFO] Running org.assertj.core.internal.StandardComparisonStrategy_isLessThanOrEqualTo_Test
[INFO] Tests run: 2, Failures: 0, Errors: 0, Skipped: 0, Time elapsed: 0.001 s - in org.assertj.core.internal.StandardComparisonStrategy_isLessThanOrEqualTo_Test
[INFO] Running org.assertj.core.internal.longarrays.LongArrays_assertHasSizeGreaterThanOrEqualTo_Test
[INFO] Tests run: 4, Failures: 0, Errors: 0, Skipped: 0, Time elapsed: 0.001 s - in org.assertj.core.internal.longarrays.LongArrays_assertHasSizeGreaterThanOrEqualTo_Test
[INFO] Running org.assertj.core.internal.longarrays.LongArrays_assertContainsOnlyOnce_Test
[INFO] Tests run: 17, Failures: 0, Errors: 0, Skipped: 0, Time elapsed: 0.008 s - in org.assertj.core.internal.longarrays.LongArrays_assertContainsOnlyOnce_Test
[INFO] Running org.assertj.core.internal.longarrays.LongArrays_assertHasSameSizeAs_with_Iterable_Test
[INFO] Tests run: 3, Failures: 0, Errors: 0, Skipped: 0, Time elapsed: 0.002 s - in org.assertj.core.internal.longarrays.LongArrays_assertHasSameSizeAs_with_Iterable_Test
[INFO] Running org.assertj.core.internal.longarrays.LongArrays_assertEmpty_Test
[INFO] Tests run: 3, Failures: 0, Errors: 0, Skipped: 0, Time elapsed: 0.001 s - in org.assertj.core.internal.longarrays.LongArrays_assertEmpty_Test
[INFO] Running org.assertj.core.internal.longarrays.LongArrays_assertEndsWith_Test
[INFO] Tests run: 17, Failures: 0, Errors: 0, Skipped: 0, Time elapsed: 0.007 s - in org.assertj.core.internal.longarrays.LongArrays_assertEndsWith_Test
[INFO] Running org.assertj.core.internal.longarrays.LongArrays_assertStartsWith_Test
[INFO] Tests run: 17, Failures: 0, Errors: 0, Skipped: 0, Time elapsed: 0.007 s - in org.assertj.core.internal.longarrays.LongArrays_assertStartsWith_Test
[INFO] Running org.assertj.core.internal.longarrays.LongArrays_assertContainsAnyOf_Test
[INFO] Tests run: 1, Failures: 0, Errors: 0, Skipped: 0, Time elapsed: 0.001 s - in org.assertj.core.internal.longarrays.LongArrays_assertContainsAnyOf_Test
[INFO] Running org.assertj.core.internal.longarrays.LongArrays_assertHasSizeBetween_Test
[INFO] Tests run: 5, Failures: 0, Errors: 0, Skipped: 0, Time elapsed: 0.002 s - in org.assertj.core.internal.longarrays.LongArrays_assertHasSizeBetween_Test
[INFO] Running org.assertj.core.internal.longarrays.LongArrays_assertNotEmpty_Test
[INFO] Tests run: 3, Failures: 0, Errors: 0, Skipped: 0, Time elapsed: 0.002 s - in org.assertj.core.internal.longarrays.LongArrays_assertNotEmpty_Test
[INFO] Running org.assertj.core.internal.longarrays.LongArrays_assertContainsExactly_Test
[INFO] Tests run: 16, Failures: 0, Errors: 0, Skipped: 0, Time elapsed: 0.009 s - in org.assertj.core.internal.longarrays.LongArrays_assertContainsExactly_Test
[INFO] Running org.assertj.core.internal.longarrays.LongArrays_assertContains_Test
[INFO] Tests run: 1, Failures: 0, Errors: 0, Skipped: 0, Time elapsed: 0 s - in org.assertj.core.internal.longarrays.LongArrays_assertContains_Test
[INFO] Running org.assertj.core.internal.longarrays.LongArrays_assertContainsSequence_Test
[INFO] Tests run: 17, Failures: 0, Errors: 0, Skipped: 0, Time elapsed: 0.005 s - in org.assertj.core.internal.longarrays.LongArrays_assertContainsSequence_Test
[INFO] Running org.assertj.core.internal.longarrays.LongArrays_assertContains_at_Index_Test
[INFO] Tests run: 12, Failures: 0, Errors: 0, Skipped: 0, Time elapsed: 0.005 s - in org.assertj.core.internal.longarrays.LongArrays_assertContains_at_Index_Test
[INFO] Running org.assertj.core.internal.longarrays.LongArrays_assertHasSizeLessThanOrEqualTo_Test
[INFO] Tests run: 4, Failures: 0, Errors: 0, Skipped: 0, Time elapsed: 0.001 s - in org.assertj.core.internal.longarrays.LongArrays_assertHasSizeLessThanOrEqualTo_Test
[INFO] Running org.assertj.core.internal.longarrays.LongArrays_assertDoesNotContain_at_Index_Test
[INFO] Tests run: 12, Failures: 0, Errors: 0, Skipped: 0, Time elapsed: 0.004 s - in org.assertj.core.internal.longarrays.LongArrays_assertDoesNotContain_at_Index_Test
[INFO] Running org.assertj.core.internal.longarrays.LongArrays_assertDoesNotContain_Test
[INFO] Tests run: 12, Failures: 0, Errors: 0, Skipped: 0, Time elapsed: 0.004 s - in org.assertj.core.internal.longarrays.LongArrays_assertDoesNotContain_Test
[INFO] Running org.assertj.core.internal.longarrays.LongArrays_assertIsSortedAccordingToComparator_Test
[INFO] Tests run: 5, Failures: 0, Errors: 0, Skipped: 0, Time elapsed: 0.002 s - in org.assertj.core.internal.longarrays.LongArrays_assertIsSortedAccordingToComparator_Test
[INFO] Running org.assertj.core.internal.longarrays.LongArrays_assertHasSameSizeAs_with_Array_Test
[INFO] Tests run: 3, Failures: 0, Errors: 0, Skipped: 0, Time elapsed: 0.001 s - in org.assertj.core.internal.longarrays.LongArrays_assertHasSameSizeAs_with_Array_Test
[INFO] Running org.assertj.core.internal.longarrays.LongArrays_assertContainsOnly_Test
[INFO] Tests run: 17, Failures: 0, Errors: 0, Skipped: 0, Time elapsed: 0.006 s - in org.assertj.core.internal.longarrays.LongArrays_assertContainsOnly_Test
[INFO] Running org.assertj.core.internal.longarrays.LongArrays_assertContainsExactlyInAnyOrder_Test
[INFO] Tests run: 20, Failures: 0, Errors: 0, Skipped: 0, Time elapsed: 0.007 s - in org.assertj.core.internal.longarrays.LongArrays_assertContainsExactlyInAnyOrder_Test
[INFO] Running org.assertj.core.internal.longarrays.LongArrays_assertHasSizeLessThan_Test
[INFO] Tests run: 3, Failures: 0, Errors: 0, Skipped: 0, Time elapsed: 0.001 s - in org.assertj.core.internal.longarrays.LongArrays_assertHasSizeLessThan_Test
[INFO] Running org.assertj.core.internal.longarrays.LongArrays_assertDoesNotHaveDuplicates_Test
[INFO] Tests run: 8, Failures: 0, Errors: 0, Skipped: 0, Time elapsed: 0.004 s - in org.assertj.core.internal.longarrays.LongArrays_assertDoesNotHaveDuplicates_Test
[INFO] Running org.assertj.core.internal.longarrays.LongArrays_assertIsSorted_Test
[INFO] Tests run: 10, Failures: 0, Errors: 0, Skipped: 0, Time elapsed: 0.003 s - in org.assertj.core.internal.longarrays.LongArrays_assertIsSorted_Test
[INFO] Running org.assertj.core.internal.longarrays.LongArrays_assertHasSizeGreaterThan_Test
[INFO] Tests run: 3, Failures: 0, Errors: 0, Skipped: 0, Time elapsed: 0.001 s - in org.assertj.core.internal.longarrays.LongArrays_assertHasSizeGreaterThan_Test
[INFO] Running org.assertj.core.internal.longarrays.LongArrays_assertHasSize_Test
[INFO] Tests run: 3, Failures: 0, Errors: 0, Skipped: 0, Time elapsed: 0.002 s - in org.assertj.core.internal.longarrays.LongArrays_assertHasSize_Test
[INFO] Running org.assertj.core.internal.longarrays.LongArrays_assertNullOrEmpty_Test
[INFO] Tests run: 3, Failures: 0, Errors: 0, Skipped: 0, Time elapsed: 0.002 s - in org.assertj.core.internal.longarrays.LongArrays_assertNullOrEmpty_Test
[INFO] Running org.assertj.core.internal.strings.Strings_assertJavaBlank_Test
[INFO] Tests run: 12, Failures: 0, Errors: 0, Skipped: 0, Time elapsed: 0.012 s - in org.assertj.core.internal.strings.Strings_assertJavaBlank_Test
[INFO] Running org.assertj.core.internal.strings.Strings_assertHasSizeLessThan_Test
[INFO] Tests run: 4, Failures: 0, Errors: 0, Skipped: 0, Time elapsed: 0.005 s - in org.assertj.core.internal.strings.Strings_assertHasSizeLessThan_Test
[INFO] Running org.assertj.core.internal.strings.Strings_assertIsLowerCase_Test
[INFO] Tests run: 5, Failures: 0, Errors: 0, Skipped: 0, Time elapsed: 0 s - in org.assertj.core.internal.strings.Strings_assertIsLowerCase_Test
[INFO] Running org.assertj.core.internal.strings.Strings_assertNotBlank_Test
[INFO] Tests run: 12, Failures: 0, Errors: 0, Skipped: 0, Time elapsed: 0.008 s - in org.assertj.core.internal.strings.Strings_assertNotBlank_Test
[INFO] Running org.assertj.core.internal.strings.Strings_assertContainsOnlyDigits_Test
[INFO] Tests run: 4, Failures: 0, Errors: 0, Skipped: 0, Time elapsed: 0.003 s - in org.assertj.core.internal.strings.Strings_assertContainsOnlyDigits_Test
[INFO] Running org.assertj.core.internal.strings.Strings_assertHasSameSizeAs_with_CharSequence_Test
[INFO] Tests run: 3, Failures: 0, Errors: 0, Skipped: 0, Time elapsed: 0.002 s - in org.assertj.core.internal.strings.Strings_assertHasSameSizeAs_with_CharSequence_Test
[INFO] Running org.assertj.core.internal.strings.Strings_assertIsXmlEqualCase_Test
[INFO] Tests run: 6, Failures: 0, Errors: 0, Skipped: 0, Time elapsed: 0.35 s - in org.assertj.core.internal.strings.Strings_assertIsXmlEqualCase_Test
[INFO] Running org.assertj.core.internal.strings.Strings_assertIsUpperCase_Test
[INFO] Tests run: 5, Failures: 0, Errors: 0, Skipped: 0, Time elapsed: 0.002 s - in org.assertj.core.internal.strings.Strings_assertIsUpperCase_Test
[INFO] Running org.assertj.core.internal.strings.Strings_assertDoesNotContain_Test
[INFO] Tests run: 12, Failures: 0, Errors: 0, Skipped: 0, Time elapsed: 0.005 s - in org.assertj.core.internal.strings.Strings_assertDoesNotContain_Test
[INFO] Running org.assertj.core.internal.strings.Strings_assertContainsOnlyWhitespaces_Test
[INFO] Tests run: 12, Failures: 0, Errors: 0, Skipped: 0, Time elapsed: 0.007 s - in org.assertj.core.internal.strings.Strings_assertContainsOnlyWhitespaces_Test
[INFO] Running org.assertj.core.internal.strings.Strings_assertEndsWith_Test
[INFO] Tests run: 6, Failures: 0, Errors: 0, Skipped: 0, Time elapsed: 0.002 s - in org.assertj.core.internal.strings.Strings_assertEndsWith_Test
[INFO] Running org.assertj.core.internal.strings.Strings_assertMatches_CharSequence_Test
[INFO] Tests run: 10, Failures: 0, Errors: 0, Skipped: 0, Time elapsed: 0.005 s - in org.assertj.core.internal.strings.Strings_assertMatches_CharSequence_Test
[INFO] Running org.assertj.core.internal.strings.Strings_assertContainsOnlyOnce_Test
[INFO] Tests run: 9, Failures: 0, Errors: 0, Skipped: 0, Time elapsed: 0.01 s - in org.assertj.core.internal.strings.Strings_assertContainsOnlyOnce_Test
[INFO] Running org.assertj.core.internal.strings.Strings_assertContainsSubsequence_Test
[INFO] Tests run: 12, Failures: 0, Errors: 0, Skipped: 0, Time elapsed: 0.005 s - in org.assertj.core.internal.strings.Strings_assertContainsSubsequence_Test
[INFO] Running org.assertj.core.internal.strings.Strings_assertNotEmpty_Test
[INFO] Tests run: 6, Failures: 0, Errors: 0, Skipped: 0, Time elapsed: 0.002 s - in org.assertj.core.internal.strings.Strings_assertNotEmpty_Test
[INFO] Running org.assertj.core.internal.strings.Strings_assertHasSameSizeAs_with_Array_Test
[INFO] Tests run: 3, Failures: 0, Errors: 0, Skipped: 0, Time elapsed: 0.001 s - in org.assertj.core.internal.strings.Strings_assertHasSameSizeAs_with_Array_Test
[INFO] Running org.assertj.core.internal.strings.Strings_assertNullOrEmpty_Test
[INFO] Tests run: 6, Failures: 0, Errors: 0, Skipped: 0, Time elapsed: 0.002 s - in org.assertj.core.internal.strings.Strings_assertNullOrEmpty_Test
[INFO] Running org.assertj.core.internal.strings.Strings_assertDoesNotContainPattern_CharSequence_Test
[INFO] Tests run: 10, Failures: 0, Errors: 0, Skipped: 0, Time elapsed: 0.007 s - in org.assertj.core.internal.strings.Strings_assertDoesNotContainPattern_CharSequence_Test
[INFO] Running org.assertj.core.internal.strings.Strings_assertNotEqualsNormalizingWhitespace_Test
[INFO] Tests run: 16, Failures: 0, Errors: 0, Skipped: 0, Time elapsed: 0.01 s - in org.assertj.core.internal.strings.Strings_assertNotEqualsNormalizingWhitespace_Test
[INFO] Running org.assertj.core.internal.strings.Strings_assertHasSizeGreaterThan_Test
[INFO] Tests run: 4, Failures: 0, Errors: 0, Skipped: 0, Time elapsed: 0.002 s - in org.assertj.core.internal.strings.Strings_assertHasSizeGreaterThan_Test
[INFO] Running org.assertj.core.internal.strings.Strings_assertEqualsNormalizingWhitespace_Test
[INFO] Tests run: 14, Failures: 0, Errors: 0, Skipped: 0, Time elapsed: 0.006 s - in org.assertj.core.internal.strings.Strings_assertEqualsNormalizingWhitespace_Test
[INFO] Running org.assertj.core.internal.strings.Strings_assertNotEqualsIgnoringWhitespace_Test
[INFO] Tests run: 17, Failures: 0, Errors: 0, Skipped: 0, Time elapsed: 0.018 s - in org.assertj.core.internal.strings.Strings_assertNotEqualsIgnoringWhitespace_Test
[INFO] Running org.assertj.core.internal.strings.Strings_assertStartsWith_Test
[INFO] Tests run: 6, Failures: 0, Errors: 0, Skipped: 0, Time elapsed: 0.003 s - in org.assertj.core.internal.strings.Strings_assertStartsWith_Test
[INFO] Running org.assertj.core.internal.strings.Strings_assertMatches_Pattern_Test
[INFO] Tests run: 8, Failures: 0, Errors: 0, Skipped: 0, Time elapsed: 0.004 s - in org.assertj.core.internal.strings.Strings_assertMatches_Pattern_Test
[INFO] Running org.assertj.core.internal.strings.Strings_assertNotEqualsIgnoringCase_Test
[INFO] Tests run: 13, Failures: 0, Errors: 0, Skipped: 0, Time elapsed: 0.005 s - in org.assertj.core.internal.strings.Strings_assertNotEqualsIgnoringCase_Test
[INFO] Running org.assertj.core.internal.strings.Strings_assertBlank_Test
[INFO] Tests run: 12, Failures: 0, Errors: 0, Skipped: 0, Time elapsed: 0.006 s - in org.assertj.core.internal.strings.Strings_assertBlank_Test
[INFO] Running org.assertj.core.internal.strings.Strings_assertEqualsIgnoringWhitespace_Test
[INFO] Tests run: 16, Failures: 0, Errors: 0, Skipped: 0, Time elapsed: 0.006 s - in org.assertj.core.internal.strings.Strings_assertEqualsIgnoringWhitespace_Test
[INFO] Running org.assertj.core.internal.strings.Strings_assertHasSize_Test
[INFO] Tests run: 6, Failures: 0, Errors: 0, Skipped: 0, Time elapsed: 0.003 s - in org.assertj.core.internal.strings.Strings_assertHasSize_Test
[INFO] Running org.assertj.core.internal.strings.Strings_assertDoesNotMatch_CharSequence_Test
[INFO] Tests run: 10, Failures: 0, Errors: 0, Skipped: 0, Time elapsed: 0.004 s - in org.assertj.core.internal.strings.Strings_assertDoesNotMatch_CharSequence_Test
[INFO] Running org.assertj.core.internal.strings.Strings_assertEqualsIgnoringCase_Test
[INFO] Tests run: 13, Failures: 0, Errors: 0, Skipped: 0, Time elapsed: 0.004 s - in org.assertj.core.internal.strings.Strings_assertEqualsIgnoringCase_Test
[INFO] Running org.assertj.core.internal.strings.Strings_assertContainsWhitespaces_Test
[INFO] Tests run: 16, Failures: 0, Errors: 0, Skipped: 0, Time elapsed: 0.008 s - in org.assertj.core.internal.strings.Strings_assertContainsWhitespaces_Test
[INFO] Running org.assertj.core.internal.strings.Strings_assertIsSubstringOf_Test
[INFO] Tests run: 9, Failures: 0, Errors: 0, Skipped: 0, Time elapsed: 0.003 s - in org.assertj.core.internal.strings.Strings_assertIsSubstringOf_Test
[INFO] Running org.assertj.core.internal.strings.Strings_assertDoesNotStartWith_Test
[INFO] Tests run: 6, Failures: 0, Errors: 0, Skipped: 0, Time elapsed: 0.002 s - in org.assertj.core.internal.strings.Strings_assertDoesNotStartWith_Test
[INFO] Running org.assertj.core.internal.strings.Strings_assertIsEqualsToIgnoringNewLines_Test
[INFO] Tests run: 2, Failures: 0, Errors: 0, Skipped: 0, Time elapsed: 0.002 s - in org.assertj.core.internal.strings.Strings_assertIsEqualsToIgnoringNewLines_Test
[INFO] Running org.assertj.core.internal.strings.Strings_assertHasLinesCount_Test
[INFO] Tests run: 6, Failures: 0, Errors: 0, Skipped: 0, Time elapsed: 0.009 s - in org.assertj.core.internal.strings.Strings_assertHasLinesCount_Test
[INFO] Running org.assertj.core.internal.strings.Strings_assertContainsPattern_Pattern_Test
[INFO] Tests run: 8, Failures: 0, Errors: 0, Skipped: 0, Time elapsed: 0.005 s - in org.assertj.core.internal.strings.Strings_assertContainsPattern_Pattern_Test
[INFO] Running org.assertj.core.internal.strings.Strings_assertDoesNotContainAnyWhitespaces_Test
[INFO] Tests run: 11, Failures: 0, Errors: 0, Skipped: 0, Time elapsed: 0.008 s - in org.assertj.core.internal.strings.Strings_assertDoesNotContainAnyWhitespaces_Test
[INFO] Running org.assertj.core.internal.strings.Strings_assertContains_Test
[INFO] Tests run: 11, Failures: 0, Errors: 0, Skipped: 0, Time elapsed: 0.005 s - in org.assertj.core.internal.strings.Strings_assertContains_Test
[INFO] Running org.assertj.core.internal.strings.Strings_assertHasSameSizeAs_with_Iterable_Test
[INFO] Tests run: 3, Failures: 0, Errors: 0, Skipped: 0, Time elapsed: 0.002 s - in org.assertj.core.internal.strings.Strings_assertHasSameSizeAs_with_Iterable_Test
[INFO] Running org.assertj.core.internal.strings.Strings_assertNotJavaBlank_Test
[INFO] Tests run: 12, Failures: 0, Errors: 0, Skipped: 0, Time elapsed: 0.007 s - in org.assertj.core.internal.strings.Strings_assertNotJavaBlank_Test
[INFO] Running org.assertj.core.internal.strings.Strings_assertHasSizeGreaterThanOrEqualTo_Test
[INFO] Tests run: 4, Failures: 0, Errors: 0, Skipped: 0, Time elapsed: 0.002 s - in org.assertj.core.internal.strings.Strings_assertHasSizeGreaterThanOrEqualTo_Test
[INFO] Running org.assertj.core.internal.strings.Strings_assertContainsSequence_Test
[INFO] Tests run: 12, Failures: 0, Errors: 0, Skipped: 0, Time elapsed: 0.007 s - in org.assertj.core.internal.strings.Strings_assertContainsSequence_Test
[INFO] Running org.assertj.core.internal.strings.Strings_assertHasSizeLessThanOrEqualTo_Test
[INFO] Tests run: 4, Failures: 0, Errors: 0, Skipped: 0, Time elapsed: 0.002 s - in org.assertj.core.internal.strings.Strings_assertHasSizeLessThanOrEqualTo_Test
[INFO] Running org.assertj.core.internal.strings.Strings_assertEmpty_Test
[INFO] Tests run: 6, Failures: 0, Errors: 0, Skipped: 0, Time elapsed: 0.003 s - in org.assertj.core.internal.strings.Strings_assertEmpty_Test
[INFO] Running org.assertj.core.internal.strings.Strings_assertDoesNotEndWith_Test
[INFO] Tests run: 6, Failures: 0, Errors: 0, Skipped: 0, Time elapsed: 0.003 s - in org.assertj.core.internal.strings.Strings_assertDoesNotEndWith_Test
[INFO] Running org.assertj.core.internal.strings.Strings_assertIsEqualToNormalizingNewlines_Test
[INFO] Tests run: 3, Failures: 0, Errors: 0, Skipped: 0, Time elapsed: 0.001 s - in org.assertj.core.internal.strings.Strings_assertIsEqualToNormalizingNewlines_Test
[INFO] Running org.assertj.core.internal.strings.Strings_assertContainsIgnoringCase_Test
[INFO] Tests run: 10, Failures: 0, Errors: 0, Skipped: 0, Time elapsed: 0.004 s - in org.assertj.core.internal.strings.Strings_assertContainsIgnoringCase_Test
[INFO] Running org.assertj.core.internal.strings.Strings_assertContainsPattern_CharSequence_Test
[INFO] Tests run: 10, Failures: 0, Errors: 0, Skipped: 0, Time elapsed: 0.005 s - in org.assertj.core.internal.strings.Strings_assertContainsPattern_CharSequence_Test
[INFO] Running org.assertj.core.internal.strings.Strings_assertDoesNotContainOnlyWhitespaces_Test
[INFO] Tests run: 12, Failures: 0, Errors: 0, Skipped: 0, Time elapsed: 0.007 s - in org.assertj.core.internal.strings.Strings_assertDoesNotContainOnlyWhitespaces_Test
[INFO] Running org.assertj.core.internal.strings.Strings_assertDoesNotMatch_Pattern_Test
[INFO] Tests run: 8, Failures: 0, Errors: 0, Skipped: 0, Time elapsed: 0.003 s - in org.assertj.core.internal.strings.Strings_assertDoesNotMatch_Pattern_Test
[INFO] Running org.assertj.core.internal.strings.Strings_assertDoesNotContainPattern_Pattern_Test
[INFO] Tests run: 8, Failures: 0, Errors: 0, Skipped: 0, Time elapsed: 0.004 s - in org.assertj.core.internal.strings.Strings_assertDoesNotContainPattern_Pattern_Test
[INFO] Running org.assertj.core.internal.doubles.Doubles_assertGreaterThan_Test
[INFO] Tests run: 7, Failures: 0, Errors: 0, Skipped: 0, Time elapsed: 0.003 s - in org.assertj.core.internal.doubles.Doubles_assertGreaterThan_Test
[INFO] Running org.assertj.core.internal.doubles.Doubles_assertLessThanOrEqualTo_Test
[INFO] Tests run: 8, Failures: 0, Errors: 0, Skipped: 0, Time elapsed: 0.003 s - in org.assertj.core.internal.doubles.Doubles_assertLessThanOrEqualTo_Test
[INFO] Running org.assertj.core.internal.doubles.Doubles_assertIsCloseToPercentage_Test
[INFO] Tests run: 24, Failures: 0, Errors: 0, Skipped: 0, Time elapsed: 0.014 s - in org.assertj.core.internal.doubles.Doubles_assertIsCloseToPercentage_Test
[INFO] Running org.assertj.core.internal.doubles.Doubles_assertIsPositive_Test
[INFO] Tests run: 4, Failures: 0, Errors: 0, Skipped: 0, Time elapsed: 0.001 s - in org.assertj.core.internal.doubles.Doubles_assertIsPositive_Test
[INFO] Running org.assertj.core.internal.doubles.Doubles_assertGreaterThanOrEqualTo_Test
[INFO] Tests run: 8, Failures: 0, Errors: 0, Skipped: 0, Time elapsed: 0.003 s - in org.assertj.core.internal.doubles.Doubles_assertGreaterThanOrEqualTo_Test
[INFO] Running org.assertj.core.internal.doubles.Doubles_assertIsNotCloseToPercentage_Test
[INFO] Tests run: 23, Failures: 0, Errors: 0, Skipped: 0, Time elapsed: 0.014 s - in org.assertj.core.internal.doubles.Doubles_assertIsNotCloseToPercentage_Test
[INFO] Running org.assertj.core.internal.doubles.Doubles_assertIsNaN_Test
[INFO] Tests run: 4, Failures: 0, Errors: 0, Skipped: 0, Time elapsed: 0.002 s - in org.assertj.core.internal.doubles.Doubles_assertIsNaN_Test
[INFO] Running org.assertj.core.internal.doubles.Doubles_assertIsNotPositive_Test
[INFO] Tests run: 5, Failures: 0, Errors: 0, Skipped: 0, Time elapsed: 0.002 s - in org.assertj.core.internal.doubles.Doubles_assertIsNotPositive_Test
[INFO] Running org.assertj.core.internal.doubles.Doubles_assertIsStrictlyBetween_Test
[INFO] Tests run: 8, Failures: 0, Errors: 0, Skipped: 0, Time elapsed: 0.004 s - in org.assertj.core.internal.doubles.Doubles_assertIsStrictlyBetween_Test
[INFO] Running org.assertj.core.internal.doubles.Doubles_assertIsNotCloseTo_Test
[INFO] Tests run: 17, Failures: 0, Errors: 0, Skipped: 0, Time elapsed: 0.009 s - in org.assertj.core.internal.doubles.Doubles_assertIsNotCloseTo_Test
[INFO] Running org.assertj.core.internal.doubles.Doubles_NaN_Test
[INFO] Tests run: 1, Failures: 0, Errors: 0, Skipped: 0, Time elapsed: 0 s - in org.assertj.core.internal.doubles.Doubles_NaN_Test
[INFO] Running org.assertj.core.internal.doubles.Doubles_assertIsNotNaN_Test
[INFO] Tests run: 4, Failures: 0, Errors: 0, Skipped: 0, Time elapsed: 0.001 s - in org.assertj.core.internal.doubles.Doubles_assertIsNotNaN_Test
[INFO] Running org.assertj.core.internal.doubles.Doubles_assertIsZero_Test
[INFO] Tests run: 5, Failures: 0, Errors: 0, Skipped: 0, Time elapsed: 0.003 s - in org.assertj.core.internal.doubles.Doubles_assertIsZero_Test
[INFO] Running org.assertj.core.internal.doubles.Doubles_assertIsNegative_Test
[INFO] Tests run: 4, Failures: 0, Errors: 0, Skipped: 0, Time elapsed: 0.003 s - in org.assertj.core.internal.doubles.Doubles_assertIsNegative_Test
[INFO] Running org.assertj.core.internal.doubles.Doubles_assertIsBetween_Test
[INFO] Tests run: 8, Failures: 0, Errors: 0, Skipped: 0, Time elapsed: 0.003 s - in org.assertj.core.internal.doubles.Doubles_assertIsBetween_Test
[INFO] Running org.assertj.core.internal.doubles.Doubles_assertIsNotNegative_Test
[INFO] Tests run: 5, Failures: 0, Errors: 0, Skipped: 0, Time elapsed: 0.002 s - in org.assertj.core.internal.doubles.Doubles_assertIsNotNegative_Test
[INFO] Running org.assertj.core.internal.doubles.Doubles_assertIsNotZero_Test
[INFO] Tests run: 4, Failures: 0, Errors: 0, Skipped: 0, Time elapsed: 0.002 s - in org.assertj.core.internal.doubles.Doubles_assertIsNotZero_Test
[INFO] Running org.assertj.core.internal.doubles.Doubles_assertIsCloseTo_Test
[INFO] Tests run: 22, Failures: 0, Errors: 0, Skipped: 0, Time elapsed: 0.01 s - in org.assertj.core.internal.doubles.Doubles_assertIsCloseTo_Test
[INFO] Running org.assertj.core.internal.doubles.Doubles_assertIsOne_Test
[INFO] Tests run: 4, Failures: 0, Errors: 0, Skipped: 0, Time elapsed: 0.001 s - in org.assertj.core.internal.doubles.Doubles_assertIsOne_Test
[INFO] Running org.assertj.core.internal.doubles.Doubles_assertEqual_Test
[INFO] Tests run: 6, Failures: 0, Errors: 0, Skipped: 0, Time elapsed: 0.002 s - in org.assertj.core.internal.doubles.Doubles_assertEqual_Test
[INFO] Running org.assertj.core.internal.doubles.Doubles_assertLessThan_Test
[INFO] Tests run: 8, Failures: 0, Errors: 0, Skipped: 0, Time elapsed: 0.004 s - in org.assertj.core.internal.doubles.Doubles_assertLessThan_Test
[INFO] Running org.assertj.core.internal.doubles.Doubles_assertNotEqual_Test
[INFO] Tests run: 6, Failures: 0, Errors: 0, Skipped: 0, Time elapsed: 0.003 s - in org.assertj.core.internal.doubles.Doubles_assertNotEqual_Test
[INFO] Running org.assertj.core.internal.RecursiveFieldByFieldComparator_toString_Test
[INFO] Tests run: 1, Failures: 0, Errors: 0, Skipped: 0, Time elapsed: 0.001 s - in org.assertj.core.internal.RecursiveFieldByFieldComparator_toString_Test
[INFO] Running org.assertj.core.internal.chararrays.CharArrays_assertStartsWith_Test
[INFO] Tests run: 17, Failures: 0, Errors: 0, Skipped: 0, Time elapsed: 0.007 s - in org.assertj.core.internal.chararrays.CharArrays_assertStartsWith_Test
[INFO] Running org.assertj.core.internal.chararrays.CharArrays_assertNotEmpty_Test
[INFO] Tests run: 3, Failures: 0, Errors: 0, Skipped: 0, Time elapsed: 0.002 s - in org.assertj.core.internal.chararrays.CharArrays_assertNotEmpty_Test
[INFO] Running org.assertj.core.internal.chararrays.CharArrays_assertContainsAnyOf_Test
[INFO] Tests run: 1, Failures: 0, Errors: 0, Skipped: 0, Time elapsed: 0.001 s - in org.assertj.core.internal.chararrays.CharArrays_assertContainsAnyOf_Test
[INFO] Running org.assertj.core.internal.chararrays.CharArrays_assertHasSizeLessThan_Test
[INFO] Tests run: 3, Failures: 0, Errors: 0, Skipped: 0, Time elapsed: 0.001 s - in org.assertj.core.internal.chararrays.CharArrays_assertHasSizeLessThan_Test
[INFO] Running org.assertj.core.internal.chararrays.CharArrays_assertContainsExactly_Test
[INFO] Tests run: 16, Failures: 0, Errors: 0, Skipped: 0, Time elapsed: 0.035 s - in org.assertj.core.internal.chararrays.CharArrays_assertContainsExactly_Test
[INFO] Running org.assertj.core.internal.chararrays.CharArrays_assertHasSizeGreaterThan_Test
[INFO] Tests run: 3, Failures: 0, Errors: 0, Skipped: 0, Time elapsed: 0 s - in org.assertj.core.internal.chararrays.CharArrays_assertHasSizeGreaterThan_Test
[INFO] Running org.assertj.core.internal.chararrays.CharArrays_assertIsSorted_Test
[INFO] Tests run: 10, Failures: 0, Errors: 0, Skipped: 0, Time elapsed: 0 s - in org.assertj.core.internal.chararrays.CharArrays_assertIsSorted_Test
[INFO] Running org.assertj.core.internal.chararrays.CharArrays_assertHasSize_Test
[INFO] Tests run: 3, Failures: 0, Errors: 0, Skipped: 0, Time elapsed: 0 s - in org.assertj.core.internal.chararrays.CharArrays_assertHasSize_Test
[INFO] Running org.assertj.core.internal.chararrays.CharArrays_assertHasSameSizeAs_with_Array_Test
[INFO] Tests run: 3, Failures: 0, Errors: 0, Skipped: 0, Time elapsed: 0 s - in org.assertj.core.internal.chararrays.CharArrays_assertHasSameSizeAs_with_Array_Test
[INFO] Running org.assertj.core.internal.chararrays.CharArrays_assertContains_Test
[INFO] Tests run: 1, Failures: 0, Errors: 0, Skipped: 0, Time elapsed: 0 s - in org.assertj.core.internal.chararrays.CharArrays_assertContains_Test
[INFO] Running org.assertj.core.internal.chararrays.CharArrays_assertHasSizeLessThanOrEqualTo_Test
[INFO] Tests run: 4, Failures: 0, Errors: 0, Skipped: 0, Time elapsed: 0 s - in org.assertj.core.internal.chararrays.CharArrays_assertHasSizeLessThanOrEqualTo_Test
[INFO] Running org.assertj.core.internal.chararrays.CharArrays_assertHasSameSizeAs_with_Iterable_Test
[INFO] Tests run: 3, Failures: 0, Errors: 0, Skipped: 0, Time elapsed: 0 s - in org.assertj.core.internal.chararrays.CharArrays_assertHasSameSizeAs_with_Iterable_Test
[INFO] Running org.assertj.core.internal.chararrays.CharArrays_assertNullOrEmpty_Test
[INFO] Tests run: 3, Failures: 0, Errors: 0, Skipped: 0, Time elapsed: 0 s - in org.assertj.core.internal.chararrays.CharArrays_assertNullOrEmpty_Test
[INFO] Running org.assertj.core.internal.chararrays.CharArrays_assertContainsSequence_Test
[INFO] Tests run: 17, Failures: 0, Errors: 0, Skipped: 0, Time elapsed: 0 s - in org.assertj.core.internal.chararrays.CharArrays_assertContainsSequence_Test
[INFO] Running org.assertj.core.internal.chararrays.CharArrays_assertDoesNotContain_Test
[INFO] Tests run: 12, Failures: 0, Errors: 0, Skipped: 0, Time elapsed: 0.004 s - in org.assertj.core.internal.chararrays.CharArrays_assertDoesNotContain_Test
[INFO] Running org.assertj.core.internal.chararrays.CharArrays_assertContainsOnlyOnce_Test
[INFO] Tests run: 17, Failures: 0, Errors: 0, Skipped: 0, Time elapsed: 0.014 s - in org.assertj.core.internal.chararrays.CharArrays_assertContainsOnlyOnce_Test
[INFO] Running org.assertj.core.internal.chararrays.CharArrays_assertDoesNotContain_at_Index_Test
[INFO] Tests run: 12, Failures: 0, Errors: 0, Skipped: 0, Time elapsed: 0.012 s - in org.assertj.core.internal.chararrays.CharArrays_assertDoesNotContain_at_Index_Test
[INFO] Running org.assertj.core.internal.chararrays.CharArrays_assertContains_at_Index_Test
[INFO] Tests run: 12, Failures: 0, Errors: 0, Skipped: 0, Time elapsed: 0.007 s - in org.assertj.core.internal.chararrays.CharArrays_assertContains_at_Index_Test
[INFO] Running org.assertj.core.internal.chararrays.CharArrays_assertIsSortedAccordingToComparator_Test
[INFO] Tests run: 5, Failures: 0, Errors: 0, Skipped: 0, Time elapsed: 0.002 s - in org.assertj.core.internal.chararrays.CharArrays_assertIsSortedAccordingToComparator_Test
[INFO] Running org.assertj.core.internal.chararrays.CharArrays_assertContainsOnly_Test
[INFO] Tests run: 17, Failures: 0, Errors: 0, Skipped: 0, Time elapsed: 0.007 s - in org.assertj.core.internal.chararrays.CharArrays_assertContainsOnly_Test
[INFO] Running org.assertj.core.internal.chararrays.CharArrays_assertEmpty_Test
[INFO] Tests run: 3, Failures: 0, Errors: 0, Skipped: 0, Time elapsed: 0.001 s - in org.assertj.core.internal.chararrays.CharArrays_assertEmpty_Test
[INFO] Running org.assertj.core.internal.chararrays.CharArrays_assertContainsExactlyInAnyOrder_Test
[INFO] Tests run: 20, Failures: 0, Errors: 0, Skipped: 0, Time elapsed: 0.009 s - in org.assertj.core.internal.chararrays.CharArrays_assertContainsExactlyInAnyOrder_Test
[INFO] Running org.assertj.core.internal.chararrays.CharArrays_assertHasSizeBetween_Test
[INFO] Tests run: 5, Failures: 0, Errors: 0, Skipped: 0, Time elapsed: 0.002 s - in org.assertj.core.internal.chararrays.CharArrays_assertHasSizeBetween_Test
[INFO] Running org.assertj.core.internal.chararrays.CharArrays_assertHasSizeGreaterThanOrEqualTo_Test
[INFO] Tests run: 4, Failures: 0, Errors: 0, Skipped: 0, Time elapsed: 0.002 s - in org.assertj.core.internal.chararrays.CharArrays_assertHasSizeGreaterThanOrEqualTo_Test
[INFO] Running org.assertj.core.internal.chararrays.CharArrays_assertDoesNotHaveDuplicates_Test
[INFO] Tests run: 8, Failures: 0, Errors: 0, Skipped: 0, Time elapsed: 0.006 s - in org.assertj.core.internal.chararrays.CharArrays_assertDoesNotHaveDuplicates_Test
[INFO] Running org.assertj.core.internal.chararrays.CharArrays_assertEndsWith_Test
[INFO] Tests run: 17, Failures: 0, Errors: 0, Skipped: 0, Time elapsed: 0.006 s - in org.assertj.core.internal.chararrays.CharArrays_assertEndsWith_Test
[INFO] Running org.assertj.core.internal.classes.Classes_assertHasDeclaredMethods_Test
[INFO] Tests run: 5, Failures: 0, Errors: 0, Skipped: 0, Time elapsed: 0.003 s - in org.assertj.core.internal.classes.Classes_assertHasDeclaredMethods_Test
[INFO] Running org.assertj.core.internal.classes.Classes_assertIsAssignableFrom_Test
[INFO] Tests run: 5, Failures: 0, Errors: 0, Skipped: 0, Time elapsed: 0.002 s - in org.assertj.core.internal.classes.Classes_assertIsAssignableFrom_Test
[INFO] Running org.assertj.core.internal.classes.Classes_assertContainsAnnotation_Test
[INFO] Tests run: 5, Failures: 0, Errors: 0, Skipped: 0, Time elapsed: 0.003 s - in org.assertj.core.internal.classes.Classes_assertContainsAnnotation_Test
[INFO] Running org.assertj.core.internal.classes.Classes_assertIsInterface_Test
[INFO] Tests run: 3, Failures: 0, Errors: 0, Skipped: 0, Time elapsed: 0.002 s - in org.assertj.core.internal.classes.Classes_assertIsInterface_Test
[INFO] Running org.assertj.core.internal.classes.Classes_assertHasOnlyPublicFields_Test
[INFO] Tests run: 9, Failures: 0, Errors: 0, Skipped: 0, Time elapsed: 0.006 s - in org.assertj.core.internal.classes.Classes_assertHasOnlyPublicFields_Test
[INFO] Running org.assertj.core.internal.classes.Classes_assertIsNotInterface_Test
[INFO] Tests run: 3, Failures: 0, Errors: 0, Skipped: 0, Time elapsed: 0.001 s - in org.assertj.core.internal.classes.Classes_assertIsNotInterface_Test
[INFO] Running org.assertj.core.internal.classes.Classes_assertIsNotAnnotation_Test
[INFO] Tests run: 3, Failures: 0, Errors: 0, Skipped: 0, Time elapsed: 0.002 s - in org.assertj.core.internal.classes.Classes_assertIsNotAnnotation_Test
[INFO] Running org.assertj.core.internal.classes.Classes_assertHasPublicFields_Test
[INFO] Tests run: 6, Failures: 0, Errors: 0, Skipped: 0, Time elapsed: 0.003 s - in org.assertj.core.internal.classes.Classes_assertHasPublicFields_Test
[INFO] Running org.assertj.core.internal.classes.Classes_assertHasMethods_Test
[INFO] Tests run: 5, Failures: 0, Errors: 0, Skipped: 0, Time elapsed: 0.003 s - in org.assertj.core.internal.classes.Classes_assertHasMethods_Test
[INFO] Running org.assertj.core.internal.classes.Classes_assertHasPublicMethods_Test
[INFO] Tests run: 5, Failures: 0, Errors: 0, Skipped: 0, Time elapsed: 0.003 s - in org.assertj.core.internal.classes.Classes_assertHasPublicMethods_Test
[INFO] Running org.assertj.core.internal.classes.Classes_assertIsPublic_Test
[INFO] Tests run: 3, Failures: 0, Errors: 0, Skipped: 0, Time elapsed: 0.001 s - in org.assertj.core.internal.classes.Classes_assertIsPublic_Test
[INFO] Running org.assertj.core.internal.classes.Classes_assertIsAnnotation_Test
[INFO] Tests run: 3, Failures: 0, Errors: 0, Skipped: 0, Time elapsed: 0.001 s - in org.assertj.core.internal.classes.Classes_assertIsAnnotation_Test
[INFO] Running org.assertj.core.internal.classes.Classes_assertHasDeclaredFields_Test
[INFO] Tests run: 5, Failures: 0, Errors: 0, Skipped: 0, Time elapsed: 0.003 s - in org.assertj.core.internal.classes.Classes_assertHasDeclaredFields_Test
[INFO] Running org.assertj.core.internal.classes.Classes_assertIsNotFinal_Test
[INFO] Tests run: 3, Failures: 0, Errors: 0, Skipped: 0, Time elapsed: 0.001 s - in org.assertj.core.internal.classes.Classes_assertIsNotFinal_Test
[INFO] Running org.assertj.core.internal.classes.Classes_assertHasOnlyDeclaredFields_Test
[INFO] Tests run: 8, Failures: 0, Errors: 0, Skipped: 0, Time elapsed: 0.003 s - in org.assertj.core.internal.classes.Classes_assertHasOnlyDeclaredFields_Test
[INFO] Running org.assertj.core.internal.classes.Classes_assertIsFinal_Test
[INFO] Tests run: 3, Failures: 0, Errors: 0, Skipped: 0, Time elapsed: 0.001 s - in org.assertj.core.internal.classes.Classes_assertIsFinal_Test
[INFO] Running org.assertj.core.internal.classes.Classes_assertIsProtected_Test
[INFO] Tests run: 3, Failures: 0, Errors: 0, Skipped: 0, Time elapsed: 0.001 s - in org.assertj.core.internal.classes.Classes_assertIsProtected_Test
[INFO] Running org.assertj.core.internal.StandardComparisonStrategy_iterableContains_Test
[INFO] Tests run: 2, Failures: 0, Errors: 0, Skipped: 0, Time elapsed: 0 s - in org.assertj.core.internal.StandardComparisonStrategy_iterableContains_Test
[INFO] Running org.assertj.core.internal.Digests_digestDiff_Test
[INFO] Tests run: 6, Failures: 0, Errors: 0, Skipped: 0, Time elapsed: 0.003 s - in org.assertj.core.internal.Digests_digestDiff_Test
[INFO] Running org.assertj.core.internal.StandardComparisonStrategy_isGreaterThan_Test
[INFO] Tests run: 3, Failures: 0, Errors: 0, Skipped: 0, Time elapsed: 0.014 s - in org.assertj.core.internal.StandardComparisonStrategy_isGreaterThan_Test
[INFO] Running org.assertj.core.internal.OnFieldsComparator_toString_Test
[INFO] Tests run: 2, Failures: 0, Errors: 0, Skipped: 0, Time elapsed: 0.001 s - in org.assertj.core.internal.OnFieldsComparator_toString_Test
[INFO] Running org.assertj.core.internal.bigdecimals.BigDecimals_assertIsBetween_Test
[INFO] Tests run: 8, Failures: 0, Errors: 0, Skipped: 0, Time elapsed: 0.003 s - in org.assertj.core.internal.bigdecimals.BigDecimals_assertIsBetween_Test
[INFO] Running org.assertj.core.internal.bigdecimals.BigDecimals_assertIsPositive_Test
[INFO] Tests run: 5, Failures: 0, Errors: 0, Skipped: 0, Time elapsed: 0.003 s - in org.assertj.core.internal.bigdecimals.BigDecimals_assertIsPositive_Test
[INFO] Running org.assertj.core.internal.bigdecimals.BigDecimals_assertGreaterThanOrEqualTo_Test
[INFO] Tests run: 8, Failures: 0, Errors: 0, Skipped: 0, Time elapsed: 0.002 s - in org.assertj.core.internal.bigdecimals.BigDecimals_assertGreaterThanOrEqualTo_Test
[INFO] Running org.assertj.core.internal.bigdecimals.BigDecimals_assertIsNotPositive_Test
[INFO] Tests run: 5, Failures: 0, Errors: 0, Skipped: 0, Time elapsed: 0.012 s - in org.assertj.core.internal.bigdecimals.BigDecimals_assertIsNotPositive_Test
[INFO] Running org.assertj.core.internal.bigdecimals.BigDecimals_assertIsCloseTo_Test
[INFO] Tests run: 20, Failures: 0, Errors: 0, Skipped: 0, Time elapsed: 0.019 s - in org.assertj.core.internal.bigdecimals.BigDecimals_assertIsCloseTo_Test
[INFO] Running org.assertj.core.internal.bigdecimals.BigDecimals_assertIsNotCloseToPercentage_Test
[INFO] Tests run: 16, Failures: 0, Errors: 0, Skipped: 0, Time elapsed: 0.018 s - in org.assertj.core.internal.bigdecimals.BigDecimals_assertIsNotCloseToPercentage_Test
[INFO] Running org.assertj.core.internal.bigdecimals.BigDecimals_assertIsZero_Test
[INFO] Tests run: 4, Failures: 0, Errors: 0, Skipped: 0, Time elapsed: 0.003 s - in org.assertj.core.internal.bigdecimals.BigDecimals_assertIsZero_Test
[INFO] Running org.assertj.core.internal.bigdecimals.BigDecimals_assertGreaterThan_Test
[INFO] Tests run: 8, Failures: 0, Errors: 0, Skipped: 0, Time elapsed: 0.003 s - in org.assertj.core.internal.bigdecimals.BigDecimals_assertGreaterThan_Test
[INFO] Running org.assertj.core.internal.bigdecimals.BigDecimals_assertNotEqualByComparison_Test
[INFO] Tests run: 6, Failures: 0, Errors: 0, Skipped: 0, Time elapsed: 0.003 s - in org.assertj.core.internal.bigdecimals.BigDecimals_assertNotEqualByComparison_Test
[INFO] Running org.assertj.core.internal.bigdecimals.BigDecimals_assertIsStrictlyBetween_Test
[INFO] Tests run: 10, Failures: 0, Errors: 0, Skipped: 0, Time elapsed: 0.006 s - in org.assertj.core.internal.bigdecimals.BigDecimals_assertIsStrictlyBetween_Test
[INFO] Running org.assertj.core.internal.bigdecimals.BigDecimals_assertIsNotZero_Test
[INFO] Tests run: 4, Failures: 0, Errors: 0, Skipped: 0, Time elapsed: 0.003 s - in org.assertj.core.internal.bigdecimals.BigDecimals_assertIsNotZero_Test
[INFO] Running org.assertj.core.internal.bigdecimals.BigDecimals_assertLessThan_Test
[INFO] Tests run: 8, Failures: 0, Errors: 0, Skipped: 0, Time elapsed: 0.005 s - in org.assertj.core.internal.bigdecimals.BigDecimals_assertLessThan_Test
[INFO] Running org.assertj.core.internal.bigdecimals.BigDecimals_assertEqualByComparison_Test
[INFO] Tests run: 6, Failures: 0, Errors: 0, Skipped: 0, Time elapsed: 0.01 s - in org.assertj.core.internal.bigdecimals.BigDecimals_assertEqualByComparison_Test
[INFO] Running org.assertj.core.internal.bigdecimals.BigDecimals_assertIsNotNegative_Test
[INFO] Tests run: 5, Failures: 0, Errors: 0, Skipped: 0, Time elapsed: 0.002 s - in org.assertj.core.internal.bigdecimals.BigDecimals_assertIsNotNegative_Test
[INFO] Running org.assertj.core.internal.bigdecimals.BigDecimals_assertEqual_Test
[INFO] Tests run: 6, Failures: 0, Errors: 0, Skipped: 0, Time elapsed: 0.002 s - in org.assertj.core.internal.bigdecimals.BigDecimals_assertEqual_Test
[INFO] Running org.assertj.core.internal.bigdecimals.BigDecimals_assertIsNegative_Test
[INFO] Tests run: 5, Failures: 0, Errors: 0, Skipped: 0, Time elapsed: 0.002 s - in org.assertj.core.internal.bigdecimals.BigDecimals_assertIsNegative_Test
[INFO] Running org.assertj.core.internal.bigdecimals.BigDecimals_assertIsOne_Test
[INFO] Tests run: 4, Failures: 0, Errors: 0, Skipped: 0, Time elapsed: 0.002 s - in org.assertj.core.internal.bigdecimals.BigDecimals_assertIsOne_Test
[INFO] Running org.assertj.core.internal.bigdecimals.BigDecimals_assertIsNotCloseTo_Test
[INFO] Tests run: 24, Failures: 0, Errors: 0, Skipped: 0, Time elapsed: 0.022 s - in org.assertj.core.internal.bigdecimals.BigDecimals_assertIsNotCloseTo_Test
[INFO] Running org.assertj.core.internal.bigdecimals.BigDecimals_assertNotEqual_Test
[INFO] Tests run: 6, Failures: 0, Errors: 0, Skipped: 0, Time elapsed: 0.003 s - in org.assertj.core.internal.bigdecimals.BigDecimals_assertNotEqual_Test
[INFO] Running org.assertj.core.internal.bigdecimals.BigDecimals_assertIsCloseToPercentage_Test
[INFO] Tests run: 16, Failures: 0, Errors: 0, Skipped: 0, Time elapsed: 0.01 s - in org.assertj.core.internal.bigdecimals.BigDecimals_assertIsCloseToPercentage_Test
[INFO] Running org.assertj.core.internal.bigdecimals.BigDecimals_assertLessThanOrEqualTo_Test
[INFO] Tests run: 8, Failures: 0, Errors: 0, Skipped: 0, Time elapsed: 0.004 s - in org.assertj.core.internal.bigdecimals.BigDecimals_assertLessThanOrEqualTo_Test
[INFO] Running org.assertj.core.internal.ComparatorBasedComparisonStrategy_stringStartsWith_Test
[INFO] Tests run: 1, Failures: 0, Errors: 0, Skipped: 0, Time elapsed: 0 s - in org.assertj.core.internal.ComparatorBasedComparisonStrategy_stringStartsWith_Test
[INFO] Running org.assertj.core.internal.ExtendedByTypesComparator_toString_Test
[INFO] Tests run: 2, Failures: 0, Errors: 0, Skipped: 0, Time elapsed: 0.015 s - in org.assertj.core.internal.ExtendedByTypesComparator_toString_Test
[INFO] Running org.assertj.core.internal.ComparatorBasedComparisonStrategy_isLessThan_Test
[INFO] Tests run: 2, Failures: 0, Errors: 0, Skipped: 0, Time elapsed: 0.002 s - in org.assertj.core.internal.ComparatorBasedComparisonStrategy_isLessThan_Test
[INFO] Running org.assertj.core.internal.StandardComparisonStrategy_arrayContains_Test
[INFO] Tests run: 4, Failures: 0, Errors: 0, Skipped: 0, Time elapsed: 0.002 s - in org.assertj.core.internal.StandardComparisonStrategy_arrayContains_Test
[INFO] Running org.assertj.core.internal.characters.Characters_assertEqual_Test
[INFO] Tests run: 6, Failures: 0, Errors: 0, Skipped: 0, Time elapsed: 0.004 s - in org.assertj.core.internal.characters.Characters_assertEqual_Test
[INFO] Running org.assertj.core.internal.characters.Characters_assertGreaterThanOrEqualTo_Test
[INFO] Tests run: 8, Failures: 0, Errors: 0, Skipped: 0, Time elapsed: 0.001 s - in org.assertj.core.internal.characters.Characters_assertGreaterThanOrEqualTo_Test
[INFO] Running org.assertj.core.internal.characters.Characters_assertLessThan_Test
[INFO] Tests run: 8, Failures: 0, Errors: 0, Skipped: 0, Time elapsed: 0.003 s - in org.assertj.core.internal.characters.Characters_assertLessThan_Test
[INFO] Running org.assertj.core.internal.characters.Characters_assertLowerCase_Test
[INFO] Tests run: 6, Failures: 0, Errors: 0, Skipped: 0, Time elapsed: 0.002 s - in org.assertj.core.internal.characters.Characters_assertLowerCase_Test
[INFO] Running org.assertj.core.internal.characters.Characters_assertNotEqual_Test
[INFO] Tests run: 6, Failures: 0, Errors: 0, Skipped: 0, Time elapsed: 0.001 s - in org.assertj.core.internal.characters.Characters_assertNotEqual_Test
[INFO] Running org.assertj.core.internal.characters.Characters_assertUpperCase_Test
[INFO] Tests run: 6, Failures: 0, Errors: 0, Skipped: 0, Time elapsed: 0.001 s - in org.assertj.core.internal.characters.Characters_assertUpperCase_Test
[INFO] Running org.assertj.core.internal.characters.Characters_assertLessThanOrEqualTo_Test
[INFO] Tests run: 8, Failures: 0, Errors: 0, Skipped: 0, Time elapsed: 0.001 s - in org.assertj.core.internal.characters.Characters_assertLessThanOrEqualTo_Test
[INFO] Running org.assertj.core.internal.characters.Characters_assertGreaterThan_Test
[INFO] Tests run: 7, Failures: 0, Errors: 0, Skipped: 0, Time elapsed: 0.001 s - in org.assertj.core.internal.characters.Characters_assertGreaterThan_Test
[INFO] Running org.assertj.core.internal.bigintegers.BigIntegers_assertIsNotCloseToPercentage_Test
[INFO] Tests run: 16, Failures: 0, Errors: 0, Skipped: 0, Time elapsed: 0.015 s - in org.assertj.core.internal.bigintegers.BigIntegers_assertIsNotCloseToPercentage_Test
[INFO] Running org.assertj.core.internal.bigintegers.BigIntegers_assertIsStrictlyBetween_Test
[INFO] Tests run: 10, Failures: 0, Errors: 0, Skipped: 0, Time elapsed: 0.003 s - in org.assertj.core.internal.bigintegers.BigIntegers_assertIsStrictlyBetween_Test
[INFO] Running org.assertj.core.internal.bigintegers.BigIntegers_assertGreaterThanOrEqualTo_Test
[INFO] Tests run: 8, Failures: 0, Errors: 0, Skipped: 0, Time elapsed: 0.003 s - in org.assertj.core.internal.bigintegers.BigIntegers_assertGreaterThanOrEqualTo_Test
[INFO] Running org.assertj.core.internal.bigintegers.BigIntegers_assertEqual_Test
[INFO] Tests run: 6, Failures: 0, Errors: 0, Skipped: 0, Time elapsed: 0.001 s - in org.assertj.core.internal.bigintegers.BigIntegers_assertEqual_Test
[INFO] Running org.assertj.core.internal.bigintegers.BigIntegers_assertIsNotNegative_Test
[INFO] Tests run: 5, Failures: 0, Errors: 0, Skipped: 0, Time elapsed: 0.002 s - in org.assertj.core.internal.bigintegers.BigIntegers_assertIsNotNegative_Test
[INFO] Running org.assertj.core.internal.bigintegers.BigIntegers_assertEqualByComparison_Test
[INFO] Tests run: 6, Failures: 0, Errors: 0, Skipped: 0, Time elapsed: 0.003 s - in org.assertj.core.internal.bigintegers.BigIntegers_assertEqualByComparison_Test
[INFO] Running org.assertj.core.internal.bigintegers.BigIntegers_assertIsBetween_Test
[INFO] Tests run: 8, Failures: 0, Errors: 0, Skipped: 0, Time elapsed: 0.003 s - in org.assertj.core.internal.bigintegers.BigIntegers_assertIsBetween_Test
[INFO] Running org.assertj.core.internal.bigintegers.BigIntegers_assertIsNegative_Test
[INFO] Tests run: 5, Failures: 0, Errors: 0, Skipped: 0, Time elapsed: 0.002 s - in org.assertj.core.internal.bigintegers.BigIntegers_assertIsNegative_Test
[INFO] Running org.assertj.core.internal.bigintegers.BigIntegers_assertIsNotPositive_Test
[INFO] Tests run: 5, Failures: 0, Errors: 0, Skipped: 0, Time elapsed: 0.001 s - in org.assertj.core.internal.bigintegers.BigIntegers_assertIsNotPositive_Test
[INFO] Running org.assertj.core.internal.bigintegers.BigIntegers_assertNotEqualByComparison_Test
[INFO] Tests run: 6, Failures: 0, Errors: 0, Skipped: 0, Time elapsed: 0.004 s - in org.assertj.core.internal.bigintegers.BigIntegers_assertNotEqualByComparison_Test
[INFO] Running org.assertj.core.internal.bigintegers.BigIntegers_assertLessThan_Test
[INFO] Tests run: 8, Failures: 0, Errors: 0, Skipped: 0, Time elapsed: 0.004 s - in org.assertj.core.internal.bigintegers.BigIntegers_assertLessThan_Test
[INFO] Running org.assertj.core.internal.bigintegers.BigIntegers_assertIsOne_Test
[INFO] Tests run: 4, Failures: 0, Errors: 0, Skipped: 0, Time elapsed: 0.001 s - in org.assertj.core.internal.bigintegers.BigIntegers_assertIsOne_Test
[INFO] Running org.assertj.core.internal.bigintegers.BigIntegers_assertIsCloseTo_Test
[INFO] Tests run: 28, Failures: 0, Errors: 0, Skipped: 0, Time elapsed: 0.025 s - in org.assertj.core.internal.bigintegers.BigIntegers_assertIsCloseTo_Test
[INFO] Running org.assertj.core.internal.bigintegers.BigIntegers_assertIsNotCloseTo_Test
[INFO] Tests run: 21, Failures: 0, Errors: 0, Skipped: 0, Time elapsed: 0.019 s - in org.assertj.core.internal.bigintegers.BigIntegers_assertIsNotCloseTo_Test
[INFO] Running org.assertj.core.internal.bigintegers.BigIntegers_assertIsPositive_Test
[INFO] Tests run: 5, Failures: 0, Errors: 0, Skipped: 0, Time elapsed: 0.002 s - in org.assertj.core.internal.bigintegers.BigIntegers_assertIsPositive_Test
[INFO] Running org.assertj.core.internal.bigintegers.BigIntegers_assertNotEqual_Test
[INFO] Tests run: 6, Failures: 0, Errors: 0, Skipped: 0, Time elapsed: 0.001 s - in org.assertj.core.internal.bigintegers.BigIntegers_assertNotEqual_Test
[INFO] Running org.assertj.core.internal.bigintegers.BigIntegers_assertGreaterThan_Test
[INFO] Tests run: 8, Failures: 0, Errors: 0, Skipped: 0, Time elapsed: 0.002 s - in org.assertj.core.internal.bigintegers.BigIntegers_assertGreaterThan_Test
[INFO] Running org.assertj.core.internal.bigintegers.BigIntegers_assertLessThanOrEqualTo_Test
[INFO] Tests run: 8, Failures: 0, Errors: 0, Skipped: 0, Time elapsed: 0.002 s - in org.assertj.core.internal.bigintegers.BigIntegers_assertLessThanOrEqualTo_Test
[INFO] Running org.assertj.core.internal.bigintegers.BigIntegers_assertIsCloseToPercentage_Test
[INFO] Tests run: 16, Failures: 0, Errors: 0, Skipped: 0, Time elapsed: 0.012 s - in org.assertj.core.internal.bigintegers.BigIntegers_assertIsCloseToPercentage_Test
[INFO] Running org.assertj.core.internal.bigintegers.BigIntegers_assertIsNotZero_Test
[INFO] Tests run: 4, Failures: 0, Errors: 0, Skipped: 0, Time elapsed: 0.001 s - in org.assertj.core.internal.bigintegers.BigIntegers_assertIsNotZero_Test
[INFO] Running org.assertj.core.internal.bigintegers.BigIntegers_assertIsZero_Test
[INFO] Tests run: 4, Failures: 0, Errors: 0, Skipped: 0, Time elapsed: 0 s - in org.assertj.core.internal.bigintegers.BigIntegers_assertIsZero_Test
[INFO] Running org.assertj.core.internal.Arrays_assertContains_Test
[INFO] Tests run: 19, Failures: 0, Errors: 0, Skipped: 0, Time elapsed: 0.005 s - in org.assertj.core.internal.Arrays_assertContains_Test
[INFO] Running org.assertj.core.internal.ComparatorBasedComparisonStrategy_stringContains_Test
[INFO] Tests run: 1, Failures: 0, Errors: 0, Skipped: 0, Time elapsed: 0 s - in org.assertj.core.internal.ComparatorBasedComparisonStrategy_stringContains_Test
[INFO] Running org.assertj.core.internal.ComparatorBasedComparisonStrategy_duplicatesFrom_Test
[INFO] Tests run: 4, Failures: 0, Errors: 0, Skipped: 0, Time elapsed: 0.001 s - in org.assertj.core.internal.ComparatorBasedComparisonStrategy_duplicatesFrom_Test
[INFO] Running org.assertj.core.internal.IgnoringFieldsComparator_toString_Test
[INFO] Tests run: 1, Failures: 0, Errors: 0, Skipped: 0, Time elapsed: 0 s - in org.assertj.core.internal.IgnoringFieldsComparator_toString_Test
[INFO] Running org.assertj.core.internal.objects.Objects_assertNull_Test
[INFO] Tests run: 2, Failures: 0, Errors: 0, Skipped: 0, Time elapsed: 0 s - in org.assertj.core.internal.objects.Objects_assertNull_Test
[INFO] Running org.assertj.core.internal.objects.Objects_assertIsInstanceOf_Test
[INFO] Tests run: 4, Failures: 0, Errors: 0, Skipped: 0, Time elapsed: 0.001 s - in org.assertj.core.internal.objects.Objects_assertIsInstanceOf_Test
[INFO] Running org.assertj.core.internal.objects.Objects_assertIsNotInstanceOfAny_Test
[INFO] Tests run: 6, Failures: 0, Errors: 0, Skipped: 0, Time elapsed: 0.001 s - in org.assertj.core.internal.objects.Objects_assertIsNotInstanceOfAny_Test
[INFO] Running org.assertj.core.internal.objects.Objects_assertIsNotIn_with_Iterable_Test
[INFO] Tests run: 7, Failures: 0, Errors: 0, Skipped: 0, Time elapsed: 0.001 s - in org.assertj.core.internal.objects.Objects_assertIsNotIn_with_Iterable_Test
[INFO] Running org.assertj.core.internal.objects.Objects_assertIsEqualToComparingOnlyGivenFields_Test
[INFO] Tests run: 14, Failures: 0, Errors: 0, Skipped: 0, Time elapsed: 0.007 s - in org.assertj.core.internal.objects.Objects_assertIsEqualToComparingOnlyGivenFields_Test
[INFO] Running org.assertj.core.internal.objects.Objects_assertDoesNotHaveNotSameClassAs_Test
[INFO] Tests run: 4, Failures: 0, Errors: 0, Skipped: 0, Time elapsed: 0.001 s - in org.assertj.core.internal.objects.Objects_assertDoesNotHaveNotSameClassAs_Test
[INFO] Running org.assertj.core.internal.objects.Objects_assertIsNotIn_with_array_Test
[INFO] Tests run: 7, Failures: 0, Errors: 0, Skipped: 0, Time elapsed: 0.001 s - in org.assertj.core.internal.objects.Objects_assertIsNotIn_with_array_Test
[INFO] Running org.assertj.core.internal.objects.Objects_assertIsNotInstanceOf_Test
[INFO] Tests run: 4, Failures: 0, Errors: 0, Skipped: 0, Time elapsed: 0.001 s - in org.assertj.core.internal.objects.Objects_assertIsNotInstanceOf_Test
[INFO] Running org.assertj.core.internal.objects.Objects_assertHasAllNullFieldsOrPropertiesExcept_Test
[INFO] Tests run: 8, Failures: 0, Errors: 0, Skipped: 0, Time elapsed: 0.006 s - in org.assertj.core.internal.objects.Objects_assertHasAllNullFieldsOrPropertiesExcept_Test
[INFO] Running org.assertj.core.internal.objects.Objects_assertEqual_Test
[INFO] Tests run: 10, Failures: 0, Errors: 0, Skipped: 0, Time elapsed: 0.003 s - in org.assertj.core.internal.objects.Objects_assertEqual_Test
[INFO] Running org.assertj.core.internal.objects.Objects_assertSame_Test
[INFO] Tests run: 2, Failures: 0, Errors: 0, Skipped: 0, Time elapsed: 0.001 s - in org.assertj.core.internal.objects.Objects_assertSame_Test
[INFO] Running org.assertj.core.internal.objects.Objects_assertNotEqual_Test
[INFO] Tests run: 4, Failures: 0, Errors: 0, Skipped: 0, Time elapsed: 0.001 s - in org.assertj.core.internal.objects.Objects_assertNotEqual_Test
[INFO] Running org.assertj.core.internal.objects.Objects_assertIsEqualToIgnoringGivenFields_Test
[INFO] Tests run: 16, Failures: 0, Errors: 0, Skipped: 0, Time elapsed: 0.047 s - in org.assertj.core.internal.objects.Objects_assertIsEqualToIgnoringGivenFields_Test
[INFO] Running org.assertj.core.internal.objects.Objects_assertHasSameHashCodeAs_Test
[INFO] Tests run: 4, Failures: 0, Errors: 0, Skipped: 0, Time elapsed: 0.001 s - in org.assertj.core.internal.objects.Objects_assertHasSameHashCodeAs_Test
[INFO] Running org.assertj.core.internal.objects.Objects_assertNotSame_Test
[INFO] Tests run: 2, Failures: 0, Errors: 0, Skipped: 0, Time elapsed: 0 s - in org.assertj.core.internal.objects.Objects_assertNotSame_Test
[INFO] Running org.assertj.core.internal.objects.Objects_assertHasToString_Test
[INFO] Tests run: 3, Failures: 0, Errors: 0, Skipped: 0, Time elapsed: 0 s - in org.assertj.core.internal.objects.Objects_assertHasToString_Test
[INFO] Running org.assertj.core.internal.objects.Objects_assertIsEqualToComparingFieldByFieldRecursive_Test
[INFO] Tests run: 23, Failures: 0, Errors: 0, Skipped: 0, Time elapsed: 0.06 s - in org.assertj.core.internal.objects.Objects_assertIsEqualToComparingFieldByFieldRecursive_Test
[INFO] Running org.assertj.core.internal.objects.Objects_assertIsEqualToIgnoringNullFields_Test
[INFO] Tests run: 9, Failures: 0, Errors: 0, Skipped: 0, Time elapsed: 0.032 s - in org.assertj.core.internal.objects.Objects_assertIsEqualToIgnoringNullFields_Test
[INFO] Running org.assertj.core.internal.objects.Objects_assertIsIn_with_Iterable_Test
[INFO] Tests run: 7, Failures: 0, Errors: 0, Skipped: 0, Time elapsed: 0.001 s - in org.assertj.core.internal.objects.Objects_assertIsIn_with_Iterable_Test
[INFO] Running org.assertj.core.internal.objects.Objects_assertIsOfClassIn_Test
[INFO] Tests run: 5, Failures: 0, Errors: 0, Skipped: 0, Time elapsed: 0.001 s - in org.assertj.core.internal.objects.Objects_assertIsOfClassIn_Test
[INFO] Running org.assertj.core.internal.objects.Objects_assertHasSameClassAs_Test
[INFO] Tests run: 4, Failures: 0, Errors: 0, Skipped: 0, Time elapsed: 0.001 s - in org.assertj.core.internal.objects.Objects_assertHasSameClassAs_Test
[INFO] Running org.assertj.core.internal.objects.Objects_assertIsExactlyInstanceOf_Test
[INFO] Tests run: 4, Failures: 0, Errors: 0, Skipped: 0, Time elapsed: 0.002 s - in org.assertj.core.internal.objects.Objects_assertIsExactlyInstanceOf_Test
[INFO] Running org.assertj.core.internal.objects.Objects_assertIsNotOfClassIn_Test
[INFO] Tests run: 5, Failures: 0, Errors: 0, Skipped: 0, Time elapsed: 0.001 s - in org.assertj.core.internal.objects.Objects_assertIsNotOfClassIn_Test
[INFO] Running org.assertj.core.internal.objects.Objects_assertIsInstanceOfAny_Test
[INFO] Tests run: 6, Failures: 0, Errors: 0, Skipped: 0, Time elapsed: 0.001 s - in org.assertj.core.internal.objects.Objects_assertIsInstanceOfAny_Test
[INFO] Running org.assertj.core.internal.objects.Objects_assertNotNull_Test
[INFO] Tests run: 2, Failures: 0, Errors: 0, Skipped: 0, Time elapsed: 0.008 s - in org.assertj.core.internal.objects.Objects_assertNotNull_Test
[INFO] Running org.assertj.core.internal.objects.Objects_assertIsIn_with_array_Test
[INFO] Tests run: 7, Failures: 0, Errors: 0, Skipped: 0, Time elapsed: 0.003 s - in org.assertj.core.internal.objects.Objects_assertIsIn_with_array_Test
[INFO] Running org.assertj.core.internal.objects.Objects_assertIsNotExactlyInstanceOf_Test
[INFO] Tests run: 4, Failures: 0, Errors: 0, Skipped: 0, Time elapsed: 0.003 s - in org.assertj.core.internal.objects.Objects_assertIsNotExactlyInstanceOf_Test
[INFO] Running org.assertj.core.groups.FieldsOrPropertiesExtractor_extract_tuples_Test
[INFO] Tests run: 6, Failures: 0, Errors: 0, Skipped: 0, Time elapsed: 0.006 s - in org.assertj.core.groups.FieldsOrPropertiesExtractor_extract_tuples_Test
[INFO] Running org.assertj.core.groups.Properties_ofType_Test
[INFO] Tests run: 1, Failures: 0, Errors: 0, Skipped: 0, Time elapsed: 0.001 s - in org.assertj.core.groups.Properties_ofType_Test
[INFO] Running org.assertj.core.groups.Properties_from_with_array_Test
[INFO] Tests run: 1, Failures: 0, Errors: 0, Skipped: 0, Time elapsed: 0.017 s - in org.assertj.core.groups.Properties_from_with_array_Test
[INFO] Running org.assertj.core.groups.Properties_from_with_Collection_Test
[INFO] Tests run: 1, Failures: 0, Errors: 0, Skipped: 0, Time elapsed: 0.001 s - in org.assertj.core.groups.Properties_from_with_Collection_Test
[INFO] Running org.assertj.core.groups.FieldsOrPropertiesExtractor_assertNotNull_Test
[INFO] Tests run: 2, Failures: 0, Errors: 0, Skipped: 0, Time elapsed: 0.001 s - in org.assertj.core.groups.FieldsOrPropertiesExtractor_assertNotNull_Test
[INFO] Running org.assertj.core.groups.Properties_extractProperty_Test
[INFO] Tests run: 4, Failures: 0, Errors: 0, Skipped: 0, Time elapsed: 0.002 s - in org.assertj.core.groups.Properties_extractProperty_Test
[INFO] Running org.assertj.core.groups.FieldsOrPropertiesExtractor_extract_Test
[INFO] Tests run: 13, Failures: 0, Errors: 0, Skipped: 0, Time elapsed: 0.049 s - in org.assertj.core.groups.FieldsOrPropertiesExtractor_extract_Test
[INFO] Running org.assertj.core.condition.ConditionBuiltWithPredicateTest
[INFO] Tests run: 6, Failures: 0, Errors: 0, Skipped: 0, Time elapsed: 0 s - in org.assertj.core.condition.ConditionBuiltWithPredicateTest
[INFO] Running org.assertj.core.condition.AnyOf_anyOf_with_array_Test
[INFO] Tests run: 1, Failures: 0, Errors: 0, Skipped: 0, Time elapsed: 0 s - in org.assertj.core.condition.AnyOf_anyOf_with_array_Test
[INFO] Running org.assertj.core.condition.AllOf_matches_Test
[INFO] Tests run: 2, Failures: 0, Errors: 0, Skipped: 0, Time elapsed: 0 s - in org.assertj.core.condition.AllOf_matches_Test
[INFO] Running org.assertj.core.condition.Not_with_condition_Test
[INFO] Tests run: 1, Failures: 0, Errors: 0, Skipped: 0, Time elapsed: 0 s - in org.assertj.core.condition.Not_with_condition_Test
[INFO] Running org.assertj.core.condition.AnyOf_matches_Test
[INFO] Tests run: 2, Failures: 0, Errors: 0, Skipped: 0, Time elapsed: 0 s - in org.assertj.core.condition.AnyOf_matches_Test
[INFO] Running org.assertj.core.condition.Join_constructor_with_Collection_Test
[INFO] Tests run: 3, Failures: 0, Errors: 0, Skipped: 0, Time elapsed: 0 s - in org.assertj.core.condition.Join_constructor_with_Collection_Test
[INFO] Running org.assertj.core.condition.MatchPredicateTest
[INFO] Tests run: 7, Failures: 0, Errors: 0, Skipped: 0, Time elapsed: 0.004 s - in org.assertj.core.condition.MatchPredicateTest
[INFO] Running org.assertj.core.condition.AllOf_allOf_with_array_Test
[INFO] Tests run: 1, Failures: 0, Errors: 0, Skipped: 0, Time elapsed: 0.001 s - in org.assertj.core.condition.AllOf_allOf_with_array_Test
[INFO] Running org.assertj.core.condition.Not_toString_Test
[INFO] Tests run: 1, Failures: 0, Errors: 0, Skipped: 0, Time elapsed: 0.001 s - in org.assertj.core.condition.Not_toString_Test
[INFO] Running org.assertj.core.condition.DoesNotHave_with_condition_Test
[INFO] Tests run: 1, Failures: 0, Errors: 0, Skipped: 0, Time elapsed: 0 s - in org.assertj.core.condition.DoesNotHave_with_condition_Test
[INFO] Running org.assertj.core.condition.Not_matches_Test
[INFO] Tests run: 2, Failures: 0, Errors: 0, Skipped: 0, Time elapsed: 0.003 s - in org.assertj.core.condition.Not_matches_Test
[INFO] Running org.assertj.core.condition.AnyOf_toString_Test
[INFO] Tests run: 1, Failures: 0, Errors: 0, Skipped: 0, Time elapsed: 0.001 s - in org.assertj.core.condition.AnyOf_toString_Test
[INFO] Running org.assertj.core.condition.DoesNotHave_matches_Test
[INFO] Tests run: 2, Failures: 0, Errors: 0, Skipped: 0, Time elapsed: 0.001 s - in org.assertj.core.condition.DoesNotHave_matches_Test
[INFO] Running org.assertj.core.condition.DoesNotHave_toString_Test
[INFO] Tests run: 1, Failures: 0, Errors: 0, Skipped: 0, Time elapsed: 0.001 s - in org.assertj.core.condition.DoesNotHave_toString_Test
[INFO] Running org.assertj.core.condition.AnyOf_anyOf_with_Collection_Test
[INFO] Tests run: 1, Failures: 0, Errors: 0, Skipped: 0, Time elapsed: 0.001 s - in org.assertj.core.condition.AnyOf_anyOf_with_Collection_Test
[INFO] Running org.assertj.core.condition.Join_constructor_with_array_Test
[INFO] Tests run: 3, Failures: 0, Errors: 0, Skipped: 0, Time elapsed: 0.001 s - in org.assertj.core.condition.Join_constructor_with_array_Test
[INFO] Running org.assertj.core.condition.AllOf_toString_Test
[INFO] Tests run: 1, Failures: 0, Errors: 0, Skipped: 0, Time elapsed: 0.001 s - in org.assertj.core.condition.AllOf_toString_Test
[INFO] Running org.assertj.core.condition.AllOf_allOf_with_Collection_Test
[INFO] Tests run: 1, Failures: 0, Errors: 0, Skipped: 0, Time elapsed: 0.001 s - in org.assertj.core.condition.AllOf_allOf_with_Collection_Test
[INFO] Running org.assertj.core.util.ArrayWrapperList_size_Test
[INFO] Tests run: 3, Failures: 0, Errors: 0, Skipped: 0, Time elapsed: 0.001 s - in org.assertj.core.util.ArrayWrapperList_size_Test
[INFO] Running org.assertj.core.util.Objects_namesOf_Test
[INFO] Tests run: 3, Failures: 0, Errors: 0, Skipped: 0, Time elapsed: 0 s - in org.assertj.core.util.Objects_namesOf_Test
[INFO] Running org.assertj.core.util.Strings_join_Test
[INFO] Tests run: 5, Failures: 0, Errors: 0, Skipped: 0, Time elapsed: 0.001 s - in org.assertj.core.util.Strings_join_Test
[INFO] Running org.assertj.core.util.Hexadecimals_Test
[INFO] Tests run: 1, Failures: 0, Errors: 0, Skipped: 0, Time elapsed: 0.001 s - in org.assertj.core.util.Hexadecimals_Test
[INFO] Running org.assertj.core.util.DateUtil_dayOfWeekOf_Test
[INFO] Tests run: 2, Failures: 0, Errors: 0, Skipped: 0, Time elapsed: 0 s - in org.assertj.core.util.DateUtil_dayOfWeekOf_Test
[INFO] Running org.assertj.core.util.DateUtil_dayOfMonthOf_Test
[INFO] Tests run: 2, Failures: 0, Errors: 0, Skipped: 0, Time elapsed: 0 s - in org.assertj.core.util.DateUtil_dayOfMonthOf_Test
[INFO] Running org.assertj.core.util.Sets_newLinkedHashSet_GenericArray_Test
[INFO] Tests run: 3, Failures: 0, Errors: 0, Skipped: 0, Time elapsed: 0 s - in org.assertj.core.util.Sets_newLinkedHashSet_GenericArray_Test
[INFO] Running org.assertj.core.util.Files_currentFolder_Test
Dec 04, 2019 8:01:41 AM org.assertj.core.util.FolderFixture create
INFO: Created directory 'root'
Dec 04, 2019 8:01:41 AM org.assertj.core.util.FolderFixture create
INFO: Created directory 'root/dir_1'
Dec 04, 2019 8:01:41 AM org.assertj.core.util.FileFixture create
INFO: Created file 'root/dir_1/file_1_1'
Dec 04, 2019 8:01:41 AM org.assertj.core.util.FileFixture create
INFO: The file 'root/dir_1/file_1_1' exists
Dec 04, 2019 8:01:41 AM org.assertj.core.util.FileFixture create
INFO: Created file 'root/dir_1/file_1_2'
Dec 04, 2019 8:01:41 AM org.assertj.core.util.FileFixture create
INFO: The file 'root/dir_1/file_1_2' exists
Dec 04, 2019 8:01:41 AM org.assertj.core.util.FolderFixture create
INFO: Created directory 'root/dir_1/dir_1_1'
Dec 04, 2019 8:01:41 AM org.assertj.core.util.FileFixture create
INFO: Created file 'root/dir_1/dir_1_1/file_1_1_1'
Dec 04, 2019 8:01:41 AM org.assertj.core.util.FileFixture create
INFO: The file 'root/dir_1/dir_1_1/file_1_1_1' exists
Dec 04, 2019 8:01:41 AM org.assertj.core.util.FolderFixture create
INFO: Created directory 'root/dir_2'
Dec 04, 2019 8:01:41 AM org.assertj.core.util.FileFixture create
INFO: Created file 'root/dir_2/file_2_1'
Dec 04, 2019 8:01:41 AM org.assertj.core.util.FileFixture create
INFO: The file 'root/dir_2/file_2_1' exists
Dec 04, 2019 8:01:41 AM org.assertj.core.util.FileFixture create
INFO: Created file 'root/dir_2/file_2_2'
Dec 04, 2019 8:01:41 AM org.assertj.core.util.FileFixture create
INFO: The file 'root/dir_2/file_2_2' exists
Dec 04, 2019 8:01:41 AM org.assertj.core.util.FileFixture create
INFO: Created file 'root/dir_2/file_2_3'
Dec 04, 2019 8:01:41 AM org.assertj.core.util.FileFixture create
INFO: The file 'root/dir_2/file_2_3' exists
Dec 04, 2019 8:01:41 AM org.assertj.core.util.FileFixture delete
INFO: The file 'root/dir_1/dir_1_1/file_1_1_1' was deleted
Dec 04, 2019 8:01:41 AM org.assertj.core.util.FolderFixture delete
INFO: The directory 'root/dir_1/dir_1_1' was deleted
Dec 04, 2019 8:01:41 AM org.assertj.core.util.FileFixture delete
INFO: The file 'root/dir_1/file_1_1' was deleted
Dec 04, 2019 8:01:41 AM org.assertj.core.util.FileFixture delete
INFO: The file 'root/dir_1/file_1_2' was deleted
Dec 04, 2019 8:01:41 AM org.assertj.core.util.FolderFixture delete
INFO: The directory 'root/dir_1' was deleted
Dec 04, 2019 8:01:41 AM org.assertj.core.util.FileFixture delete
INFO: The file 'root/dir_2/file_2_1' was deleted
Dec 04, 2019 8:01:41 AM org.assertj.core.util.FileFixture delete
INFO: The file 'root/dir_2/file_2_2' was deleted
Dec 04, 2019 8:01:41 AM org.assertj.core.util.FileFixture delete
INFO: The file 'root/dir_2/file_2_3' was deleted
Dec 04, 2019 8:01:41 AM org.assertj.core.util.FolderFixture delete
INFO: The directory 'root/dir_2' was deleted
Dec 04, 2019 8:01:41 AM org.assertj.core.util.FolderFixture delete
INFO: The directory 'root' was deleted
[INFO] Tests run: 1, Failures: 0, Errors: 0, Skipped: 0, Time elapsed: 0.054 s - in org.assertj.core.util.Files_currentFolder_Test
[INFO] Running org.assertj.core.util.Files_temporaryFolderPath_Test
Dec 04, 2019 8:01:41 AM org.assertj.core.util.FolderFixture create
INFO: Created directory 'root'
Dec 04, 2019 8:01:41 AM org.assertj.core.util.FolderFixture create
INFO: Created directory 'root/dir_1'
Dec 04, 2019 8:01:41 AM org.assertj.core.util.FileFixture create
INFO: Created file 'root/dir_1/file_1_1'
Dec 04, 2019 8:01:41 AM org.assertj.core.util.FileFixture create
INFO: The file 'root/dir_1/file_1_1' exists
Dec 04, 2019 8:01:41 AM org.assertj.core.util.FileFixture create
INFO: Created file 'root/dir_1/file_1_2'
Dec 04, 2019 8:01:41 AM org.assertj.core.util.FileFixture create
INFO: The file 'root/dir_1/file_1_2' exists
Dec 04, 2019 8:01:41 AM org.assertj.core.util.FolderFixture create
INFO: Created directory 'root/dir_1/dir_1_1'
Dec 04, 2019 8:01:41 AM org.assertj.core.util.FileFixture create
INFO: Created file 'root/dir_1/dir_1_1/file_1_1_1'
Dec 04, 2019 8:01:41 AM org.assertj.core.util.FileFixture create
INFO: The file 'root/dir_1/dir_1_1/file_1_1_1' exists
Dec 04, 2019 8:01:41 AM org.assertj.core.util.FolderFixture create
INFO: Created directory 'root/dir_2'
Dec 04, 2019 8:01:41 AM org.assertj.core.util.FileFixture create
INFO: Created file 'root/dir_2/file_2_1'
Dec 04, 2019 8:01:41 AM org.assertj.core.util.FileFixture create
INFO: The file 'root/dir_2/file_2_1' exists
Dec 04, 2019 8:01:41 AM org.assertj.core.util.FileFixture create
INFO: Created file 'root/dir_2/file_2_2'
Dec 04, 2019 8:01:41 AM org.assertj.core.util.FileFixture create
INFO: The file 'root/dir_2/file_2_2' exists
Dec 04, 2019 8:01:41 AM org.assertj.core.util.FileFixture create
INFO: Created file 'root/dir_2/file_2_3'
Dec 04, 2019 8:01:41 AM org.assertj.core.util.FileFixture create
INFO: The file 'root/dir_2/file_2_3' exists
Dec 04, 2019 8:01:41 AM org.assertj.core.util.FileFixture delete
INFO: The file 'root/dir_1/dir_1_1/file_1_1_1' was deleted
Dec 04, 2019 8:01:41 AM org.assertj.core.util.FolderFixture delete
INFO: The directory 'root/dir_1/dir_1_1' was deleted
Dec 04, 2019 8:01:41 AM org.assertj.core.util.FileFixture delete
INFO: The file 'root/dir_1/file_1_1' was deleted
Dec 04, 2019 8:01:41 AM org.assertj.core.util.FileFixture delete
INFO: The file 'root/dir_1/file_1_2' was deleted
Dec 04, 2019 8:01:41 AM org.assertj.core.util.FolderFixture delete
INFO: The directory 'root/dir_1' was deleted
Dec 04, 2019 8:01:41 AM org.assertj.core.util.FileFixture delete
INFO: The file 'root/dir_2/file_2_1' was deleted
Dec 04, 2019 8:01:41 AM org.assertj.core.util.FileFixture delete
INFO: The file 'root/dir_2/file_2_2' was deleted
Dec 04, 2019 8:01:41 AM org.assertj.core.util.FileFixture delete
INFO: The file 'root/dir_2/file_2_3' was deleted
Dec 04, 2019 8:01:41 AM org.assertj.core.util.FolderFixture delete
INFO: The directory 'root/dir_2' was deleted
Dec 04, 2019 8:01:41 AM org.assertj.core.util.FolderFixture delete
INFO: The directory 'root' was deleted
[INFO] Tests run: 1, Failures: 0, Errors: 0, Skipped: 0, Time elapsed: 0.009 s - in org.assertj.core.util.Files_temporaryFolderPath_Test
[INFO] Running org.assertj.core.util.IterableUtil_isNullOrEmpty_Test
[INFO] Tests run: 5, Failures: 0, Errors: 0, Skipped: 0, Time elapsed: 0 s - in org.assertj.core.util.IterableUtil_isNullOrEmpty_Test
[INFO] Running org.assertj.core.util.Sets_newHashSet_Iterable_Test
[INFO] Tests run: 2, Failures: 0, Errors: 0, Skipped: 0, Time elapsed: 0 s - in org.assertj.core.util.Sets_newHashSet_Iterable_Test
[INFO] Running org.assertj.core.util.IterableUtil_nonNullElementsIn_Test
[INFO] Tests run: 4, Failures: 0, Errors: 0, Skipped: 0, Time elapsed: 0 s - in org.assertj.core.util.IterableUtil_nonNullElementsIn_Test
[INFO] Running org.assertj.core.util.Strings_quoteObject_Test
[INFO] Tests run: 2, Failures: 0, Errors: 0, Skipped: 0, Time elapsed: 0 s - in org.assertj.core.util.Strings_quoteObject_Test
[INFO] Running org.assertj.core.util.Throwables_appendCurrentThreadStackTraceToThrowable_Test
[INFO] Tests run: 1, Failures: 0, Errors: 0, Skipped: 0, Time elapsed: 0.004 s - in org.assertj.core.util.Throwables_appendCurrentThreadStackTraceToThrowable_Test
[INFO] Running org.assertj.core.util.Sets_newHashSet_Test
[INFO] Tests run: 2, Failures: 0, Errors: 0, Skipped: 0, Time elapsed: 0 s - in org.assertj.core.util.Sets_newHashSet_Test
[INFO] Running org.assertj.core.util.NearlyEqualsTest
[WARNING] Tests run: 1, Failures: 0, Errors: 0, Skipped: 1, Time elapsed: 0.001 s - in org.assertj.core.util.NearlyEqualsTest
[INFO] Running org.assertj.core.util.Preconditions_checkNotNullOrEmpty_String_Test
[INFO] Tests run: 3, Failures: 0, Errors: 0, Skipped: 0, Time elapsed: 0 s - in org.assertj.core.util.Preconditions_checkNotNullOrEmpty_String_Test
[INFO] Running org.assertj.core.util.Files_contentOf_Test
[INFO] Tests run: 5, Failures: 0, Errors: 0, Skipped: 0, Time elapsed: 0.001 s - in org.assertj.core.util.Files_contentOf_Test
[INFO] Running org.assertj.core.util.Throwables_removeAssertJElementFromStackTrace_Test
[INFO] Tests run: 1, Failures: 0, Errors: 0, Skipped: 0, Time elapsed: 0 s - in org.assertj.core.util.Throwables_removeAssertJElementFromStackTrace_Test
[INFO] Running org.assertj.core.util.DateUtil_parse_Test
[INFO] Tests run: 2, Failures: 0, Errors: 0, Skipped: 0, Time elapsed: 0 s - in org.assertj.core.util.DateUtil_parse_Test
[INFO] Running org.assertj.core.util.Files_temporaryFolder_Test
Dec 04, 2019 8:01:41 AM org.assertj.core.util.FolderFixture create
INFO: Created directory 'root'
Dec 04, 2019 8:01:41 AM org.assertj.core.util.FolderFixture create
INFO: Created directory 'root/dir_1'
Dec 04, 2019 8:01:41 AM org.assertj.core.util.FileFixture create
INFO: Created file 'root/dir_1/file_1_1'
Dec 04, 2019 8:01:41 AM org.assertj.core.util.FileFixture create
INFO: The file 'root/dir_1/file_1_1' exists
Dec 04, 2019 8:01:41 AM org.assertj.core.util.FileFixture create
INFO: Created file 'root/dir_1/file_1_2'
Dec 04, 2019 8:01:41 AM org.assertj.core.util.FileFixture create
INFO: The file 'root/dir_1/file_1_2' exists
Dec 04, 2019 8:01:41 AM org.assertj.core.util.FolderFixture create
INFO: Created directory 'root/dir_1/dir_1_1'
Dec 04, 2019 8:01:41 AM org.assertj.core.util.FileFixture create
INFO: Created file 'root/dir_1/dir_1_1/file_1_1_1'
Dec 04, 2019 8:01:41 AM org.assertj.core.util.FileFixture create
INFO: The file 'root/dir_1/dir_1_1/file_1_1_1' exists
Dec 04, 2019 8:01:41 AM org.assertj.core.util.FolderFixture create
INFO: Created directory 'root/dir_2'
Dec 04, 2019 8:01:41 AM org.assertj.core.util.FileFixture create
INFO: Created file 'root/dir_2/file_2_1'
Dec 04, 2019 8:01:41 AM org.assertj.core.util.FileFixture create
INFO: The file 'root/dir_2/file_2_1' exists
Dec 04, 2019 8:01:41 AM org.assertj.core.util.FileFixture create
INFO: Created file 'root/dir_2/file_2_2'
Dec 04, 2019 8:01:41 AM org.assertj.core.util.FileFixture create
INFO: The file 'root/dir_2/file_2_2' exists
Dec 04, 2019 8:01:41 AM org.assertj.core.util.FileFixture create
INFO: Created file 'root/dir_2/file_2_3'
Dec 04, 2019 8:01:41 AM org.assertj.core.util.FileFixture create
INFO: The file 'root/dir_2/file_2_3' exists
Dec 04, 2019 8:01:41 AM org.assertj.core.util.FileFixture delete
INFO: The file 'root/dir_1/dir_1_1/file_1_1_1' was deleted
Dec 04, 2019 8:01:41 AM org.assertj.core.util.FolderFixture delete
INFO: The directory 'root/dir_1/dir_1_1' was deleted
Dec 04, 2019 8:01:41 AM org.assertj.core.util.FileFixture delete
INFO: The file 'root/dir_1/file_1_1' was deleted
Dec 04, 2019 8:01:41 AM org.assertj.core.util.FileFixture delete
INFO: The file 'root/dir_1/file_1_2' was deleted
Dec 04, 2019 8:01:41 AM org.assertj.core.util.FolderFixture delete
INFO: The directory 'root/dir_1' was deleted
Dec 04, 2019 8:01:41 AM org.assertj.core.util.FileFixture delete
INFO: The file 'root/dir_2/file_2_1' was deleted
Dec 04, 2019 8:01:41 AM org.assertj.core.util.FileFixture delete
INFO: The file 'root/dir_2/file_2_2' was deleted
Dec 04, 2019 8:01:41 AM org.assertj.core.util.FileFixture delete
INFO: The file 'root/dir_2/file_2_3' was deleted
Dec 04, 2019 8:01:41 AM org.assertj.core.util.FolderFixture delete
INFO: The directory 'root/dir_2' was deleted
Dec 04, 2019 8:01:41 AM org.assertj.core.util.FolderFixture delete
INFO: The directory 'root' was deleted
[INFO] Tests run: 1, Failures: 0, Errors: 0, Skipped: 0, Time elapsed: 0.018 s - in org.assertj.core.util.Files_temporaryFolder_Test
[INFO] Running org.assertj.core.util.Arrays_asObjectArray_Test
[INFO] Tests run: 6, Failures: 0, Errors: 0, Skipped: 0, Time elapsed: 0.013 s - in org.assertj.core.util.Arrays_asObjectArray_Test
[INFO] Running org.assertj.core.util.DateUtil_hourOfDayOf_Test
[INFO] Tests run: 2, Failures: 0, Errors: 0, Skipped: 0, Time elapsed: 0.002 s - in org.assertj.core.util.DateUtil_hourOfDayOf_Test
[INFO] Running org.assertj.core.util.DateUtil_millisecondOf_Test
[INFO] Tests run: 2, Failures: 0, Errors: 0, Skipped: 0, Time elapsed: 0.002 s - in org.assertj.core.util.DateUtil_millisecondOf_Test
[INFO] Running org.assertj.core.util.ArrayWrapperList_get_Test
[INFO] Tests run: 4, Failures: 0, Errors: 0, Skipped: 0, Time elapsed: 0.002 s - in org.assertj.core.util.ArrayWrapperList_get_Test
[INFO] Running org.assertj.core.util.Strings_quoteString_Test
[INFO] Tests run: 3, Failures: 0, Errors: 0, Skipped: 0, Time elapsed: 0.001 s - in org.assertj.core.util.Strings_quoteString_Test
[INFO] Running org.assertj.core.util.xml.XmlStringPrettyFormatter_prettyFormat_Test
[Fatal Error] :1:139: The element type "channel" must be terminated by the matching end-tag "</channel>".
[INFO] Tests run: 5, Failures: 0, Errors: 0, Skipped: 0, Time elapsed: 0.039 s - in org.assertj.core.util.xml.XmlStringPrettyFormatter_prettyFormat_Test
[INFO] Running org.assertj.core.util.Arrays_asList_Test
[INFO] Tests run: 6, Failures: 0, Errors: 0, Skipped: 0, Time elapsed: 0.016 s - in org.assertj.core.util.Arrays_asList_Test
[INFO] Running org.assertj.core.util.Arrays_isNullOrEmpty_Test
[INFO] Tests run: 3, Failures: 0, Errors: 0, Skipped: 0, Time elapsed: 0.001 s - in org.assertj.core.util.Arrays_isNullOrEmpty_Test
[INFO] Running org.assertj.core.util.Files_newTemporaryFolder_Test
Dec 04, 2019 8:01:41 AM org.assertj.core.util.FolderFixture create
INFO: Created directory 'root'
Dec 04, 2019 8:01:41 AM org.assertj.core.util.FolderFixture create
INFO: Created directory 'root/dir_1'
Dec 04, 2019 8:01:41 AM org.assertj.core.util.FileFixture create
INFO: Created file 'root/dir_1/file_1_1'
Dec 04, 2019 8:01:41 AM org.assertj.core.util.FileFixture create
INFO: The file 'root/dir_1/file_1_1' exists
Dec 04, 2019 8:01:41 AM org.assertj.core.util.FileFixture create
INFO: Created file 'root/dir_1/file_1_2'
Dec 04, 2019 8:01:41 AM org.assertj.core.util.FileFixture create
INFO: The file 'root/dir_1/file_1_2' exists
Dec 04, 2019 8:01:41 AM org.assertj.core.util.FolderFixture create
INFO: Created directory 'root/dir_1/dir_1_1'
Dec 04, 2019 8:01:41 AM org.assertj.core.util.FileFixture create
INFO: Created file 'root/dir_1/dir_1_1/file_1_1_1'
Dec 04, 2019 8:01:41 AM org.assertj.core.util.FileFixture create
INFO: The file 'root/dir_1/dir_1_1/file_1_1_1' exists
Dec 04, 2019 8:01:41 AM org.assertj.core.util.FolderFixture create
INFO: Created directory 'root/dir_2'
Dec 04, 2019 8:01:41 AM org.assertj.core.util.FileFixture create
INFO: Created file 'root/dir_2/file_2_1'
Dec 04, 2019 8:01:41 AM org.assertj.core.util.FileFixture create
INFO: The file 'root/dir_2/file_2_1' exists
Dec 04, 2019 8:01:41 AM org.assertj.core.util.FileFixture create
INFO: Created file 'root/dir_2/file_2_2'
Dec 04, 2019 8:01:41 AM org.assertj.core.util.FileFixture create
INFO: The file 'root/dir_2/file_2_2' exists
Dec 04, 2019 8:01:41 AM org.assertj.core.util.FileFixture create
INFO: Created file 'root/dir_2/file_2_3'
Dec 04, 2019 8:01:41 AM org.assertj.core.util.FileFixture create
INFO: The file 'root/dir_2/file_2_3' exists
Dec 04, 2019 8:01:41 AM org.assertj.core.util.FileFixture delete
INFO: The file 'root/dir_1/dir_1_1/file_1_1_1' was deleted
Dec 04, 2019 8:01:41 AM org.assertj.core.util.FolderFixture delete
INFO: The directory 'root/dir_1/dir_1_1' was deleted
Dec 04, 2019 8:01:41 AM org.assertj.core.util.FileFixture delete
INFO: The file 'root/dir_1/file_1_1' was deleted
Dec 04, 2019 8:01:41 AM org.assertj.core.util.FileFixture delete
INFO: The file 'root/dir_1/file_1_2' was deleted
Dec 04, 2019 8:01:41 AM org.assertj.core.util.FolderFixture delete
INFO: The directory 'root/dir_1' was deleted
Dec 04, 2019 8:01:41 AM org.assertj.core.util.FileFixture delete
INFO: The file 'root/dir_2/file_2_1' was deleted
Dec 04, 2019 8:01:41 AM org.assertj.core.util.FileFixture delete
INFO: The file 'root/dir_2/file_2_2' was deleted
Dec 04, 2019 8:01:41 AM org.assertj.core.util.FileFixture delete
INFO: The file 'root/dir_2/file_2_3' was deleted
Dec 04, 2019 8:01:41 AM org.assertj.core.util.FolderFixture delete
INFO: The directory 'root/dir_2' was deleted
Dec 04, 2019 8:01:41 AM org.assertj.core.util.FolderFixture delete
INFO: The directory 'root' was deleted
[INFO] Tests run: 1, Failures: 0, Errors: 0, Skipped: 0, Time elapsed: 0.018 s - in org.assertj.core.util.Files_newTemporaryFolder_Test
[INFO] Running org.assertj.core.util.Files_linesOf_Test
[INFO] Tests run: 9, Failures: 0, Errors: 0, Skipped: 0, Time elapsed: 0.006 s - in org.assertj.core.util.Files_linesOf_Test
[INFO] Running org.assertj.core.util.Streams_stream_Test
[INFO] Tests run: 1, Failures: 0, Errors: 0, Skipped: 0, Time elapsed: 0.002 s - in org.assertj.core.util.Streams_stream_Test
[INFO] Running org.assertj.core.util.Arrays_isArray_Test
[INFO] Tests run: 3, Failures: 0, Errors: 0, Skipped: 0, Time elapsed: 0 s - in org.assertj.core.util.Arrays_isArray_Test
[INFO] Running org.assertj.core.util.Lists_newArrayList_withVarArgs_Test
[INFO] Tests run: 3, Failures: 0, Errors: 0, Skipped: 0, Time elapsed: 0 s - in org.assertj.core.util.Lists_newArrayList_withVarArgs_Test
[INFO] Running org.assertj.core.util.DateUtil_monthOf_Test
[INFO] Tests run: 2, Failures: 0, Errors: 0, Skipped: 0, Time elapsed: 0 s - in org.assertj.core.util.DateUtil_monthOf_Test
[INFO] Running org.assertj.core.util.Throwables_getRootCause_Test
[INFO] Tests run: 3, Failures: 0, Errors: 0, Skipped: 0, Time elapsed: 0 s - in org.assertj.core.util.Throwables_getRootCause_Test
[INFO] Running org.assertj.core.util.Arrays_nonNullElementsIn_Test
[INFO] Tests run: 4, Failures: 0, Errors: 0, Skipped: 0, Time elapsed: 0 s - in org.assertj.core.util.Arrays_nonNullElementsIn_Test
[INFO] Running org.assertj.core.util.DateUtil_yearOf_Test
[INFO] Tests run: 2, Failures: 0, Errors: 0, Skipped: 0, Time elapsed: 0 s - in org.assertj.core.util.DateUtil_yearOf_Test
[INFO] Running org.assertj.core.util.Preconditions_checkNotNull_GenericObject_String_Test
[INFO] Tests run: 2, Failures: 0, Errors: 0, Skipped: 0, Time elapsed: 0 s - in org.assertj.core.util.Preconditions_checkNotNull_GenericObject_String_Test
[INFO] Running org.assertj.core.util.DoubleComparatorTest
[INFO] Tests run: 17, Failures: 0, Errors: 0, Skipped: 0, Time elapsed: 0.01 s - in org.assertj.core.util.DoubleComparatorTest
[INFO] Running org.assertj.core.util.Arrays_array_Test
[INFO] Tests run: 5, Failures: 0, Errors: 0, Skipped: 0, Time elapsed: 0.002 s - in org.assertj.core.util.Arrays_array_Test
[INFO] Running org.assertj.core.util.URLs_linesOf_Test
[INFO] Tests run: 3, Failures: 0, Errors: 0, Skipped: 0, Time elapsed: 0.006 s - in org.assertj.core.util.URLs_linesOf_Test
[INFO] Running org.assertj.core.util.Introspection_getProperty_Test
[INFO] Tests run: 5, Failures: 0, Errors: 0, Skipped: 0, Time elapsed: 0.002 s - in org.assertj.core.util.Introspection_getProperty_Test
[INFO] Running org.assertj.core.util.Lists_newArrayList_Test
[INFO] Tests run: 3, Failures: 0, Errors: 0, Skipped: 0, Time elapsed: 0 s - in org.assertj.core.util.Lists_newArrayList_Test
[INFO] Running org.assertj.core.util.Lists_newArrayList_withIterator_Test
[INFO] Tests run: 3, Failures: 0, Errors: 0, Skipped: 0, Time elapsed: 0 s - in org.assertj.core.util.Lists_newArrayList_withIterator_Test
[INFO] Running org.assertj.core.util.DateUtil_format_with_date_time_with_ms_format_Test
[INFO] Tests run: 2, Failures: 0, Errors: 0, Skipped: 0, Time elapsed: 0 s - in org.assertj.core.util.DateUtil_format_with_date_time_with_ms_format_Test
[INFO] Running org.assertj.core.util.Closeables_closeQuietly_Test
Dec 04, 2019 8:01:41 AM org.assertj.core.util.Closeables closeCloseable
WARNING: Error ocurred while closing org.assertj.core.util.Closeables_closeQuietly_Test$CloseableStub@684c8402
java.io.IOException: 
	at org.assertj.core.util.Closeables_closeQuietly_Test.should_ignore_thrown_errors(Closeables_closeQuietly_Test.java:37)
	at sun.reflect.NativeMethodAccessorImpl.invoke0(Native Method)
	at sun.reflect.NativeMethodAccessorImpl.invoke(NativeMethodAccessorImpl.java:62)
	at sun.reflect.DelegatingMethodAccessorImpl.invoke(DelegatingMethodAccessorImpl.java:43)
	at java.lang.reflect.Method.invoke(Method.java:498)
	at org.junit.platform.commons.util.ReflectionUtils.invokeMethod(ReflectionUtils.java:515)
	at org.junit.jupiter.engine.execution.ExecutableInvoker.invoke(ExecutableInvoker.java:115)
	at org.junit.jupiter.engine.descriptor.TestMethodTestDescriptor.lambda$invokeTestMethod$6(TestMethodTestDescriptor.java:171)
	at org.junit.platform.engine.support.hierarchical.ThrowableCollector.execute(ThrowableCollector.java:72)
	at org.junit.jupiter.engine.descriptor.TestMethodTestDescriptor.invokeTestMethod(TestMethodTestDescriptor.java:167)
	at org.junit.jupiter.engine.descriptor.TestMethodTestDescriptor.execute(TestMethodTestDescriptor.java:114)
	at org.junit.jupiter.engine.descriptor.TestMethodTestDescriptor.execute(TestMethodTestDescriptor.java:59)
	at org.junit.platform.engine.support.hierarchical.NodeTestTask.lambda$executeRecursively$5(NodeTestTask.java:105)
	at org.junit.platform.engine.support.hierarchical.ThrowableCollector.execute(ThrowableCollector.java:72)
	at org.junit.platform.engine.support.hierarchical.NodeTestTask.executeRecursively(NodeTestTask.java:95)
	at org.junit.platform.engine.support.hierarchical.NodeTestTask.execute(NodeTestTask.java:71)
	at java.util.ArrayList.forEach(ArrayList.java:1255)
	at org.junit.platform.engine.support.hierarchical.SameThreadHierarchicalTestExecutorService.invokeAll(SameThreadHierarchicalTestExecutorService.java:38)
	at org.junit.platform.engine.support.hierarchical.NodeTestTask.lambda$executeRecursively$5(NodeTestTask.java:110)
	at org.junit.platform.engine.support.hierarchical.ThrowableCollector.execute(ThrowableCollector.java:72)
	at org.junit.platform.engine.support.hierarchical.NodeTestTask.executeRecursively(NodeTestTask.java:95)
	at org.junit.platform.engine.support.hierarchical.NodeTestTask.execute(NodeTestTask.java:71)
	at java.util.ArrayList.forEach(ArrayList.java:1255)
	at org.junit.platform.engine.support.hierarchical.SameThreadHierarchicalTestExecutorService.invokeAll(SameThreadHierarchicalTestExecutorService.java:38)
	at org.junit.platform.engine.support.hierarchical.NodeTestTask.lambda$executeRecursively$5(NodeTestTask.java:110)
	at org.junit.platform.engine.support.hierarchical.ThrowableCollector.execute(ThrowableCollector.java:72)
	at org.junit.platform.engine.support.hierarchical.NodeTestTask.executeRecursively(NodeTestTask.java:95)
	at org.junit.platform.engine.support.hierarchical.NodeTestTask.execute(NodeTestTask.java:71)
	at org.junit.platform.engine.support.hierarchical.SameThreadHierarchicalTestExecutorService.submit(SameThreadHierarchicalTestExecutorService.java:32)
	at org.junit.platform.engine.support.hierarchical.HierarchicalTestExecutor.execute(HierarchicalTestExecutor.java:57)
	at org.junit.platform.engine.support.hierarchical.HierarchicalTestEngine.execute(HierarchicalTestEngine.java:51)
	at org.junit.platform.launcher.core.DefaultLauncher.execute(DefaultLauncher.java:220)
	at org.junit.platform.launcher.core.DefaultLauncher.lambda$execute$6(DefaultLauncher.java:188)
	at org.junit.platform.launcher.core.DefaultLauncher.withInterceptedStreams(DefaultLauncher.java:202)
	at org.junit.platform.launcher.core.DefaultLauncher.execute(DefaultLauncher.java:181)
	at org.junit.platform.launcher.core.DefaultLauncher.execute(DefaultLauncher.java:128)
	at org.apache.maven.surefire.junitplatform.JUnitPlatformProvider.invokeAllTests(JUnitPlatformProvider.java:142)
	at org.apache.maven.surefire.junitplatform.JUnitPlatformProvider.invoke(JUnitPlatformProvider.java:117)
	at org.apache.maven.surefire.booter.ForkedBooter.invokeProviderInSameClassLoader(ForkedBooter.java:384)
	at org.apache.maven.surefire.booter.ForkedBooter.runSuitesInProcess(ForkedBooter.java:345)
	at org.apache.maven.surefire.booter.ForkedBooter.execute(ForkedBooter.java:126)
	at org.apache.maven.surefire.booter.ForkedBooter.main(ForkedBooter.java:418)

[INFO] Tests run: 3, Failures: 0, Errors: 0, Skipped: 0, Time elapsed: 0 s - in org.assertj.core.util.Closeables_closeQuietly_Test
[INFO] Running org.assertj.core.util.Preconditions_checkNotNullOrEmpty_GenericArray_Test
[INFO] Tests run: 3, Failures: 0, Errors: 0, Skipped: 0, Time elapsed: 0 s - in org.assertj.core.util.Preconditions_checkNotNullOrEmpty_GenericArray_Test
[INFO] Running org.assertj.core.util.BigDecimalComparatorTest
[INFO] Tests run: 4, Failures: 0, Errors: 0, Skipped: 0, Time elapsed: 0.001 s - in org.assertj.core.util.BigDecimalComparatorTest
[INFO] Running org.assertj.core.util.DateUtil_minuteOf_Test
[INFO] Tests run: 2, Failures: 0, Errors: 0, Skipped: 0, Time elapsed: 0 s - in org.assertj.core.util.DateUtil_minuteOf_Test
[INFO] Running org.assertj.core.util.DateUtil_truncateTime_Test
[INFO] Tests run: 2, Failures: 0, Errors: 0, Skipped: 0, Time elapsed: 0 s - in org.assertj.core.util.DateUtil_truncateTime_Test
[INFO] Running org.assertj.core.util.Objects_hashCodeFor_Test
[INFO] Tests run: 4, Failures: 0, Errors: 0, Skipped: 0, Time elapsed: 0.001 s - in org.assertj.core.util.Objects_hashCodeFor_Test
[INFO] Running org.assertj.core.util.URLs_contentOf_Test
[INFO] Tests run: 3, Failures: 0, Errors: 0, Skipped: 0, Time elapsed: 0 s - in org.assertj.core.util.URLs_contentOf_Test
[INFO] Running org.assertj.core.util.Files_newTemporaryFile_Test
Dec 04, 2019 8:01:41 AM org.assertj.core.util.FolderFixture create
INFO: Created directory 'root'
Dec 04, 2019 8:01:41 AM org.assertj.core.util.FolderFixture create
INFO: Created directory 'root/dir_1'
Dec 04, 2019 8:01:41 AM org.assertj.core.util.FileFixture create
INFO: Created file 'root/dir_1/file_1_1'
Dec 04, 2019 8:01:41 AM org.assertj.core.util.FileFixture create
INFO: The file 'root/dir_1/file_1_1' exists
Dec 04, 2019 8:01:41 AM org.assertj.core.util.FileFixture create
INFO: Created file 'root/dir_1/file_1_2'
Dec 04, 2019 8:01:41 AM org.assertj.core.util.FileFixture create
INFO: The file 'root/dir_1/file_1_2' exists
Dec 04, 2019 8:01:41 AM org.assertj.core.util.FolderFixture create
INFO: Created directory 'root/dir_1/dir_1_1'
Dec 04, 2019 8:01:41 AM org.assertj.core.util.FileFixture create
INFO: Created file 'root/dir_1/dir_1_1/file_1_1_1'
Dec 04, 2019 8:01:41 AM org.assertj.core.util.FileFixture create
INFO: The file 'root/dir_1/dir_1_1/file_1_1_1' exists
Dec 04, 2019 8:01:41 AM org.assertj.core.util.FolderFixture create
INFO: Created directory 'root/dir_2'
Dec 04, 2019 8:01:41 AM org.assertj.core.util.FileFixture create
INFO: Created file 'root/dir_2/file_2_1'
Dec 04, 2019 8:01:41 AM org.assertj.core.util.FileFixture create
INFO: The file 'root/dir_2/file_2_1' exists
Dec 04, 2019 8:01:41 AM org.assertj.core.util.FileFixture create
INFO: Created file 'root/dir_2/file_2_2'
Dec 04, 2019 8:01:41 AM org.assertj.core.util.FileFixture create
INFO: The file 'root/dir_2/file_2_2' exists
Dec 04, 2019 8:01:41 AM org.assertj.core.util.FileFixture create
INFO: Created file 'root/dir_2/file_2_3'
Dec 04, 2019 8:01:41 AM org.assertj.core.util.FileFixture create
INFO: The file 'root/dir_2/file_2_3' exists
Dec 04, 2019 8:01:41 AM org.assertj.core.util.FileFixture delete
INFO: The file 'root/dir_1/dir_1_1/file_1_1_1' was deleted
Dec 04, 2019 8:01:41 AM org.assertj.core.util.FolderFixture delete
INFO: The directory 'root/dir_1/dir_1_1' was deleted
Dec 04, 2019 8:01:41 AM org.assertj.core.util.FileFixture delete
INFO: The file 'root/dir_1/file_1_1' was deleted
Dec 04, 2019 8:01:41 AM org.assertj.core.util.FileFixture delete
INFO: The file 'root/dir_1/file_1_2' was deleted
Dec 04, 2019 8:01:41 AM org.assertj.core.util.FolderFixture delete
INFO: The directory 'root/dir_1' was deleted
Dec 04, 2019 8:01:41 AM org.assertj.core.util.FileFixture delete
INFO: The file 'root/dir_2/file_2_1' was deleted
Dec 04, 2019 8:01:41 AM org.assertj.core.util.FileFixture delete
INFO: The file 'root/dir_2/file_2_2' was deleted
Dec 04, 2019 8:01:41 AM org.assertj.core.util.FileFixture delete
INFO: The file 'root/dir_2/file_2_3' was deleted
Dec 04, 2019 8:01:41 AM org.assertj.core.util.FolderFixture delete
INFO: The directory 'root/dir_2' was deleted
Dec 04, 2019 8:01:41 AM org.assertj.core.util.FolderFixture delete
INFO: The directory 'root' was deleted
[INFO] Tests run: 1, Failures: 0, Errors: 0, Skipped: 0, Time elapsed: 0.004 s - in org.assertj.core.util.Files_newTemporaryFile_Test
[INFO] Running org.assertj.core.util.Throwables_getStackTrace_Test
[INFO] Tests run: 2, Failures: 0, Errors: 0, Skipped: 0, Time elapsed: 0.011 s - in org.assertj.core.util.Throwables_getStackTrace_Test
[INFO] Running org.assertj.core.util.DateUtil_format_with_date_time_format_Test
[INFO] Tests run: 4, Failures: 0, Errors: 0, Skipped: 0, Time elapsed: 0.001 s - in org.assertj.core.util.DateUtil_format_with_date_time_format_Test
[INFO] Running org.assertj.core.util.DateUtil_secondOf_Test
[INFO] Tests run: 2, Failures: 0, Errors: 0, Skipped: 0, Time elapsed: 0 s - in org.assertj.core.util.DateUtil_secondOf_Test
[INFO] Running org.assertj.core.util.Files_delete_Test
Dec 04, 2019 8:01:41 AM org.assertj.core.util.FolderFixture create
INFO: Created directory 'root'
Dec 04, 2019 8:01:41 AM org.assertj.core.util.FolderFixture create
INFO: Created directory 'root/dir_1'
Dec 04, 2019 8:01:41 AM org.assertj.core.util.FileFixture create
INFO: Created file 'root/dir_1/file_1_1'
Dec 04, 2019 8:01:41 AM org.assertj.core.util.FileFixture create
INFO: The file 'root/dir_1/file_1_1' exists
Dec 04, 2019 8:01:41 AM org.assertj.core.util.FileFixture create
INFO: Created file 'root/dir_1/file_1_2'
Dec 04, 2019 8:01:41 AM org.assertj.core.util.FileFixture create
INFO: The file 'root/dir_1/file_1_2' exists
Dec 04, 2019 8:01:41 AM org.assertj.core.util.FolderFixture create
INFO: Created directory 'root/dir_1/dir_1_1'
Dec 04, 2019 8:01:41 AM org.assertj.core.util.FileFixture create
INFO: Created file 'root/dir_1/dir_1_1/file_1_1_1'
Dec 04, 2019 8:01:41 AM org.assertj.core.util.FileFixture create
INFO: The file 'root/dir_1/dir_1_1/file_1_1_1' exists
Dec 04, 2019 8:01:41 AM org.assertj.core.util.FolderFixture create
INFO: Created directory 'root/dir_2'
Dec 04, 2019 8:01:41 AM org.assertj.core.util.FileFixture create
INFO: Created file 'root/dir_2/file_2_1'
Dec 04, 2019 8:01:41 AM org.assertj.core.util.FileFixture create
INFO: The file 'root/dir_2/file_2_1' exists
Dec 04, 2019 8:01:41 AM org.assertj.core.util.FileFixture create
INFO: Created file 'root/dir_2/file_2_2'
Dec 04, 2019 8:01:41 AM org.assertj.core.util.FileFixture create
INFO: The file 'root/dir_2/file_2_2' exists
Dec 04, 2019 8:01:41 AM org.assertj.core.util.FileFixture create
INFO: Created file 'root/dir_2/file_2_3'
Dec 04, 2019 8:01:41 AM org.assertj.core.util.FileFixture create
INFO: The file 'root/dir_2/file_2_3' exists
Dec 04, 2019 8:01:41 AM org.assertj.core.util.FolderFixture create
INFO: Created directory 'dir_3'
Dec 04, 2019 8:01:41 AM org.assertj.core.util.FileFixture create
INFO: Created file 'dir_3/file_3_1'
Dec 04, 2019 8:01:41 AM org.assertj.core.util.FileFixture create
INFO: The file 'dir_3/file_3_1' exists
Dec 04, 2019 8:01:41 AM org.assertj.core.util.FileFixture create
INFO: Created file 'dir_3/file_3_2'
Dec 04, 2019 8:01:41 AM org.assertj.core.util.FileFixture create
INFO: The file 'dir_3/file_3_2' exists
Dec 04, 2019 8:01:41 AM org.assertj.core.util.FileFixture create
INFO: The file 'dir_3/file_3_2' exists
Dec 04, 2019 8:01:41 AM org.assertj.core.util.FolderFixture create
INFO: Created directory 'dir_3/dir_3_1'
Dec 04, 2019 8:01:41 AM org.assertj.core.util.FileFixture create
INFO: Created file 'dir_3/dir_3_1/file_3_1_1'
Dec 04, 2019 8:01:41 AM org.assertj.core.util.FileFixture create
INFO: The file 'dir_3/dir_3_1/file_3_1_1' exists
Dec 04, 2019 8:01:41 AM org.assertj.core.util.FileFixture create
INFO: Created file 'dir_3/dir_3_1/file_3_1_2'
Dec 04, 2019 8:01:41 AM org.assertj.core.util.FileFixture create
INFO: The file 'dir_3/dir_3_1/file_3_1_2' exists
Dec 04, 2019 8:01:41 AM org.assertj.core.util.FileFixture delete
INFO: The file 'root/dir_1/dir_1_1/file_1_1_1' was deleted
Dec 04, 2019 8:01:41 AM org.assertj.core.util.FolderFixture delete
INFO: The directory 'root/dir_1/dir_1_1' was deleted
Dec 04, 2019 8:01:41 AM org.assertj.core.util.FileFixture delete
INFO: The file 'root/dir_1/file_1_1' was deleted
Dec 04, 2019 8:01:41 AM org.assertj.core.util.FileFixture delete
INFO: The file 'root/dir_1/file_1_2' was deleted
Dec 04, 2019 8:01:41 AM org.assertj.core.util.FolderFixture delete
INFO: The directory 'root/dir_1' was deleted
Dec 04, 2019 8:01:41 AM org.assertj.core.util.FileFixture delete
INFO: The file 'root/dir_2/file_2_1' was deleted
Dec 04, 2019 8:01:41 AM org.assertj.core.util.FileFixture delete
INFO: The file 'root/dir_2/file_2_2' was deleted
Dec 04, 2019 8:01:41 AM org.assertj.core.util.FileFixture delete
INFO: The file 'root/dir_2/file_2_3' was deleted
Dec 04, 2019 8:01:41 AM org.assertj.core.util.FolderFixture delete
INFO: The directory 'root/dir_2' was deleted
Dec 04, 2019 8:01:41 AM org.assertj.core.util.FolderFixture delete
INFO: The directory 'root' was deleted
[INFO] Tests run: 1, Failures: 0, Errors: 0, Skipped: 0, Time elapsed: 0.029 s - in org.assertj.core.util.Files_delete_Test
[INFO] Running org.assertj.core.util.Arrays_hasOnlyNullElements_Test
[INFO] Tests run: 4, Failures: 0, Errors: 0, Skipped: 0, Time elapsed: 0.001 s - in org.assertj.core.util.Arrays_hasOnlyNullElements_Test
[INFO] Running org.assertj.core.util.Preconditions_checkNotNull_GenericObject_Test
[INFO] Tests run: 2, Failures: 0, Errors: 0, Skipped: 0, Time elapsed: 0.001 s - in org.assertj.core.util.Preconditions_checkNotNull_GenericObject_Test
[INFO] Running org.assertj.core.util.Lists_newArrayList_withIterable_Test
[INFO] Tests run: 3, Failures: 0, Errors: 0, Skipped: 0, Time elapsed: 0 s - in org.assertj.core.util.Lists_newArrayList_withIterable_Test
[INFO] Running org.assertj.core.util.Strings_isEmpty_Test
[INFO] Tests run: 3, Failures: 0, Errors: 0, Skipped: 0, Time elapsed: 0 s - in org.assertj.core.util.Strings_isEmpty_Test
[INFO] Running org.assertj.core.util.introspection.FieldSupport_fieldValues_Test
[INFO] Tests run: 12, Failures: 0, Errors: 0, Skipped: 0, Time elapsed: 0.007 s - in org.assertj.core.util.introspection.FieldSupport_fieldValues_Test
[INFO] Running org.assertj.core.util.introspection.PropertyOrFieldSupport_getValueOf_Test
[INFO] Tests run: 15, Failures: 0, Errors: 0, Skipped: 0, Time elapsed: 0.005 s - in org.assertj.core.util.introspection.PropertyOrFieldSupport_getValueOf_Test
[INFO] Running org.assertj.core.util.introspection.PropertySupport_propertyValues_Test
[INFO] Tests run: 12, Failures: 0, Errors: 0, Skipped: 0, Time elapsed: 0.003 s - in org.assertj.core.util.introspection.PropertySupport_propertyValues_Test
[INFO] Running org.assertj.core.util.introspection.PropertySupport_publicGetterExistsFor_Test
[INFO] Tests run: 2, Failures: 0, Errors: 0, Skipped: 0, Time elapsed: 0.004 s - in org.assertj.core.util.introspection.PropertySupport_publicGetterExistsFor_Test
[INFO] Running org.assertj.core.util.introspection.MethodSupport_methodResultFor_Test
[INFO] Tests run: 8, Failures: 0, Errors: 0, Skipped: 0, Time elapsed: 0.001 s - in org.assertj.core.util.introspection.MethodSupport_methodResultFor_Test
[INFO] Running org.assertj.core.util.introspection.FieldSupport_isAllowedToReadField_Test
[INFO] Tests run: 2, Failures: 0, Errors: 0, Skipped: 0, Time elapsed: 0.001 s - in org.assertj.core.util.introspection.FieldSupport_isAllowedToReadField_Test
[INFO] Running org.assertj.core.util.Sets_newLinkedHashSet_Test
[INFO] Tests run: 2, Failures: 0, Errors: 0, Skipped: 0, Time elapsed: 0.001 s - in org.assertj.core.util.Sets_newLinkedHashSet_Test
[INFO] Running org.assertj.core.util.Strings_concat_Test
[INFO] Tests run: 2, Failures: 0, Errors: 0, Skipped: 0, Time elapsed: 0.001 s - in org.assertj.core.util.Strings_concat_Test
[INFO] Running org.assertj.core.util.DateUtil_toCalendar_Test
[INFO] Tests run: 2, Failures: 0, Errors: 0, Skipped: 0, Time elapsed: 0.001 s - in org.assertj.core.util.DateUtil_toCalendar_Test
[INFO] Running org.assertj.core.util.DateUtil_formatTimeDifference_Test
[INFO] Tests run: 3, Failures: 0, Errors: 0, Skipped: 0, Time elapsed: 0.007 s - in org.assertj.core.util.DateUtil_formatTimeDifference_Test
[INFO] Running org.assertj.core.util.Preconditions_checkArgument_Test
[INFO] Tests run: 2, Failures: 0, Errors: 0, Skipped: 0, Time elapsed: 0 s - in org.assertj.core.util.Preconditions_checkArgument_Test
[INFO] Running org.assertj.core.util.DateUtil_timeDifference_Test
[INFO] Tests run: 3, Failures: 0, Errors: 0, Skipped: 0, Time elapsed: 0 s - in org.assertj.core.util.DateUtil_timeDifference_Test
[INFO] Running org.assertj.core.util.Strings_append_Test
[INFO] Tests run: 2, Failures: 0, Errors: 0, Skipped: 0, Time elapsed: 0 s - in org.assertj.core.util.Strings_append_Test
[INFO] Running org.assertj.core.util.Lists_emptyList_Test
[INFO] Tests run: 1, Failures: 0, Errors: 0, Skipped: 0, Time elapsed: 0.001 s - in org.assertj.core.util.Lists_emptyList_Test
[INFO] Running org.assertj.core.util.DateUtil_parse_date_Test
[INFO] Tests run: 3, Failures: 0, Errors: 0, Skipped: 0, Time elapsed: 0 s - in org.assertj.core.util.DateUtil_parse_date_Test
[INFO] Running org.assertj.core.util.Files_fileNamesIn_Test
Dec 04, 2019 8:01:41 AM org.assertj.core.util.FolderFixture create
INFO: Created directory 'root'
Dec 04, 2019 8:01:41 AM org.assertj.core.util.FolderFixture create
INFO: Created directory 'root/dir_1'
Dec 04, 2019 8:01:41 AM org.assertj.core.util.FileFixture create
INFO: Created file 'root/dir_1/file_1_1'
Dec 04, 2019 8:01:41 AM org.assertj.core.util.FileFixture create
INFO: The file 'root/dir_1/file_1_1' exists
Dec 04, 2019 8:01:41 AM org.assertj.core.util.FileFixture create
INFO: Created file 'root/dir_1/file_1_2'
Dec 04, 2019 8:01:41 AM org.assertj.core.util.FileFixture create
INFO: The file 'root/dir_1/file_1_2' exists
Dec 04, 2019 8:01:41 AM org.assertj.core.util.FolderFixture create
INFO: Created directory 'root/dir_1/dir_1_1'
Dec 04, 2019 8:01:41 AM org.assertj.core.util.FileFixture create
INFO: Created file 'root/dir_1/dir_1_1/file_1_1_1'
Dec 04, 2019 8:01:41 AM org.assertj.core.util.FileFixture create
INFO: The file 'root/dir_1/dir_1_1/file_1_1_1' exists
Dec 04, 2019 8:01:41 AM org.assertj.core.util.FolderFixture create
INFO: Created directory 'root/dir_2'
Dec 04, 2019 8:01:41 AM org.assertj.core.util.FileFixture create
INFO: Created file 'root/dir_2/file_2_1'
Dec 04, 2019 8:01:41 AM org.assertj.core.util.FileFixture create
INFO: The file 'root/dir_2/file_2_1' exists
Dec 04, 2019 8:01:41 AM org.assertj.core.util.FileFixture create
INFO: Created file 'root/dir_2/file_2_2'
Dec 04, 2019 8:01:41 AM org.assertj.core.util.FileFixture create
INFO: The file 'root/dir_2/file_2_2' exists
Dec 04, 2019 8:01:41 AM org.assertj.core.util.FileFixture create
INFO: Created file 'root/dir_2/file_2_3'
Dec 04, 2019 8:01:41 AM org.assertj.core.util.FileFixture create
INFO: The file 'root/dir_2/file_2_3' exists
Dec 04, 2019 8:01:41 AM org.assertj.core.util.FileFixture create
INFO: Created file 'root/file_1'
Dec 04, 2019 8:01:41 AM org.assertj.core.util.FileFixture create
INFO: The file 'root/file_1' exists
Dec 04, 2019 8:01:41 AM org.assertj.core.util.FileFixture delete
INFO: The file 'root/dir_1/dir_1_1/file_1_1_1' was deleted
Dec 04, 2019 8:01:41 AM org.assertj.core.util.FolderFixture delete
INFO: The directory 'root/dir_1/dir_1_1' was deleted
Dec 04, 2019 8:01:41 AM org.assertj.core.util.FileFixture delete
INFO: The file 'root/dir_1/file_1_1' was deleted
Dec 04, 2019 8:01:41 AM org.assertj.core.util.FileFixture delete
INFO: The file 'root/dir_1/file_1_2' was deleted
Dec 04, 2019 8:01:41 AM org.assertj.core.util.FolderFixture delete
INFO: The directory 'root/dir_1' was deleted
Dec 04, 2019 8:01:41 AM org.assertj.core.util.FileFixture delete
INFO: The file 'root/dir_2/file_2_1' was deleted
Dec 04, 2019 8:01:41 AM org.assertj.core.util.FileFixture delete
INFO: The file 'root/dir_2/file_2_2' was deleted
Dec 04, 2019 8:01:41 AM org.assertj.core.util.FileFixture delete
INFO: The file 'root/dir_2/file_2_3' was deleted
Dec 04, 2019 8:01:41 AM org.assertj.core.util.FolderFixture delete
INFO: The directory 'root/dir_2' was deleted
Dec 04, 2019 8:01:41 AM org.assertj.core.util.FileFixture delete
INFO: The file 'root/file_1' was deleted
Dec 04, 2019 8:01:41 AM org.assertj.core.util.FolderFixture delete
INFO: The directory 'root' was deleted
Dec 04, 2019 8:01:41 AM org.assertj.core.util.FolderFixture create
INFO: Created directory 'root'
Dec 04, 2019 8:01:41 AM org.assertj.core.util.FolderFixture create
INFO: Created directory 'root/dir_1'
Dec 04, 2019 8:01:41 AM org.assertj.core.util.FileFixture create
INFO: Created file 'root/dir_1/file_1_1'
Dec 04, 2019 8:01:41 AM org.assertj.core.util.FileFixture create
INFO: The file 'root/dir_1/file_1_1' exists
Dec 04, 2019 8:01:41 AM org.assertj.core.util.FileFixture create
INFO: Created file 'root/dir_1/file_1_2'
Dec 04, 2019 8:01:41 AM org.assertj.core.util.FileFixture create
INFO: The file 'root/dir_1/file_1_2' exists
Dec 04, 2019 8:01:41 AM org.assertj.core.util.FolderFixture create
INFO: Created directory 'root/dir_1/dir_1_1'
Dec 04, 2019 8:01:41 AM org.assertj.core.util.FileFixture create
INFO: Created file 'root/dir_1/dir_1_1/file_1_1_1'
Dec 04, 2019 8:01:41 AM org.assertj.core.util.FileFixture create
INFO: The file 'root/dir_1/dir_1_1/file_1_1_1' exists
Dec 04, 2019 8:01:41 AM org.assertj.core.util.FolderFixture create
INFO: Created directory 'root/dir_2'
Dec 04, 2019 8:01:41 AM org.assertj.core.util.FileFixture create
INFO: Created file 'root/dir_2/file_2_1'
Dec 04, 2019 8:01:41 AM org.assertj.core.util.FileFixture create
INFO: The file 'root/dir_2/file_2_1' exists
Dec 04, 2019 8:01:41 AM org.assertj.core.util.FileFixture create
INFO: Created file 'root/dir_2/file_2_2'
Dec 04, 2019 8:01:41 AM org.assertj.core.util.FileFixture create
INFO: The file 'root/dir_2/file_2_2' exists
Dec 04, 2019 8:01:41 AM org.assertj.core.util.FileFixture create
INFO: Created file 'root/dir_2/file_2_3'
Dec 04, 2019 8:01:41 AM org.assertj.core.util.FileFixture create
INFO: The file 'root/dir_2/file_2_3' exists
Dec 04, 2019 8:01:41 AM org.assertj.core.util.FileFixture delete
INFO: The file 'root/dir_1/dir_1_1/file_1_1_1' was deleted
Dec 04, 2019 8:01:41 AM org.assertj.core.util.FolderFixture delete
INFO: The directory 'root/dir_1/dir_1_1' was deleted
Dec 04, 2019 8:01:41 AM org.assertj.core.util.FileFixture delete
INFO: The file 'root/dir_1/file_1_1' was deleted
Dec 04, 2019 8:01:41 AM org.assertj.core.util.FileFixture delete
INFO: The file 'root/dir_1/file_1_2' was deleted
Dec 04, 2019 8:01:41 AM org.assertj.core.util.FolderFixture delete
INFO: The directory 'root/dir_1' was deleted
Dec 04, 2019 8:01:41 AM org.assertj.core.util.FileFixture delete
INFO: The file 'root/dir_2/file_2_1' was deleted
Dec 04, 2019 8:01:41 AM org.assertj.core.util.FileFixture delete
INFO: The file 'root/dir_2/file_2_2' was deleted
Dec 04, 2019 8:01:41 AM org.assertj.core.util.FileFixture delete
INFO: The file 'root/dir_2/file_2_3' was deleted
Dec 04, 2019 8:01:41 AM org.assertj.core.util.FolderFixture delete
INFO: The directory 'root/dir_2' was deleted
Dec 04, 2019 8:01:41 AM org.assertj.core.util.FolderFixture delete
INFO: The directory 'root' was deleted
Dec 04, 2019 8:01:41 AM org.assertj.core.util.FolderFixture create
INFO: Created directory 'root'
Dec 04, 2019 8:01:41 AM org.assertj.core.util.FolderFixture create
INFO: Created directory 'root/dir_1'
Dec 04, 2019 8:01:41 AM org.assertj.core.util.FileFixture create
INFO: Created file 'root/dir_1/file_1_1'
Dec 04, 2019 8:01:41 AM org.assertj.core.util.FileFixture create
INFO: The file 'root/dir_1/file_1_1' exists
Dec 04, 2019 8:01:41 AM org.assertj.core.util.FileFixture create
INFO: Created file 'root/dir_1/file_1_2'
Dec 04, 2019 8:01:41 AM org.assertj.core.util.FileFixture create
INFO: The file 'root/dir_1/file_1_2' exists
Dec 04, 2019 8:01:41 AM org.assertj.core.util.FolderFixture create
INFO: Created directory 'root/dir_1/dir_1_1'
Dec 04, 2019 8:01:41 AM org.assertj.core.util.FileFixture create
INFO: Created file 'root/dir_1/dir_1_1/file_1_1_1'
Dec 04, 2019 8:01:41 AM org.assertj.core.util.FileFixture create
INFO: The file 'root/dir_1/dir_1_1/file_1_1_1' exists
Dec 04, 2019 8:01:41 AM org.assertj.core.util.FolderFixture create
INFO: Created directory 'root/dir_2'
Dec 04, 2019 8:01:41 AM org.assertj.core.util.FileFixture create
INFO: Created file 'root/dir_2/file_2_1'
Dec 04, 2019 8:01:41 AM org.assertj.core.util.FileFixture create
INFO: The file 'root/dir_2/file_2_1' exists
Dec 04, 2019 8:01:41 AM org.assertj.core.util.FileFixture create
INFO: Created file 'root/dir_2/file_2_2'
Dec 04, 2019 8:01:41 AM org.assertj.core.util.FileFixture create
INFO: The file 'root/dir_2/file_2_2' exists
Dec 04, 2019 8:01:41 AM org.assertj.core.util.FileFixture create
INFO: Created file 'root/dir_2/file_2_3'
Dec 04, 2019 8:01:41 AM org.assertj.core.util.FileFixture create
INFO: The file 'root/dir_2/file_2_3' exists
Dec 04, 2019 8:01:41 AM org.assertj.core.util.FileFixture delete
INFO: The file 'root/dir_1/dir_1_1/file_1_1_1' was deleted
Dec 04, 2019 8:01:41 AM org.assertj.core.util.FolderFixture delete
INFO: The directory 'root/dir_1/dir_1_1' was deleted
Dec 04, 2019 8:01:41 AM org.assertj.core.util.FileFixture delete
INFO: The file 'root/dir_1/file_1_1' was deleted
Dec 04, 2019 8:01:41 AM org.assertj.core.util.FileFixture delete
INFO: The file 'root/dir_1/file_1_2' was deleted
Dec 04, 2019 8:01:41 AM org.assertj.core.util.FolderFixture delete
INFO: The directory 'root/dir_1' was deleted
Dec 04, 2019 8:01:41 AM org.assertj.core.util.FileFixture delete
INFO: The file 'root/dir_2/file_2_1' was deleted
Dec 04, 2019 8:01:41 AM org.assertj.core.util.FileFixture delete
INFO: The file 'root/dir_2/file_2_2' was deleted
Dec 04, 2019 8:01:41 AM org.assertj.core.util.FileFixture delete
INFO: The file 'root/dir_2/file_2_3' was deleted
Dec 04, 2019 8:01:41 AM org.assertj.core.util.FolderFixture delete
INFO: The directory 'root/dir_2' was deleted
Dec 04, 2019 8:01:41 AM org.assertj.core.util.FolderFixture delete
INFO: The directory 'root' was deleted
Dec 04, 2019 8:01:41 AM org.assertj.core.util.FolderFixture create
INFO: Created directory 'root'
Dec 04, 2019 8:01:41 AM org.assertj.core.util.FolderFixture create
INFO: Created directory 'root/dir_1'
Dec 04, 2019 8:01:41 AM org.assertj.core.util.FileFixture create
INFO: Created file 'root/dir_1/file_1_1'
Dec 04, 2019 8:01:41 AM org.assertj.core.util.FileFixture create
INFO: The file 'root/dir_1/file_1_1' exists
Dec 04, 2019 8:01:41 AM org.assertj.core.util.FileFixture create
INFO: Created file 'root/dir_1/file_1_2'
Dec 04, 2019 8:01:41 AM org.assertj.core.util.FileFixture create
INFO: The file 'root/dir_1/file_1_2' exists
Dec 04, 2019 8:01:41 AM org.assertj.core.util.FolderFixture create
INFO: Created directory 'root/dir_1/dir_1_1'
Dec 04, 2019 8:01:41 AM org.assertj.core.util.FileFixture create
INFO: Created file 'root/dir_1/dir_1_1/file_1_1_1'
Dec 04, 2019 8:01:41 AM org.assertj.core.util.FileFixture create
INFO: The file 'root/dir_1/dir_1_1/file_1_1_1' exists
Dec 04, 2019 8:01:41 AM org.assertj.core.util.FolderFixture create
INFO: Created directory 'root/dir_2'
Dec 04, 2019 8:01:41 AM org.assertj.core.util.FileFixture create
INFO: Created file 'root/dir_2/file_2_1'
Dec 04, 2019 8:01:41 AM org.assertj.core.util.FileFixture create
INFO: The file 'root/dir_2/file_2_1' exists
Dec 04, 2019 8:01:41 AM org.assertj.core.util.FileFixture create
INFO: Created file 'root/dir_2/file_2_2'
Dec 04, 2019 8:01:41 AM org.assertj.core.util.FileFixture create
INFO: The file 'root/dir_2/file_2_2' exists
Dec 04, 2019 8:01:41 AM org.assertj.core.util.FileFixture create
INFO: Created file 'root/dir_2/file_2_3'
Dec 04, 2019 8:01:41 AM org.assertj.core.util.FileFixture create
INFO: The file 'root/dir_2/file_2_3' exists
Dec 04, 2019 8:01:41 AM org.assertj.core.util.FileFixture delete
INFO: The file 'root/dir_1/dir_1_1/file_1_1_1' was deleted
Dec 04, 2019 8:01:41 AM org.assertj.core.util.FolderFixture delete
INFO: The directory 'root/dir_1/dir_1_1' was deleted
Dec 04, 2019 8:01:41 AM org.assertj.core.util.FileFixture delete
INFO: The file 'root/dir_1/file_1_1' was deleted
Dec 04, 2019 8:01:41 AM org.assertj.core.util.FileFixture delete
INFO: The file 'root/dir_1/file_1_2' was deleted
Dec 04, 2019 8:01:41 AM org.assertj.core.util.FolderFixture delete
INFO: The directory 'root/dir_1' was deleted
Dec 04, 2019 8:01:41 AM org.assertj.core.util.FileFixture delete
INFO: The file 'root/dir_2/file_2_1' was deleted
Dec 04, 2019 8:01:41 AM org.assertj.core.util.FileFixture delete
INFO: The file 'root/dir_2/file_2_2' was deleted
Dec 04, 2019 8:01:41 AM org.assertj.core.util.FileFixture delete
INFO: The file 'root/dir_2/file_2_3' was deleted
Dec 04, 2019 8:01:41 AM org.assertj.core.util.FolderFixture delete
INFO: The directory 'root/dir_2' was deleted
Dec 04, 2019 8:01:41 AM org.assertj.core.util.FolderFixture delete
INFO: The directory 'root' was deleted
[INFO] Tests run: 4, Failures: 0, Errors: 0, Skipped: 0, Time elapsed: 0.026 s - in org.assertj.core.util.Files_fileNamesIn_Test
[INFO] Running org.assertj.core.util.ArrayWrapperList_wrap_Test
[INFO] Tests run: 3, Failures: 0, Errors: 0, Skipped: 0, Time elapsed: 0.001 s - in org.assertj.core.util.ArrayWrapperList_wrap_Test
[INFO] Running org.assertj.core.util.IterableUtil_sizeOf_Test
[INFO] Tests run: 4, Failures: 0, Errors: 0, Skipped: 0, Time elapsed: 0.003 s - in org.assertj.core.util.IterableUtil_sizeOf_Test
[INFO] Running org.assertj.core.util.IterableUtil_toArray_Test
[INFO] Tests run: 4, Failures: 0, Errors: 0, Skipped: 0, Time elapsed: 0.002 s - in org.assertj.core.util.IterableUtil_toArray_Test
[INFO] Running org.assertj.core.util.FloatComparatorTest
[INFO] Tests run: 17, Failures: 0, Errors: 0, Skipped: 0, Time elapsed: 0.009 s - in org.assertj.core.util.FloatComparatorTest
[INFO] Running org.assertj.core.util.DateUtil_parse_date_time_Test
[INFO] Tests run: 3, Failures: 0, Errors: 0, Skipped: 0, Time elapsed: 0.001 s - in org.assertj.core.util.DateUtil_parse_date_time_Test
[INFO] Running org.assertj.core.util.Files_newFolder_Test
Dec 04, 2019 8:01:41 AM org.assertj.core.util.FolderFixture create
INFO: Created directory 'root'
Dec 04, 2019 8:01:41 AM org.assertj.core.util.FolderFixture create
INFO: Created directory 'root/dir_1'
Dec 04, 2019 8:01:41 AM org.assertj.core.util.FileFixture create
INFO: Created file 'root/dir_1/file_1_1'
Dec 04, 2019 8:01:41 AM org.assertj.core.util.FileFixture create
INFO: The file 'root/dir_1/file_1_1' exists
Dec 04, 2019 8:01:41 AM org.assertj.core.util.FileFixture create
INFO: Created file 'root/dir_1/file_1_2'
Dec 04, 2019 8:01:41 AM org.assertj.core.util.FileFixture create
INFO: The file 'root/dir_1/file_1_2' exists
Dec 04, 2019 8:01:41 AM org.assertj.core.util.FolderFixture create
INFO: Created directory 'root/dir_1/dir_1_1'
Dec 04, 2019 8:01:41 AM org.assertj.core.util.FileFixture create
INFO: Created file 'root/dir_1/dir_1_1/file_1_1_1'
Dec 04, 2019 8:01:41 AM org.assertj.core.util.FileFixture create
INFO: The file 'root/dir_1/dir_1_1/file_1_1_1' exists
Dec 04, 2019 8:01:41 AM org.assertj.core.util.FolderFixture create
INFO: Created directory 'root/dir_2'
Dec 04, 2019 8:01:41 AM org.assertj.core.util.FileFixture create
INFO: Created file 'root/dir_2/file_2_1'
Dec 04, 2019 8:01:41 AM org.assertj.core.util.FileFixture create
INFO: The file 'root/dir_2/file_2_1' exists
Dec 04, 2019 8:01:41 AM org.assertj.core.util.FileFixture create
INFO: Created file 'root/dir_2/file_2_2'
Dec 04, 2019 8:01:41 AM org.assertj.core.util.FileFixture create
INFO: The file 'root/dir_2/file_2_2' exists
Dec 04, 2019 8:01:41 AM org.assertj.core.util.FileFixture create
INFO: Created file 'root/dir_2/file_2_3'
Dec 04, 2019 8:01:41 AM org.assertj.core.util.FileFixture create
INFO: The file 'root/dir_2/file_2_3' exists
Dec 04, 2019 8:01:41 AM org.assertj.core.util.FileFixture delete
INFO: The file 'root/dir_1/dir_1_1/file_1_1_1' was deleted
Dec 04, 2019 8:01:41 AM org.assertj.core.util.FolderFixture delete
INFO: The directory 'root/dir_1/dir_1_1' was deleted
Dec 04, 2019 8:01:41 AM org.assertj.core.util.FileFixture delete
INFO: The file 'root/dir_1/file_1_1' was deleted
Dec 04, 2019 8:01:41 AM org.assertj.core.util.FileFixture delete
INFO: The file 'root/dir_1/file_1_2' was deleted
Dec 04, 2019 8:01:41 AM org.assertj.core.util.FolderFixture delete
INFO: The directory 'root/dir_1' was deleted
Dec 04, 2019 8:01:41 AM org.assertj.core.util.FileFixture delete
INFO: The file 'root/dir_2/file_2_1' was deleted
Dec 04, 2019 8:01:41 AM org.assertj.core.util.FileFixture delete
INFO: The file 'root/dir_2/file_2_2' was deleted
Dec 04, 2019 8:01:41 AM org.assertj.core.util.FileFixture delete
INFO: The file 'root/dir_2/file_2_3' was deleted
Dec 04, 2019 8:01:41 AM org.assertj.core.util.FolderFixture delete
INFO: The directory 'root/dir_2' was deleted
Dec 04, 2019 8:01:41 AM org.assertj.core.util.FolderFixture delete
INFO: The directory 'root' was deleted
[INFO] Tests run: 1, Failures: 0, Errors: 0, Skipped: 0, Time elapsed: 0.007 s - in org.assertj.core.util.Files_newFolder_Test
[INFO] Running org.assertj.core.util.Preconditions_checkNotNullOrEmpty_String_String_Test
[INFO] Tests run: 3, Failures: 0, Errors: 0, Skipped: 0, Time elapsed: 0 s - in org.assertj.core.util.Preconditions_checkNotNullOrEmpty_String_String_Test
[INFO] Running org.assertj.core.util.Objects_areEqual_Test
[INFO] Tests run: 10, Failures: 0, Errors: 0, Skipped: 0, Time elapsed: 0.001 s - in org.assertj.core.util.Objects_areEqual_Test
[INFO] Running org.assertj.core.util.Objects_castIfBelongsToType_Test
[INFO] Tests run: 3, Failures: 0, Errors: 0, Skipped: 0, Time elapsed: 0.001 s - in org.assertj.core.util.Objects_castIfBelongsToType_Test
[INFO] Running org.assertj.core.util.Files_newFile_Test
Dec 04, 2019 8:01:41 AM org.assertj.core.util.FolderFixture create
INFO: Created directory 'root'
Dec 04, 2019 8:01:41 AM org.assertj.core.util.FolderFixture create
INFO: Created directory 'root/dir_1'
Dec 04, 2019 8:01:41 AM org.assertj.core.util.FileFixture create
INFO: Created file 'root/dir_1/file_1_1'
Dec 04, 2019 8:01:41 AM org.assertj.core.util.FileFixture create
INFO: The file 'root/dir_1/file_1_1' exists
Dec 04, 2019 8:01:41 AM org.assertj.core.util.FileFixture create
INFO: Created file 'root/dir_1/file_1_2'
Dec 04, 2019 8:01:41 AM org.assertj.core.util.FileFixture create
INFO: The file 'root/dir_1/file_1_2' exists
Dec 04, 2019 8:01:41 AM org.assertj.core.util.FolderFixture create
INFO: Created directory 'root/dir_1/dir_1_1'
Dec 04, 2019 8:01:41 AM org.assertj.core.util.FileFixture create
INFO: Created file 'root/dir_1/dir_1_1/file_1_1_1'
Dec 04, 2019 8:01:41 AM org.assertj.core.util.FileFixture create
INFO: The file 'root/dir_1/dir_1_1/file_1_1_1' exists
Dec 04, 2019 8:01:41 AM org.assertj.core.util.FolderFixture create
INFO: Created directory 'root/dir_2'
Dec 04, 2019 8:01:41 AM org.assertj.core.util.FileFixture create
INFO: Created file 'root/dir_2/file_2_1'
Dec 04, 2019 8:01:41 AM org.assertj.core.util.FileFixture create
INFO: The file 'root/dir_2/file_2_1' exists
Dec 04, 2019 8:01:41 AM org.assertj.core.util.FileFixture create
INFO: Created file 'root/dir_2/file_2_2'
Dec 04, 2019 8:01:41 AM org.assertj.core.util.FileFixture create
INFO: The file 'root/dir_2/file_2_2' exists
Dec 04, 2019 8:01:41 AM org.assertj.core.util.FileFixture create
INFO: Created file 'root/dir_2/file_2_3'
Dec 04, 2019 8:01:41 AM org.assertj.core.util.FileFixture create
INFO: The file 'root/dir_2/file_2_3' exists
Dec 04, 2019 8:01:41 AM org.assertj.core.util.FileFixture delete
INFO: The file 'root/dir_1/dir_1_1/file_1_1_1' was deleted
Dec 04, 2019 8:01:41 AM org.assertj.core.util.FolderFixture delete
INFO: The directory 'root/dir_1/dir_1_1' was deleted
Dec 04, 2019 8:01:41 AM org.assertj.core.util.FileFixture delete
INFO: The file 'root/dir_1/file_1_1' was deleted
Dec 04, 2019 8:01:41 AM org.assertj.core.util.FileFixture delete
INFO: The file 'root/dir_1/file_1_2' was deleted
Dec 04, 2019 8:01:41 AM org.assertj.core.util.FolderFixture delete
INFO: The directory 'root/dir_1' was deleted
Dec 04, 2019 8:01:41 AM org.assertj.core.util.FileFixture delete
INFO: The file 'root/dir_2/file_2_1' was deleted
Dec 04, 2019 8:01:41 AM org.assertj.core.util.FileFixture delete
INFO: The file 'root/dir_2/file_2_2' was deleted
Dec 04, 2019 8:01:41 AM org.assertj.core.util.FileFixture delete
INFO: The file 'root/dir_2/file_2_3' was deleted
Dec 04, 2019 8:01:41 AM org.assertj.core.util.FolderFixture delete
INFO: The directory 'root/dir_2' was deleted
Dec 04, 2019 8:01:41 AM org.assertj.core.util.FolderFixture delete
INFO: The directory 'root' was deleted
Dec 04, 2019 8:01:41 AM org.assertj.core.util.FolderFixture create
INFO: Created directory 'root'
Dec 04, 2019 8:01:41 AM org.assertj.core.util.FolderFixture create
INFO: Created directory 'root/dir_1'
Dec 04, 2019 8:01:41 AM org.assertj.core.util.FileFixture create
INFO: Created file 'root/dir_1/file_1_1'
Dec 04, 2019 8:01:41 AM org.assertj.core.util.FileFixture create
INFO: The file 'root/dir_1/file_1_1' exists
Dec 04, 2019 8:01:41 AM org.assertj.core.util.FileFixture create
INFO: Created file 'root/dir_1/file_1_2'
Dec 04, 2019 8:01:41 AM org.assertj.core.util.FileFixture create
INFO: The file 'root/dir_1/file_1_2' exists
Dec 04, 2019 8:01:41 AM org.assertj.core.util.FolderFixture create
INFO: Created directory 'root/dir_1/dir_1_1'
Dec 04, 2019 8:01:41 AM org.assertj.core.util.FileFixture create
INFO: Created file 'root/dir_1/dir_1_1/file_1_1_1'
Dec 04, 2019 8:01:41 AM org.assertj.core.util.FileFixture create
INFO: The file 'root/dir_1/dir_1_1/file_1_1_1' exists
Dec 04, 2019 8:01:41 AM org.assertj.core.util.FolderFixture create
INFO: Created directory 'root/dir_2'
Dec 04, 2019 8:01:41 AM org.assertj.core.util.FileFixture create
INFO: Created file 'root/dir_2/file_2_1'
Dec 04, 2019 8:01:41 AM org.assertj.core.util.FileFixture create
INFO: The file 'root/dir_2/file_2_1' exists
Dec 04, 2019 8:01:41 AM org.assertj.core.util.FileFixture create
INFO: Created file 'root/dir_2/file_2_2'
Dec 04, 2019 8:01:41 AM org.assertj.core.util.FileFixture create
INFO: The file 'root/dir_2/file_2_2' exists
Dec 04, 2019 8:01:41 AM org.assertj.core.util.FileFixture create
INFO: Created file 'root/dir_2/file_2_3'
Dec 04, 2019 8:01:41 AM org.assertj.core.util.FileFixture create
INFO: The file 'root/dir_2/file_2_3' exists
Dec 04, 2019 8:01:41 AM org.assertj.core.util.FileFixture delete
INFO: The file 'root/dir_1/dir_1_1/file_1_1_1' was deleted
Dec 04, 2019 8:01:41 AM org.assertj.core.util.FolderFixture delete
INFO: The directory 'root/dir_1/dir_1_1' was deleted
Dec 04, 2019 8:01:41 AM org.assertj.core.util.FileFixture delete
INFO: The file 'root/dir_1/file_1_1' was deleted
Dec 04, 2019 8:01:41 AM org.assertj.core.util.FileFixture delete
INFO: The file 'root/dir_1/file_1_2' was deleted
Dec 04, 2019 8:01:41 AM org.assertj.core.util.FolderFixture delete
INFO: The directory 'root/dir_1' was deleted
Dec 04, 2019 8:01:41 AM org.assertj.core.util.FileFixture delete
INFO: The file 'root/dir_2/file_2_1' was deleted
Dec 04, 2019 8:01:41 AM org.assertj.core.util.FileFixture delete
INFO: The file 'root/dir_2/file_2_2' was deleted
Dec 04, 2019 8:01:41 AM org.assertj.core.util.FileFixture delete
INFO: The file 'root/dir_2/file_2_3' was deleted
Dec 04, 2019 8:01:41 AM org.assertj.core.util.FolderFixture delete
INFO: The directory 'root/dir_2' was deleted
Dec 04, 2019 8:01:41 AM org.assertj.core.util.FolderFixture delete
INFO: The directory 'root' was deleted
Dec 04, 2019 8:01:41 AM org.assertj.core.util.FolderFixture create
INFO: Created directory 'root'
Dec 04, 2019 8:01:41 AM org.assertj.core.util.FolderFixture create
INFO: Created directory 'root/dir_1'
Dec 04, 2019 8:01:41 AM org.assertj.core.util.FileFixture create
INFO: Created file 'root/dir_1/file_1_1'
Dec 04, 2019 8:01:41 AM org.assertj.core.util.FileFixture create
INFO: The file 'root/dir_1/file_1_1' exists
Dec 04, 2019 8:01:41 AM org.assertj.core.util.FileFixture create
INFO: Created file 'root/dir_1/file_1_2'
Dec 04, 2019 8:01:41 AM org.assertj.core.util.FileFixture create
INFO: The file 'root/dir_1/file_1_2' exists
Dec 04, 2019 8:01:41 AM org.assertj.core.util.FolderFixture create
INFO: Created directory 'root/dir_1/dir_1_1'
Dec 04, 2019 8:01:41 AM org.assertj.core.util.FileFixture create
INFO: Created file 'root/dir_1/dir_1_1/file_1_1_1'
Dec 04, 2019 8:01:41 AM org.assertj.core.util.FileFixture create
INFO: The file 'root/dir_1/dir_1_1/file_1_1_1' exists
Dec 04, 2019 8:01:41 AM org.assertj.core.util.FolderFixture create
INFO: Created directory 'root/dir_2'
Dec 04, 2019 8:01:41 AM org.assertj.core.util.FileFixture create
INFO: Created file 'root/dir_2/file_2_1'
Dec 04, 2019 8:01:41 AM org.assertj.core.util.FileFixture create
INFO: The file 'root/dir_2/file_2_1' exists
Dec 04, 2019 8:01:41 AM org.assertj.core.util.FileFixture create
INFO: Created file 'root/dir_2/file_2_2'
Dec 04, 2019 8:01:41 AM org.assertj.core.util.FileFixture create
INFO: The file 'root/dir_2/file_2_2' exists
Dec 04, 2019 8:01:41 AM org.assertj.core.util.FileFixture create
INFO: Created file 'root/dir_2/file_2_3'
Dec 04, 2019 8:01:41 AM org.assertj.core.util.FileFixture create
INFO: The file 'root/dir_2/file_2_3' exists
Dec 04, 2019 8:01:41 AM org.assertj.core.util.FileFixture delete
INFO: The file 'root/dir_1/dir_1_1/file_1_1_1' was deleted
Dec 04, 2019 8:01:41 AM org.assertj.core.util.FolderFixture delete
INFO: The directory 'root/dir_1/dir_1_1' was deleted
Dec 04, 2019 8:01:41 AM org.assertj.core.util.FileFixture delete
INFO: The file 'root/dir_1/file_1_1' was deleted
Dec 04, 2019 8:01:41 AM org.assertj.core.util.FileFixture delete
INFO: The file 'root/dir_1/file_1_2' was deleted
Dec 04, 2019 8:01:41 AM org.assertj.core.util.FolderFixture delete
INFO: The directory 'root/dir_1' was deleted
Dec 04, 2019 8:01:41 AM org.assertj.core.util.FileFixture delete
INFO: The file 'root/dir_2/file_2_1' was deleted
Dec 04, 2019 8:01:41 AM org.assertj.core.util.FileFixture delete
INFO: The file 'root/dir_2/file_2_2' was deleted
Dec 04, 2019 8:01:41 AM org.assertj.core.util.FileFixture delete
INFO: The file 'root/dir_2/file_2_3' was deleted
Dec 04, 2019 8:01:41 AM org.assertj.core.util.FolderFixture delete
INFO: The directory 'root/dir_2' was deleted
Dec 04, 2019 8:01:41 AM org.assertj.core.util.FolderFixture delete
INFO: The directory 'root' was deleted
[INFO] Tests run: 3, Failures: 0, Errors: 0, Skipped: 0, Time elapsed: 0.031 s - in org.assertj.core.util.Files_newFile_Test
[INFO] Running org.assertj.core.util.diff.GenerateUnifiedDiffTest
[INFO] Tests run: 7, Failures: 0, Errors: 0, Skipped: 0, Time elapsed: 0.024 s - in org.assertj.core.util.diff.GenerateUnifiedDiffTest
[INFO] Running org.assertj.core.util.diff.PatchTest
[INFO] Tests run: 3, Failures: 0, Errors: 0, Skipped: 0, Time elapsed: 0.001 s - in org.assertj.core.util.diff.PatchTest
[INFO] Running org.assertj.core.util.diff.ChangeDeltaTest
[INFO] Tests run: 2, Failures: 0, Errors: 0, Skipped: 0, Time elapsed: 0.001 s - in org.assertj.core.util.diff.ChangeDeltaTest
[INFO] Running org.assertj.core.util.diff.Delta_equals_hashCode_Test
[INFO] Tests run: 7, Failures: 0, Errors: 0, Skipped: 0, Time elapsed: 0.001 s - in org.assertj.core.util.diff.Delta_equals_hashCode_Test
[INFO] Running org.assertj.core.util.diff.myers.SnakeTest
[INFO] Tests run: 1, Failures: 0, Errors: 0, Skipped: 0, Time elapsed: 0 s - in org.assertj.core.util.diff.myers.SnakeTest
[INFO] Running org.assertj.core.util.diff.DeleteDeltaTest
[INFO] Tests run: 2, Failures: 0, Errors: 0, Skipped: 0, Time elapsed: 0 s - in org.assertj.core.util.diff.DeleteDeltaTest
[INFO] Running org.assertj.core.util.diff.DiffTest
[INFO] Tests run: 5, Failures: 0, Errors: 0, Skipped: 0, Time elapsed: 0.002 s - in org.assertj.core.util.diff.DiffTest
[INFO] Running org.assertj.core.util.diff.ChunkTest
[INFO] Tests run: 8, Failures: 0, Errors: 0, Skipped: 0, Time elapsed: 0.005 s - in org.assertj.core.util.diff.ChunkTest
[INFO] Running org.assertj.core.util.diff.InsertDeltaTest
[INFO] Tests run: 2, Failures: 0, Errors: 0, Skipped: 0, Time elapsed: 0.001 s - in org.assertj.core.util.diff.InsertDeltaTest
[INFO] Running org.example.test.BDDSoftAssertionsLineNumberTest
[INFO] Tests run: 1, Failures: 0, Errors: 0, Skipped: 0, Time elapsed: 0.002 s - in org.example.test.BDDSoftAssertionsLineNumberTest
[INFO] Running org.example.test.SoftAssertionsLineNumberTest
[INFO] Tests run: 2, Failures: 0, Errors: 0, Skipped: 0, Time elapsed: 0.003 s - in org.example.test.SoftAssertionsLineNumberTest
[INFO] Running org.example.test.AutoClosableSoftAssertionsLineNumberTest
[INFO] Tests run: 1, Failures: 0, Errors: 0, Skipped: 0, Time elapsed: 0.002 s - in org.example.test.AutoClosableSoftAssertionsLineNumberTest
[INFO] Running org.example.test.CustomSoftAssertionsLineNumberTest
[WARNING] Tests run: 1, Failures: 0, Errors: 0, Skipped: 1, Time elapsed: 0.001 s - in org.example.test.CustomSoftAssertionsLineNumberTest
[INFO] Running org.example.custom.SoftAssertionsErrorDescriptionTest
[INFO] Tests run: 1, Failures: 0, Errors: 0, Skipped: 0, Time elapsed: 0.001 s - in org.example.custom.SoftAssertionsErrorDescriptionTest
[INFO] Running org.example.custom.CustomAsserts_filter_stacktrace_Test
[INFO] Tests run: 5, Failures: 0, Errors: 0, Skipped: 0, Time elapsed: 0.007 s - in org.example.custom.CustomAsserts_filter_stacktrace_Test
[INFO] 
[INFO] Results:
[INFO] 
[WARNING] Tests run: 12410, Failures: 0, Errors: 0, Skipped: 9
[INFO] 
[INFO] 
[INFO] --- jacoco-maven-plugin:0.8.1:report (jacoco-report) @ assertj-core ---
[INFO] Loading execution data file /builds/workspace/AssertJ/target/jacoco.exec
[INFO] Analyzed bundle 'AssertJ fluent assertions' with 604 classes
[INFO] 
[INFO] --- jacoco-maven-plugin:0.8.1:check (default-check) @ assertj-core ---
[INFO] Loading execution data file /builds/workspace/AssertJ/target/jacoco.exec
[INFO] Analyzed bundle 'assertj-core' with 604 classes
[INFO] All coverage checks have been met.
[INFO] 
[INFO] --- maven-bundle-plugin:4.1.0:bundle (default-bundle) @ assertj-core ---
[WARNING] Bundle org.assertj:assertj-core:bundle:3.11.2-SNAPSHOT : Export org.assertj.core.error,  has 1,  private references [org.assertj.core.internal]
[WARNING] Bundle org.assertj:assertj-core:bundle:3.11.2-SNAPSHOT : Export org.assertj.core.api,  has 1,  private references [org.assertj.core.internal]
[WARNING] Bundle org.assertj:assertj-core:bundle:3.11.2-SNAPSHOT : Export org.assertj.core.presentation,  has 1,  private references [org.assertj.core.internal]
[INFO] 
[INFO] --- maven-source-plugin:3.0.1:jar-no-fork (attach-sources) @ assertj-core ---
[INFO] Building jar: /builds/workspace/AssertJ/target/assertj-core-3.11.2-SNAPSHOT-sources.jar
[INFO] 
[INFO] --- maven-shade-plugin:3.1.1:shade (default) @ assertj-core ---
[INFO] Including net.bytebuddy:byte-buddy:jar:1.9.1 in the shaded jar.
[WARNING] Discovered module-info.class. Shading will break its strong encapsulation.
[INFO] Replacing original artifact with shaded artifact.
[INFO] Replacing /builds/workspace/AssertJ/target/assertj-core-3.11.2-SNAPSHOT.jar with /builds/workspace/AssertJ/target/assertj-core-3.11.2-SNAPSHOT-shaded.jar
[INFO] Dependency-reduced POM written at: /builds/workspace/AssertJ/dependency-reduced-pom.xml
[INFO] 
[INFO] --- maven-dependency-plugin:2.8:unpack (unpack-shade) @ assertj-core ---
[INFO] Configured Artifact: org.assertj:assertj-core:3.11.2-SNAPSHOT:jar
[INFO] Unpacking /builds/workspace/AssertJ/target/assertj-core-3.11.2-SNAPSHOT.jar to /builds/workspace/AssertJ/target/classes with includes "" and excludes ""
[INFO] 
[INFO] --- maven-bundle-plugin:4.1.0:bundle (bundle-after-unpack-shaded) @ assertj-core ---
[INFO] Unable to determine whether the meta annotation edu.umd.cs.findbugs.annotations.SuppressFBWarnings applied to type org.assertj.core.internal.bytebuddy.ClassFileVersion$VersionLocator$CreationAction provides bundle annotations as it is not on the project build path. If this annotation does provide bundle annotations then it must be present on the build path in order to be processed
[INFO] 
[INFO] --- maven-install-plugin:2.5.2:install (default-install) @ assertj-core ---
[INFO] Installing /builds/workspace/AssertJ/target/assertj-core-3.11.2-SNAPSHOT.jar to /builds/.m2/repository/org/assertj/assertj-core/3.11.2-SNAPSHOT/assertj-core-3.11.2-SNAPSHOT.jar
[INFO] Installing /builds/workspace/AssertJ/dependency-reduced-pom.xml to /builds/.m2/repository/org/assertj/assertj-core/3.11.2-SNAPSHOT/assertj-core-3.11.2-SNAPSHOT.pom
[INFO] Installing /builds/workspace/AssertJ/target/assertj-core-3.11.2-SNAPSHOT-sources.jar to /builds/.m2/repository/org/assertj/assertj-core/3.11.2-SNAPSHOT/assertj-core-3.11.2-SNAPSHOT-sources.jar
[INFO] 
[INFO] --- maven-bundle-plugin:4.1.0:install (default-install) @ assertj-core ---
[INFO] Installing org/assertj/assertj-core/3.11.2-SNAPSHOT/assertj-core-3.11.2-SNAPSHOT.jar
[INFO] Writing OBR metadata
[INFO] ------------------------------------------------------------------------
[INFO] BUILD SUCCESS
[INFO] ------------------------------------------------------------------------
[INFO] Total time: 01:48 min
[INFO] Finished at: 2019-12-04T08:01:55+01:00
[INFO] Final Memory: 40M/213M
[INFO] ------------------------------------------------------------------------
 
--- Displays results of the maven compile ---
Time to compile: 109698
Number of tests: 12410
Number of tests skipped: 9
Number of failures in tests: 0
Number of errors in tests: 0
 
-------------------------------------------------------
Inserts the maven plugin to spoon the project
-------------------------------------------------------
 
Picked up JAVA_TOOL_OPTIONS: -Dfile.encoding=UTF8
[INFO] Scanning for projects...
[INFO] Inspecting build with total of 1 modules...
[INFO] Installing Nexus Staging features:
[INFO]   ... total of 1 executions of maven-deploy-plugin replaced with nexus-staging-maven-plugin
[INFO]                                                                         
[INFO] ------------------------------------------------------------------------
[INFO] Building AssertJ fluent assertions 3.11.2-SNAPSHOT
[INFO] ------------------------------------------------------------------------
[INFO] 
[INFO] --- maven-dependency-plugin:2.8:purge-local-repository (default-cli) @ assertj-core ---
[INFO] ------------------------------------------------------------------------
[INFO] BUILD SUCCESS
[INFO] ------------------------------------------------------------------------
[INFO] Total time: 3.888 s
[INFO] Finished at: 2019-12-04T08:02:34+01:00
[INFO] Final Memory: 20M/188M
[INFO] ------------------------------------------------------------------------
Picked up JAVA_TOOL_OPTIONS: -Dfile.encoding=UTF8
[INFO] Scanning for projects...
[INFO] Inspecting build with total of 1 modules...
[INFO] Installing Nexus Staging features:
[INFO]   ... total of 1 executions of maven-deploy-plugin replaced with nexus-staging-maven-plugin
[INFO]                                                                         
[INFO] ------------------------------------------------------------------------
[INFO] Building AssertJ fluent assertions 3.11.2-SNAPSHOT
[INFO] ------------------------------------------------------------------------
Downloading: https://repo.maven.apache.org/maven2/fr/inria/gforge/spoon/spoon-maven-plugin/3.1/spoon-maven-plugin-3.1.pom

[INFO] ------------------------------------------------------------------------
[INFO] BUILD FAILURE
[INFO] ------------------------------------------------------------------------
[INFO] Total time: 12.894 s
[INFO] Finished at: 2019-12-04T08:02:49+01:00
[INFO] Final Memory: 17M/187M
[INFO] ------------------------------------------------------------------------
[ERROR] Plugin fr.inria.gforge.spoon:spoon-maven-plugin:3.1 or one of its dependencies could not be resolved: Failed to read artifact descriptor for fr.inria.gforge.spoon:spoon-maven-plugin:jar:3.1: Could not transfer artifact fr.inria.gforge.spoon:spoon-maven-plugin:pom:3.1 from/to central (https://repo.maven.apache.org/maven2): repo.maven.apache.org: Temporary failure in name resolution: Unknown host repo.maven.apache.org: Temporary failure in name resolution -> [Help 1]
[ERROR] 
[ERROR] To see the full stack trace of the errors, re-run Maven with the -e switch.
[ERROR] Re-run Maven using the -X switch to enable full debug logging.
[ERROR] 
[ERROR] For more information about the errors and possible solutions, please read the following articles:
[ERROR] [Help 1] http://cwiki.apache.org/confluence/display/MAVEN/PluginResolutionException
Error: Maven compile with spoon unsuccessful!
Build step 'Execute shell' marked build as failure
Archiving artifacts
/net/www/ci/sos/jobs/AssertJ/builds/1173/archive does not exist.
ERROR: Step ‘Publish XML Summary Reports’ failed: /net/www/ci/sos/jobs/AssertJ/builds/1173/archive does not exist.
Sending e-mails to: spoon-devel@lists.gforge.inria.fr
Finished: FAILURE