FailedConsole Output

Started by timer
Running as SYSTEM
[EnvInject] - Loading node environment variables.
Building remotely on sos-builder01 (lin) in workspace /builds/workspace/Commons-codec
No credentials specified
 > git rev-parse --is-inside-work-tree # timeout=10
Fetching changes from the remote Git repository
 > git config remote.origin.url https://github.com/apache/commons-codec.git # timeout=10
Fetching upstream changes from https://github.com/apache/commons-codec.git
 > git --version # timeout=10
 > git fetch --tags --progress https://github.com/apache/commons-codec.git +refs/heads/*:refs/remotes/origin/*
 > git rev-parse refs/remotes/origin/trunk^{commit} # timeout=10
 > git rev-parse refs/remotes/origin/origin/trunk^{commit} # timeout=10
Checking out Revision 163d643d1176e0dc9334ee83e21b9ce21d24fc1a (refs/remotes/origin/trunk)
 > git config core.sparsecheckout # timeout=10
 > git checkout -f 163d643d1176e0dc9334ee83e21b9ce21d24fc1a
Commit message: "Make Javadoc 11 happy with HTML 5 compliance."
 > git rev-list --no-walk 163d643d1176e0dc9334ee83e21b9ce21d24fc1a # timeout=10
[Commons-codec] $ /bin/sh -xe /tmp/jenkins1049541230595362573.sh
+ curl http://spoon.gforge.inria.fr/jenkins/build.sh
+ bash
  % Total    % Received % Xferd  Average Speed   Time    Time     Time  Current
                                 Dload  Upload   Total   Spent    Left  Speed

  0     0    0     0    0     0      0      0 --:--:-- --:--:-- --:--:--     0
100 21193  100 21193    0     0   676k      0 --:--:-- --:--:-- --:--:--  689k
 
-------------------------------------------------------
Initizalizes project
-------------------------------------------------------
 
HEAD is now at 163d643 Make Javadoc 11 happy with HTML 5 compliance.

--- Displays variables used in the build ---
Artifact id: commons-codec
Version: 1.12-SNAPSHOT
Modules job:
- Commons-codec
Has checkstyle: true
Has enforcer: true
Git version id: 163d643d1176e0dc9334ee83e21b9ce21d24fc1a
Java version: Picked up JAVA_TOOL_OPTIONS: -Dfile.encoding=UTF8
java version "1.8.0_151"
Java(TM) SE Runtime Environment (build 1.8.0_151-b12)
Java HotSpot(TM) 64-Bit Server VM (build 25.151-b12, mixed mode)
Java home: /builds/tools/hudson.model.JDK/JDK_8.0.151
 
-------------------------------------------------------
Compiles project (at the root project if it's a multi module project) without spoon
-------------------------------------------------------
 
Picked up JAVA_TOOL_OPTIONS: -Dfile.encoding=UTF8
[INFO] Scanning for projects...
[INFO]                                                                         
[INFO] ------------------------------------------------------------------------
[INFO] Building Apache Commons Codec 1.12-SNAPSHOT
[INFO] ------------------------------------------------------------------------
[INFO] 
[INFO] --- maven-clean-plugin:3.0.0:clean (default-clean) @ commons-codec ---
[INFO] Deleting /builds/workspace/Commons-codec/target
[INFO] 
[INFO] --- maven-enforcer-plugin:3.0.0-M2:enforce (enforce-maven-version) @ commons-codec ---
[INFO] 
[INFO] --- maven-enforcer-plugin:3.0.0-M2:enforce (enforce-maven-3) @ commons-codec ---
[INFO] 
[INFO] --- build-helper-maven-plugin:3.0.0:parse-version (parse-version) @ commons-codec ---
[INFO] 
[INFO] --- maven-antrun-plugin:1.8:run (javadoc.resources) @ commons-codec ---
[INFO] Executing tasks

main:
     [copy] Copying 2 files to /builds/workspace/Commons-codec/target/apidocs/META-INF
[INFO] Executed tasks
[INFO] 
[INFO] --- maven-remote-resources-plugin:1.5:process (process-resource-bundles) @ commons-codec ---
[INFO] 
[INFO] --- buildnumber-maven-plugin:1.4:create (default) @ commons-codec ---
[INFO] Executing: /bin/sh -c cd '/builds/workspace/Commons-codec' && 'svn' '--non-interactive' 'info'
[INFO] Working directory: /builds/workspace/Commons-codec
[INFO] Storing buildNumber: ?????? at timestamp: 1575402068744
[INFO] Executing: /bin/sh -c cd '/builds/workspace/Commons-codec' && 'svn' '--non-interactive' 'info'
[INFO] Working directory: /builds/workspace/Commons-codec
[INFO] Storing buildScmBranch: UNKNOWN_BRANCH
[INFO] 
[INFO] --- maven-resources-plugin:3.0.2:resources (default-resources) @ commons-codec ---
[INFO] Using 'UTF-8' encoding to copy filtered resources.
[INFO] Copying 128 resources
[INFO] Copying 2 resources to META-INF
[INFO] 
[INFO] --- maven-compiler-plugin:3.7.0:compile (default-compile) @ commons-codec ---
[INFO] Changes detected - recompiling the module!
[INFO] Compiling 66 source files to /builds/workspace/Commons-codec/target/classes
[INFO] 
[INFO] --- maven-bundle-plugin:3.5.0:manifest (bundle-manifest) @ commons-codec ---
[INFO] 
[INFO] --- animal-sniffer-maven-plugin:1.16:check (checkAPIcompatibility) @ commons-codec ---
[INFO] Checking unresolved references to org.codehaus.mojo.signature:java17:1.0
[INFO] 
[INFO] --- maven-resources-plugin:3.0.2:testResources (default-testResources) @ commons-codec ---
[INFO] Using 'UTF-8' encoding to copy filtered resources.
[INFO] Copying 2 resources
[INFO] Copying 2 resources to META-INF
[INFO] 
[INFO] --- maven-compiler-plugin:3.7.0:testCompile (default-testCompile) @ commons-codec ---
[INFO] Changes detected - recompiling the module!
[INFO] Compiling 61 source files to /builds/workspace/Commons-codec/target/test-classes
[INFO] 
[INFO] --- jacoco-maven-plugin:0.8.1:prepare-agent (prepare-agent) @ commons-codec ---
[INFO] argLine set to -javaagent:/builds/.m2/repository/org/jacoco/org.jacoco.agent/0.8.1/org.jacoco.agent-0.8.1-runtime.jar=destfile=/builds/workspace/Commons-codec/target/jacoco.exec
[INFO] 
[INFO] --- maven-surefire-plugin:2.22.0:test (default-test) @ commons-codec ---
[INFO] 
[INFO] -------------------------------------------------------
[INFO]  T E S T S
[INFO] -------------------------------------------------------
[INFO] Running org.apache.commons.codec.language.DoubleMetaphoneTest
[INFO] Tests run: 16, Failures: 0, Errors: 0, Skipped: 0, Time elapsed: 0.103 s - in org.apache.commons.codec.language.DoubleMetaphoneTest
[INFO] Running org.apache.commons.codec.language.ColognePhoneticTest
[INFO] Tests run: 15, Failures: 0, Errors: 0, Skipped: 0, Time elapsed: 0.013 s - in org.apache.commons.codec.language.ColognePhoneticTest
[INFO] Running org.apache.commons.codec.language.RefinedSoundexTest
[INFO] Tests run: 10, Failures: 0, Errors: 0, Skipped: 0, Time elapsed: 0.01 s - in org.apache.commons.codec.language.RefinedSoundexTest
[INFO] Running org.apache.commons.codec.language.Caverphone2Test
[INFO] Tests run: 13, Failures: 0, Errors: 0, Skipped: 0, Time elapsed: 0.055 s - in org.apache.commons.codec.language.Caverphone2Test
[INFO] Running org.apache.commons.codec.language.MetaphoneTest
[INFO] Tests run: 34, Failures: 0, Errors: 0, Skipped: 0, Time elapsed: 0.074 s - in org.apache.commons.codec.language.MetaphoneTest
[INFO] Running org.apache.commons.codec.language.MatchRatingApproachEncoderTest
[INFO] Tests run: 96, Failures: 0, Errors: 0, Skipped: 0, Time elapsed: 0.074 s - in org.apache.commons.codec.language.MatchRatingApproachEncoderTest
[INFO] Running org.apache.commons.codec.language.NysiisTest
[INFO] Tests run: 23, Failures: 0, Errors: 0, Skipped: 0, Time elapsed: 0.016 s - in org.apache.commons.codec.language.NysiisTest
[INFO] Running org.apache.commons.codec.language.SoundexTest
[INFO] Tests run: 31, Failures: 0, Errors: 0, Skipped: 0, Time elapsed: 0.032 s - in org.apache.commons.codec.language.SoundexTest
[INFO] Running org.apache.commons.codec.language.bm.LanguageGuessingTest
[INFO] Tests run: 18, Failures: 0, Errors: 0, Skipped: 0, Time elapsed: 0.105 s - in org.apache.commons.codec.language.bm.LanguageGuessingTest
[INFO] Running org.apache.commons.codec.language.bm.BeiderMorseEncoderTest
[INFO] Tests run: 22, Failures: 0, Errors: 0, Skipped: 0, Time elapsed: 3.046 s - in org.apache.commons.codec.language.bm.BeiderMorseEncoderTest
[INFO] Running org.apache.commons.codec.language.bm.PhoneticEngineTest
[INFO] Tests run: 8, Failures: 0, Errors: 0, Skipped: 0, Time elapsed: 0.019 s - in org.apache.commons.codec.language.bm.PhoneticEngineTest
[INFO] Running org.apache.commons.codec.language.bm.RuleTest
[INFO] Tests run: 3, Failures: 0, Errors: 0, Skipped: 0, Time elapsed: 0.006 s - in org.apache.commons.codec.language.bm.RuleTest
[INFO] Running org.apache.commons.codec.language.bm.PhoneticEngineRegressionTest
[INFO] Tests run: 4, Failures: 0, Errors: 0, Skipped: 0, Time elapsed: 0.008 s - in org.apache.commons.codec.language.bm.PhoneticEngineRegressionTest
[INFO] Running org.apache.commons.codec.language.DoubleMetaphone2Test
[INFO] Tests run: 6, Failures: 0, Errors: 0, Skipped: 0, Time elapsed: 0.009 s - in org.apache.commons.codec.language.DoubleMetaphone2Test
[INFO] Running org.apache.commons.codec.language.Caverphone1Test
[INFO] Tests run: 9, Failures: 0, Errors: 0, Skipped: 0, Time elapsed: 0.003 s - in org.apache.commons.codec.language.Caverphone1Test
[INFO] Running org.apache.commons.codec.language.DaitchMokotoffSoundexTest
[INFO] Tests run: 13, Failures: 0, Errors: 0, Skipped: 0, Time elapsed: 0.017 s - in org.apache.commons.codec.language.DaitchMokotoffSoundexTest
[INFO] Running org.apache.commons.codec.DecoderExceptionTest
[INFO] Tests run: 4, Failures: 0, Errors: 0, Skipped: 0, Time elapsed: 0.003 s - in org.apache.commons.codec.DecoderExceptionTest
[INFO] Running org.apache.commons.codec.net.PercentCodecTest
[WARNING] Tests run: 12, Failures: 0, Errors: 0, Skipped: 1, Time elapsed: 0.013 s - in org.apache.commons.codec.net.PercentCodecTest
[INFO] Running org.apache.commons.codec.net.BCodecTest
[INFO] Tests run: 9, Failures: 0, Errors: 0, Skipped: 0, Time elapsed: 0.016 s - in org.apache.commons.codec.net.BCodecTest
[INFO] Running org.apache.commons.codec.net.UtilsTest
[INFO] Tests run: 1, Failures: 0, Errors: 0, Skipped: 0, Time elapsed: 0 s - in org.apache.commons.codec.net.UtilsTest
[INFO] Running org.apache.commons.codec.net.URLCodecTest
[INFO] Tests run: 16, Failures: 0, Errors: 0, Skipped: 0, Time elapsed: 0.013 s - in org.apache.commons.codec.net.URLCodecTest
[INFO] Running org.apache.commons.codec.net.QuotedPrintableCodecTest
[INFO] Tests run: 21, Failures: 0, Errors: 0, Skipped: 0, Time elapsed: 0.016 s - in org.apache.commons.codec.net.QuotedPrintableCodecTest
[INFO] Running org.apache.commons.codec.net.QCodecTest
[INFO] Tests run: 12, Failures: 0, Errors: 0, Skipped: 0, Time elapsed: 0 s - in org.apache.commons.codec.net.QCodecTest
[INFO] Running org.apache.commons.codec.net.RFC1522CodecTest
[INFO] Tests run: 2, Failures: 0, Errors: 0, Skipped: 0, Time elapsed: 0 s - in org.apache.commons.codec.net.RFC1522CodecTest
[INFO] Running org.apache.commons.codec.binary.Base64OutputStreamTest
[INFO] Tests run: 7, Failures: 0, Errors: 0, Skipped: 0, Time elapsed: 0.209 s - in org.apache.commons.codec.binary.Base64OutputStreamTest
[INFO] Running org.apache.commons.codec.binary.StringUtilsTest
[INFO] Tests run: 21, Failures: 0, Errors: 0, Skipped: 0, Time elapsed: 0.008 s - in org.apache.commons.codec.binary.StringUtilsTest
[INFO] Running org.apache.commons.codec.binary.Base64Codec13Test
[INFO] Tests run: 8, Failures: 0, Errors: 0, Skipped: 0, Time elapsed: 0.009 s - in org.apache.commons.codec.binary.Base64Codec13Test
[INFO] Running org.apache.commons.codec.binary.BaseNCodecTest
[INFO] Tests run: 7, Failures: 0, Errors: 0, Skipped: 0, Time elapsed: 0 s - in org.apache.commons.codec.binary.BaseNCodecTest
[INFO] Running org.apache.commons.codec.binary.Base32Test
[INFO] Tests run: 16, Failures: 0, Errors: 0, Skipped: 0, Time elapsed: 0.049 s - in org.apache.commons.codec.binary.Base32Test
[INFO] Running org.apache.commons.codec.binary.HexTest
[INFO] Tests run: 44, Failures: 0, Errors: 0, Skipped: 0, Time elapsed: 0.463 s - in org.apache.commons.codec.binary.HexTest
[INFO] Running org.apache.commons.codec.binary.Base32OutputStreamTest
[INFO] Tests run: 6, Failures: 0, Errors: 0, Skipped: 0, Time elapsed: 0.164 s - in org.apache.commons.codec.binary.Base32OutputStreamTest
[INFO] Running org.apache.commons.codec.binary.Base64Test
[WARNING] Tests run: 56, Failures: 0, Errors: 0, Skipped: 1, Time elapsed: 0.032 s - in org.apache.commons.codec.binary.Base64Test
[INFO] Running org.apache.commons.codec.binary.Base64InputStreamTest
[INFO] Tests run: 19, Failures: 0, Errors: 0, Skipped: 0, Time elapsed: 0.129 s - in org.apache.commons.codec.binary.Base64InputStreamTest
[INFO] Running org.apache.commons.codec.binary.Base32InputStreamTest
[INFO] Tests run: 16, Failures: 0, Errors: 0, Skipped: 0, Time elapsed: 0.144 s - in org.apache.commons.codec.binary.Base32InputStreamTest
[INFO] Running org.apache.commons.codec.binary.BinaryCodecTest
[INFO] Tests run: 13, Failures: 0, Errors: 0, Skipped: 0, Time elapsed: 0.005 s - in org.apache.commons.codec.binary.BinaryCodecTest
[INFO] Running org.apache.commons.codec.EncoderExceptionTest
[INFO] Tests run: 4, Failures: 0, Errors: 0, Skipped: 0, Time elapsed: 0.002 s - in org.apache.commons.codec.EncoderExceptionTest
[INFO] Running org.apache.commons.codec.CharsetsTest
[INFO] Tests run: 7, Failures: 0, Errors: 0, Skipped: 0, Time elapsed: 0.002 s - in org.apache.commons.codec.CharsetsTest
[INFO] Running org.apache.commons.codec.StringEncoderComparatorTest
[INFO] Tests run: 3, Failures: 0, Errors: 0, Skipped: 0, Time elapsed: 0.002 s - in org.apache.commons.codec.StringEncoderComparatorTest
[INFO] Running org.apache.commons.codec.digest.Md5CryptTest
[INFO] Tests run: 7, Failures: 0, Errors: 0, Skipped: 0, Time elapsed: 0.061 s - in org.apache.commons.codec.digest.Md5CryptTest
[INFO] Running org.apache.commons.codec.digest.HmacUtilsTest
[INFO] Tests run: 23, Failures: 0, Errors: 0, Skipped: 0, Time elapsed: 0.524 s - in org.apache.commons.codec.digest.HmacUtilsTest
[INFO] Running org.apache.commons.codec.digest.Sha256CryptTest
[INFO] Tests run: 7, Failures: 0, Errors: 0, Skipped: 0, Time elapsed: 0.438 s - in org.apache.commons.codec.digest.Sha256CryptTest
[INFO] Running org.apache.commons.codec.digest.PureJavaCrc32CTest
[INFO] Tests run: 4, Failures: 0, Errors: 0, Skipped: 0, Time elapsed: 0.007 s - in org.apache.commons.codec.digest.PureJavaCrc32CTest
[INFO] Running org.apache.commons.codec.digest.XXHash32Test
[INFO] Tests run: 2, Failures: 0, Errors: 0, Skipped: 0, Time elapsed: 0.005 s - in org.apache.commons.codec.digest.XXHash32Test
[INFO] Running org.apache.commons.codec.digest.DigestUtilsTest
[WARNING] Tests run: 29, Failures: 0, Errors: 0, Skipped: 8, Time elapsed: 1.103 s - in org.apache.commons.codec.digest.DigestUtilsTest
[INFO] Running org.apache.commons.codec.digest.Apr1CryptTest
[INFO] Tests run: 8, Failures: 0, Errors: 0, Skipped: 0, Time elapsed: 0.041 s - in org.apache.commons.codec.digest.Apr1CryptTest
[INFO] Running org.apache.commons.codec.digest.CryptTest
[INFO] Tests run: 4, Failures: 0, Errors: 0, Skipped: 0, Time elapsed: 0.038 s - in org.apache.commons.codec.digest.CryptTest
[INFO] Running org.apache.commons.codec.digest.MessageDigestAlgorithmsTest
[WARNING] Tests run: 66, Failures: 0, Errors: 0, Skipped: 24, Time elapsed: 3.23 s - in org.apache.commons.codec.digest.MessageDigestAlgorithmsTest
[INFO] Running org.apache.commons.codec.digest.Sha512CryptTest
[INFO] Tests run: 8, Failures: 0, Errors: 0, Skipped: 0, Time elapsed: 0.139 s - in org.apache.commons.codec.digest.Sha512CryptTest
[INFO] Running org.apache.commons.codec.digest.Sha2CryptTest
[INFO] Tests run: 1, Failures: 0, Errors: 0, Skipped: 0, Time elapsed: 0.002 s - in org.apache.commons.codec.digest.Sha2CryptTest
[INFO] Running org.apache.commons.codec.digest.B64Test
[INFO] Tests run: 2, Failures: 0, Errors: 0, Skipped: 0, Time elapsed: 0 s - in org.apache.commons.codec.digest.B64Test
[INFO] Running org.apache.commons.codec.digest.HmacAlgorithmsTest
[INFO] Tests run: 96, Failures: 0, Errors: 0, Skipped: 0, Time elapsed: 0.965 s - in org.apache.commons.codec.digest.HmacAlgorithmsTest
[INFO] Running org.apache.commons.codec.digest.UnixCryptTest
[INFO] Tests run: 9, Failures: 0, Errors: 0, Skipped: 0, Time elapsed: 0.003 s - in org.apache.commons.codec.digest.UnixCryptTest
[INFO] Running org.apache.commons.codec.digest.PureJavaCrc32Test
[INFO] Tests run: 1, Failures: 0, Errors: 0, Skipped: 0, Time elapsed: 0.268 s - in org.apache.commons.codec.digest.PureJavaCrc32Test
[INFO] Running org.apache.commons.codec.CharEncodingTest
[INFO] Tests run: 7, Failures: 0, Errors: 0, Skipped: 0, Time elapsed: 0 s - in org.apache.commons.codec.CharEncodingTest
[INFO] 
[INFO] Results:
[INFO] 
[WARNING] Tests run: 899, Failures: 0, Errors: 0, Skipped: 34
[INFO] 
[INFO] 
[INFO] --- maven-jar-plugin:3.1.0:jar (default-jar) @ commons-codec ---
[INFO] Building jar: /builds/workspace/Commons-codec/target/commons-codec-1.12-SNAPSHOT.jar
[INFO] 
[INFO] --- maven-site-plugin:3.7.1:attach-descriptor (attach-descriptor) @ commons-codec ---
[INFO] Skipping because packaging 'jar' is not pom.
[INFO] 
[INFO] --- maven-jar-plugin:3.1.0:test-jar (default) @ commons-codec ---
[INFO] Building jar: /builds/workspace/Commons-codec/target/commons-codec-1.12-SNAPSHOT-tests.jar
[INFO] 
[INFO] --- maven-source-plugin:3.0.1:jar-no-fork (create-source-jar) @ commons-codec ---
[INFO] Building jar: /builds/workspace/Commons-codec/target/commons-codec-1.12-SNAPSHOT-sources.jar
[INFO] 
[INFO] --- maven-source-plugin:3.0.1:test-jar-no-fork (create-source-jar) @ commons-codec ---
[INFO] Building jar: /builds/workspace/Commons-codec/target/commons-codec-1.12-SNAPSHOT-test-sources.jar
[INFO] 
[INFO] --- jacoco-maven-plugin:0.8.1:check (check) @ commons-codec ---
[INFO] Loading execution data file /builds/workspace/Commons-codec/target/jacoco.exec
[INFO] Analyzed bundle 'commons-codec' with 89 classes
[WARNING] Rule violated for bundle commons-codec: classes covered ratio is 0.95, but expected minimum is 1.00
[WARNING] Rule violated for bundle commons-codec: methods covered ratio is 0.87, but expected minimum is 0.95
[WARNING] Coverage checks have not been met. See log for details.
[INFO] 
[INFO] --- maven-install-plugin:2.5.2:install (default-install) @ commons-codec ---
[INFO] Installing /builds/workspace/Commons-codec/target/commons-codec-1.12-SNAPSHOT.jar to /builds/.m2/repository/commons-codec/commons-codec/1.12-SNAPSHOT/commons-codec-1.12-SNAPSHOT.jar
[INFO] Installing /builds/workspace/Commons-codec/pom.xml to /builds/.m2/repository/commons-codec/commons-codec/1.12-SNAPSHOT/commons-codec-1.12-SNAPSHOT.pom
[INFO] Installing /builds/workspace/Commons-codec/target/commons-codec-1.12-SNAPSHOT-tests.jar to /builds/.m2/repository/commons-codec/commons-codec/1.12-SNAPSHOT/commons-codec-1.12-SNAPSHOT-tests.jar
[INFO] Installing /builds/workspace/Commons-codec/target/commons-codec-1.12-SNAPSHOT-sources.jar to /builds/.m2/repository/commons-codec/commons-codec/1.12-SNAPSHOT/commons-codec-1.12-SNAPSHOT-sources.jar
[INFO] Installing /builds/workspace/Commons-codec/target/commons-codec-1.12-SNAPSHOT-test-sources.jar to /builds/.m2/repository/commons-codec/commons-codec/1.12-SNAPSHOT/commons-codec-1.12-SNAPSHOT-test-sources.jar
[INFO] ------------------------------------------------------------------------
[INFO] BUILD SUCCESS
[INFO] ------------------------------------------------------------------------
[INFO] Total time: 30.991 s
[INFO] Finished at: 2019-12-03T20:41:34+01:00
[INFO] Final Memory: 34M/205M
[INFO] ------------------------------------------------------------------------
 
--- Displays results of the maven compile ---
Time to compile: 33687
Number of tests: 899
Number of tests skipped: 34
Number of failures in tests: 0
Number of errors in tests: 0
 
-------------------------------------------------------
Inserts the maven plugin to spoon the project
-------------------------------------------------------
 
Picked up JAVA_TOOL_OPTIONS: -Dfile.encoding=UTF8
[INFO] Scanning for projects...
[INFO]                                                                         
[INFO] ------------------------------------------------------------------------
[INFO] Building Apache Commons Codec 1.12-SNAPSHOT
[INFO] ------------------------------------------------------------------------
[INFO] 
[INFO] --- maven-dependency-plugin:2.10:purge-local-repository (default-cli) @ commons-codec ---
[INFO] ------------------------------------------------------------------------
[INFO] BUILD SUCCESS
[INFO] ------------------------------------------------------------------------
[INFO] Total time: 1.855 s
[INFO] Finished at: 2019-12-03T20:41:39+01:00
[INFO] Final Memory: 24M/161M
[INFO] ------------------------------------------------------------------------
Picked up JAVA_TOOL_OPTIONS: -Dfile.encoding=UTF8
[INFO] Scanning for projects...
[INFO]                                                                         
[INFO] ------------------------------------------------------------------------
[INFO] Building Apache Commons Codec 1.12-SNAPSHOT
[INFO] ------------------------------------------------------------------------
[INFO] 
[INFO] --- maven-clean-plugin:3.0.0:clean (default-clean) @ commons-codec ---
[INFO] Deleting /builds/workspace/Commons-codec/target
[INFO] 
[INFO] --- maven-enforcer-plugin:3.0.0-M2:enforce (enforce-maven-version) @ commons-codec ---
[INFO] 
[INFO] --- maven-enforcer-plugin:3.0.0-M2:enforce (enforce-maven-3) @ commons-codec ---
[INFO] 
[INFO] --- build-helper-maven-plugin:3.0.0:parse-version (parse-version) @ commons-codec ---
[INFO] 
[INFO] --- maven-antrun-plugin:1.8:run (javadoc.resources) @ commons-codec ---
[INFO] Executing tasks

main:
     [copy] Copying 2 files to /builds/workspace/Commons-codec/target/apidocs/META-INF
[INFO] Executed tasks
[INFO] 
[INFO] --- spoon-maven-plugin:3.1:generate (default) @ commons-codec ---
Downloading: https://repo.maven.apache.org/maven2/fr/inria/gforge/spoon/spoon-core/maven-metadata.xml
Downloading: https://oss.sonatype.org/content/repositories/snapshots/fr/inria/gforge/spoon/spoon-core/maven-metadata.xml
Downloading: http://maven.inria.fr/artifactory/spoon-public-snapshot/fr/inria/gforge/spoon/spoon-core/maven-metadata.xml
647/647 B   
            
Downloaded: http://maven.inria.fr/artifactory/spoon-public-snapshot/fr/inria/gforge/spoon/spoon-core/maven-metadata.xml (647 B at 5.3 KB/sec)
2/3 KB      
3/3 KB   
         
Downloaded: https://repo.maven.apache.org/maven2/fr/inria/gforge/spoon/spoon-core/maven-metadata.xml (3 KB at 9.3 KB/sec)
         
[WARNING] Could not transfer metadata fr.inria.gforge.spoon:spoon-core/maven-metadata.xml from/to sonatype-nexus-snapshots (https://oss.sonatype.org/content/repositories/snapshots): Connect to oss.sonatype.org:443 [oss.sonatype.org/35.169.48.141, oss.sonatype.org/54.85.107.240, oss.sonatype.org/34.226.166.85, oss.sonatype.org/3.222.227.3] failed: Connection timed out (Connection timed out)
Downloading: https://repo.maven.apache.org/maven2/fr/inria/gforge/spoon/spoon-core/7.0.0/spoon-core-7.0.0.pom
2/22 KB   
3/22 KB   
5/22 KB   
6/22 KB   
7/22 KB   
9/22 KB   
10/22 KB   
11/22 KB   
13/22 KB   
14/22 KB   
15/22 KB   
17/22 KB   
18/22 KB   
19/22 KB   
21/22 KB   
22/22 KB   
           
Downloaded: https://repo.maven.apache.org/maven2/fr/inria/gforge/spoon/spoon-core/7.0.0/spoon-core-7.0.0.pom (22 KB at 643.8 KB/sec)
Downloading: https://oss.sonatype.org/content/repositories/snapshots/fr/inria/gforge/spoon/spoon-core/7.1.0-SNAPSHOT/maven-metadata.xml
           
[WARNING] Could not transfer metadata fr.inria.gforge.spoon:spoon-core:7.1.0-SNAPSHOT/maven-metadata.xml from/to sonatype-nexus-snapshots (https://oss.sonatype.org/content/repositories/snapshots): Connect to oss.sonatype.org:443 [oss.sonatype.org/35.169.48.141, oss.sonatype.org/34.226.166.85, oss.sonatype.org/3.222.227.3, oss.sonatype.org/54.85.107.240] failed: Connection timed out (Connection timed out)
[WARNING] Failure to transfer fr.inria.gforge.spoon:spoon-core:7.1.0-SNAPSHOT/maven-metadata.xml from https://oss.sonatype.org/content/repositories/snapshots was cached in the local repository, resolution will not be reattempted until the update interval of sonatype-nexus-snapshots has elapsed or updates are forced. Original error: Could not transfer metadata fr.inria.gforge.spoon:spoon-core:7.1.0-SNAPSHOT/maven-metadata.xml from/to sonatype-nexus-snapshots (https://oss.sonatype.org/content/repositories/snapshots): Connect to oss.sonatype.org:443 [oss.sonatype.org/35.169.48.141, oss.sonatype.org/34.226.166.85, oss.sonatype.org/3.222.227.3, oss.sonatype.org/54.85.107.240] failed: Connection timed out (Connection timed out)
Downloading: https://oss.sonatype.org/content/repositories/snapshots/fr/inria/gforge/spoon/spoon-core/7.2.0-SNAPSHOT/maven-metadata.xml
           
[WARNING] Could not transfer metadata fr.inria.gforge.spoon:spoon-core:7.2.0-SNAPSHOT/maven-metadata.xml from/to sonatype-nexus-snapshots (https://oss.sonatype.org/content/repositories/snapshots): Connect to oss.sonatype.org:443 [oss.sonatype.org/3.222.227.3, oss.sonatype.org/54.85.107.240, oss.sonatype.org/35.169.48.141, oss.sonatype.org/34.226.166.85] failed: Connection timed out (Connection timed out)
[WARNING] Failure to transfer fr.inria.gforge.spoon:spoon-core:7.2.0-SNAPSHOT/maven-metadata.xml from https://oss.sonatype.org/content/repositories/snapshots was cached in the local repository, resolution will not be reattempted until the update interval of sonatype-nexus-snapshots has elapsed or updates are forced. Original error: Could not transfer metadata fr.inria.gforge.spoon:spoon-core:7.2.0-SNAPSHOT/maven-metadata.xml from/to sonatype-nexus-snapshots (https://oss.sonatype.org/content/repositories/snapshots): Connect to oss.sonatype.org:443 [oss.sonatype.org/3.222.227.3, oss.sonatype.org/54.85.107.240, oss.sonatype.org/35.169.48.141, oss.sonatype.org/34.226.166.85] failed: Connection timed out (Connection timed out)
Downloading: https://oss.sonatype.org/content/repositories/snapshots/fr/inria/gforge/spoon/spoon-core/7.3.0-SNAPSHOT/maven-metadata.xml
           
[WARNING] Could not transfer metadata fr.inria.gforge.spoon:spoon-core:7.3.0-SNAPSHOT/maven-metadata.xml from/to sonatype-nexus-snapshots (https://oss.sonatype.org/content/repositories/snapshots): Connect to oss.sonatype.org:443 [oss.sonatype.org/3.222.227.3, oss.sonatype.org/54.85.107.240, oss.sonatype.org/35.169.48.141, oss.sonatype.org/34.226.166.85] failed: Connection timed out (Connection timed out)
[WARNING] Failure to transfer fr.inria.gforge.spoon:spoon-core:7.3.0-SNAPSHOT/maven-metadata.xml from https://oss.sonatype.org/content/repositories/snapshots was cached in the local repository, resolution will not be reattempted until the update interval of sonatype-nexus-snapshots has elapsed or updates are forced. Original error: Could not transfer metadata fr.inria.gforge.spoon:spoon-core:7.3.0-SNAPSHOT/maven-metadata.xml from/to sonatype-nexus-snapshots (https://oss.sonatype.org/content/repositories/snapshots): Connect to oss.sonatype.org:443 [oss.sonatype.org/3.222.227.3, oss.sonatype.org/54.85.107.240, oss.sonatype.org/35.169.48.141, oss.sonatype.org/34.226.166.85] failed: Connection timed out (Connection timed out)
Downloading: https://oss.sonatype.org/content/repositories/snapshots/fr/inria/gforge/spoon/spoon-core/7.4.0-SNAPSHOT/maven-metadata.xml
           
[WARNING] Could not transfer metadata fr.inria.gforge.spoon:spoon-core:7.4.0-SNAPSHOT/maven-metadata.xml from/to sonatype-nexus-snapshots (https://oss.sonatype.org/content/repositories/snapshots): Connect to oss.sonatype.org:443 [oss.sonatype.org/35.169.48.141, oss.sonatype.org/34.226.166.85, oss.sonatype.org/3.222.227.3, oss.sonatype.org/54.85.107.240] failed: Connection timed out (Connection timed out)
[WARNING] Failure to transfer fr.inria.gforge.spoon:spoon-core:7.4.0-SNAPSHOT/maven-metadata.xml from https://oss.sonatype.org/content/repositories/snapshots was cached in the local repository, resolution will not be reattempted until the update interval of sonatype-nexus-snapshots has elapsed or updates are forced. Original error: Could not transfer metadata fr.inria.gforge.spoon:spoon-core:7.4.0-SNAPSHOT/maven-metadata.xml from/to sonatype-nexus-snapshots (https://oss.sonatype.org/content/repositories/snapshots): Connect to oss.sonatype.org:443 [oss.sonatype.org/35.169.48.141, oss.sonatype.org/34.226.166.85, oss.sonatype.org/3.222.227.3, oss.sonatype.org/54.85.107.240] failed: Connection timed out (Connection timed out)
Downloading: https://oss.sonatype.org/content/repositories/snapshots/fr/inria/gforge/spoon/spoon-core/7.5.0-SNAPSHOT/maven-metadata.xml
           
[WARNING] Could not transfer metadata fr.inria.gforge.spoon:spoon-core:7.5.0-SNAPSHOT/maven-metadata.xml from/to sonatype-nexus-snapshots (https://oss.sonatype.org/content/repositories/snapshots): Connect to oss.sonatype.org:443 [oss.sonatype.org/34.226.166.85, oss.sonatype.org/35.169.48.141, oss.sonatype.org/3.222.227.3, oss.sonatype.org/54.85.107.240] failed: Connection timed out (Connection timed out)
[WARNING] Failure to transfer fr.inria.gforge.spoon:spoon-core:7.5.0-SNAPSHOT/maven-metadata.xml from https://oss.sonatype.org/content/repositories/snapshots was cached in the local repository, resolution will not be reattempted until the update interval of sonatype-nexus-snapshots has elapsed or updates are forced. Original error: Could not transfer metadata fr.inria.gforge.spoon:spoon-core:7.5.0-SNAPSHOT/maven-metadata.xml from/to sonatype-nexus-snapshots (https://oss.sonatype.org/content/repositories/snapshots): Connect to oss.sonatype.org:443 [oss.sonatype.org/34.226.166.85, oss.sonatype.org/35.169.48.141, oss.sonatype.org/3.222.227.3, oss.sonatype.org/54.85.107.240] failed: Connection timed out (Connection timed out)
Downloading: https://oss.sonatype.org/content/repositories/snapshots/fr/inria/gforge/spoon/spoon-core/7.6.0-SNAPSHOT/maven-metadata.xml
           
[WARNING] Could not transfer metadata fr.inria.gforge.spoon:spoon-core:7.6.0-SNAPSHOT/maven-metadata.xml from/to sonatype-nexus-snapshots (https://oss.sonatype.org/content/repositories/snapshots): Connect to oss.sonatype.org:443 [oss.sonatype.org/54.85.107.240, oss.sonatype.org/3.222.227.3, oss.sonatype.org/35.169.48.141, oss.sonatype.org/34.226.166.85] failed: Connection timed out (Connection timed out)
[WARNING] Failure to transfer fr.inria.gforge.spoon:spoon-core:7.6.0-SNAPSHOT/maven-metadata.xml from https://oss.sonatype.org/content/repositories/snapshots was cached in the local repository, resolution will not be reattempted until the update interval of sonatype-nexus-snapshots has elapsed or updates are forced. Original error: Could not transfer metadata fr.inria.gforge.spoon:spoon-core:7.6.0-SNAPSHOT/maven-metadata.xml from/to sonatype-nexus-snapshots (https://oss.sonatype.org/content/repositories/snapshots): Connect to oss.sonatype.org:443 [oss.sonatype.org/54.85.107.240, oss.sonatype.org/3.222.227.3, oss.sonatype.org/35.169.48.141, oss.sonatype.org/34.226.166.85] failed: Connection timed out (Connection timed out)
Downloading: https://oss.sonatype.org/content/repositories/snapshots/fr/inria/gforge/spoon/spoon-core/8.0.0-SNAPSHOT/maven-metadata.xml
           
[WARNING] Could not transfer metadata fr.inria.gforge.spoon:spoon-core:8.0.0-SNAPSHOT/maven-metadata.xml from/to sonatype-nexus-snapshots (https://oss.sonatype.org/content/repositories/snapshots): Connect to oss.sonatype.org:443 [oss.sonatype.org/54.85.107.240, oss.sonatype.org/34.226.166.85, oss.sonatype.org/3.222.227.3, oss.sonatype.org/35.169.48.141] failed: Connection timed out (Connection timed out)
[WARNING] Failure to transfer fr.inria.gforge.spoon:spoon-core:8.0.0-SNAPSHOT/maven-metadata.xml from https://oss.sonatype.org/content/repositories/snapshots was cached in the local repository, resolution will not be reattempted until the update interval of sonatype-nexus-snapshots has elapsed or updates are forced. Original error: Could not transfer metadata fr.inria.gforge.spoon:spoon-core:8.0.0-SNAPSHOT/maven-metadata.xml from/to sonatype-nexus-snapshots (https://oss.sonatype.org/content/repositories/snapshots): Connect to oss.sonatype.org:443 [oss.sonatype.org/54.85.107.240, oss.sonatype.org/34.226.166.85, oss.sonatype.org/3.222.227.3, oss.sonatype.org/35.169.48.141] failed: Connection timed out (Connection timed out)
Downloading: http://maven.inria.fr/artifactory/spoon-public-snapshot/fr/inria/gforge/spoon/spoon-core/8.0.0-SNAPSHOT/maven-metadata.xml
1013/1013 B   
              
Downloaded: http://maven.inria.fr/artifactory/spoon-public-snapshot/fr/inria/gforge/spoon/spoon-core/8.0.0-SNAPSHOT/maven-metadata.xml (1013 B at 26.0 KB/sec)
Downloading: http://maven.inria.fr/artifactory/spoon-public-snapshot/fr/inria/gforge/spoon/spoon-core/8.0.0-SNAPSHOT/spoon-core-8.0.0-20191105.234144-12.pom
4/7 KB        
7/7 KB   
         
Downloaded: http://maven.inria.fr/artifactory/spoon-public-snapshot/fr/inria/gforge/spoon/spoon-core/8.0.0-SNAPSHOT/spoon-core-8.0.0-20191105.234144-12.pom (7 KB at 290.8 KB/sec)
Downloading: https://repo.maven.apache.org/maven2/fr/inria/gforge/spoon/spoon-core/8.0.0/spoon-core-8.0.0.pom
         
Downloading: http://maven.inria.fr/artifactory/spoon-public-snapshot/fr/inria/gforge/spoon/spoon-core/8.0.0/spoon-core-8.0.0.pom
         
Downloading: https://repo.maven.apache.org/maven2/fr/inria/gforge/spoon/spoon-core/8.1.0-beta-1/spoon-core-8.1.0-beta-1.pom
         
Downloading: http://maven.inria.fr/artifactory/spoon-public-snapshot/fr/inria/gforge/spoon/spoon-core/8.1.0-beta-1/spoon-core-8.1.0-beta-1.pom
         
Downloading: https://repo.maven.apache.org/maven2/fr/inria/gforge/spoon/spoon-core/8.1.0-beta-2/spoon-core-8.1.0-beta-2.pom
         
Downloading: http://maven.inria.fr/artifactory/spoon-public-snapshot/fr/inria/gforge/spoon/spoon-core/8.1.0-beta-2/spoon-core-8.1.0-beta-2.pom
         
Downloading: https://repo.maven.apache.org/maven2/fr/inria/gforge/spoon/spoon-core/8.1.0-beta-3/spoon-core-8.1.0-beta-3.pom
         
Downloading: http://maven.inria.fr/artifactory/spoon-public-snapshot/fr/inria/gforge/spoon/spoon-core/8.1.0-beta-3/spoon-core-8.1.0-beta-3.pom
         
Downloading: https://repo.maven.apache.org/maven2/fr/inria/gforge/spoon/spoon-core/8.1.0-beta-4/spoon-core-8.1.0-beta-4.pom
         
Downloading: http://maven.inria.fr/artifactory/spoon-public-snapshot/fr/inria/gforge/spoon/spoon-core/8.1.0-beta-4/spoon-core-8.1.0-beta-4.pom
         
Downloading: https://repo.maven.apache.org/maven2/fr/inria/gforge/spoon/spoon-core/8.1.0-beta-5/spoon-core-8.1.0-beta-5.pom
         
Downloading: http://maven.inria.fr/artifactory/spoon-public-snapshot/fr/inria/gforge/spoon/spoon-core/8.1.0-beta-5/spoon-core-8.1.0-beta-5.pom
         
Downloading: http://maven.inria.fr/artifactory/spoon-public-snapshot/fr/inria/gforge/spoon/spoon-core/8.1.0-SNAPSHOT/maven-metadata.xml
Downloading: https://oss.sonatype.org/content/repositories/snapshots/fr/inria/gforge/spoon/spoon-core/8.1.0-SNAPSHOT/maven-metadata.xml
1013/1013 B   
              
Downloaded: http://maven.inria.fr/artifactory/spoon-public-snapshot/fr/inria/gforge/spoon/spoon-core/8.1.0-SNAPSHOT/maven-metadata.xml (1013 B at 30.9 KB/sec)
              
[WARNING] Could not transfer metadata fr.inria.gforge.spoon:spoon-core:8.1.0-SNAPSHOT/maven-metadata.xml from/to sonatype-nexus-snapshots (https://oss.sonatype.org/content/repositories/snapshots): Connect to oss.sonatype.org:443 [oss.sonatype.org/34.226.166.85, oss.sonatype.org/54.85.107.240, oss.sonatype.org/35.169.48.141, oss.sonatype.org/3.222.227.3] failed: Connection timed out (Connection timed out)
[WARNING] Failure to transfer fr.inria.gforge.spoon:spoon-core:8.1.0-SNAPSHOT/maven-metadata.xml from https://oss.sonatype.org/content/repositories/snapshots was cached in the local repository, resolution will not be reattempted until the update interval of sonatype-nexus-snapshots has elapsed or updates are forced. Original error: Could not transfer metadata fr.inria.gforge.spoon:spoon-core:8.1.0-SNAPSHOT/maven-metadata.xml from/to sonatype-nexus-snapshots (https://oss.sonatype.org/content/repositories/snapshots): Connect to oss.sonatype.org:443 [oss.sonatype.org/34.226.166.85, oss.sonatype.org/54.85.107.240, oss.sonatype.org/35.169.48.141, oss.sonatype.org/3.222.227.3] failed: Connection timed out (Connection timed out)
Downloading: http://maven.inria.fr/artifactory/spoon-public-snapshot/fr/inria/gforge/spoon/spoon-core/8.1.0-SNAPSHOT/spoon-core-8.1.0-20191202.234134-30.pom
4/7 KB        
7/7 KB   
         
Downloaded: http://maven.inria.fr/artifactory/spoon-public-snapshot/fr/inria/gforge/spoon/spoon-core/8.1.0-SNAPSHOT/spoon-core-8.1.0-20191202.234134-30.pom (7 KB at 176.3 KB/sec)
[INFO] ------------------------------------------------------------------------
[INFO] BUILD FAILURE
[INFO] ------------------------------------------------------------------------
[INFO] Total time: 01:16 h
[INFO] Finished at: 2019-12-03T21:58:19+01:00
[INFO] Final Memory: 18M/191M
[INFO] ------------------------------------------------------------------------
[ERROR] Failed to execute goal fr.inria.gforge.spoon:spoon-maven-plugin:3.1:generate (default) on project commons-codec: Execution default of goal fr.inria.gforge.spoon:spoon-maven-plugin:3.1:generate failed: Plugin fr.inria.gforge.spoon:spoon-maven-plugin:3.1 or one of its dependencies could not be resolved: Failed to collect dependencies at fr.inria.gforge.spoon:spoon-maven-plugin:jar:3.1 -> fr.inria.gforge.spoon:spoon-core:jar:8.0.0: Failed to read artifact descriptor for fr.inria.gforge.spoon:spoon-core:jar:8.0.0: Could not transfer artifact fr.inria.gforge.spoon:spoon-core:pom:8.0.0 from/to central (https://repo.maven.apache.org/maven2): repo.maven.apache.org: Temporary failure in name resolution: Unknown host repo.maven.apache.org: Temporary failure in name resolution -> [Help 1]
[ERROR] 
[ERROR] To see the full stack trace of the errors, re-run Maven with the -e switch.
[ERROR] Re-run Maven using the -X switch to enable full debug logging.
[ERROR] 
[ERROR] For more information about the errors and possible solutions, please read the following articles:
[ERROR] [Help 1] http://cwiki.apache.org/confluence/display/MAVEN/PluginResolutionException
Error: Maven compile with spoon unsuccessful!
Build step 'Execute shell' marked build as failure
Archiving artifacts
/net/www/ci/sos/jobs/Commons-codec/builds/1554/archive does not exist.
ERROR: Step ‘Publish XML Summary Reports’ failed: /net/www/ci/sos/jobs/Commons-codec/builds/1554/archive does not exist.
Finished: FAILURE