FailedConsole Output

Skipping 680 KB.. Full Log
 warning - Tag @link: reference not found: HttpConnectorFactory HTTP connector
[WARNING] /builds/workspace/Dropwizard/dropwizard-core/target/generated-sources/spoon/io/dropwizard/server/DefaultServerFactory.java:42: warning - Tag @link: reference not found: ConnectorFactory connectors
[WARNING] /builds/workspace/Dropwizard/dropwizard-core/target/generated-sources/spoon/io/dropwizard/server/DefaultServerFactory.java:42: warning - Tag @link: reference not found: HttpConnectorFactory HTTP connector
[WARNING] /builds/workspace/Dropwizard/dropwizard-core/target/generated-sources/spoon/io/dropwizard/server/DefaultServerFactory.java:42: warning - Tag @link: reference not found: ConnectorFactory connectors
[WARNING] /builds/workspace/Dropwizard/dropwizard-core/target/generated-sources/spoon/io/dropwizard/server/SimpleServerFactory.java:37: warning - Tag @link: reference not found: HttpConnectorFactory HTTP connector
[WARNING] /builds/workspace/Dropwizard/dropwizard-core/target/generated-sources/spoon/io/dropwizard/server/SimpleServerFactory.java:37: warning - Tag @link: reference not found: ConnectorFactory connector
[WARNING] /builds/workspace/Dropwizard/dropwizard-core/target/generated-sources/spoon/io/dropwizard/Application.java:33: warning - Tag @see: reference not found: Generics#getTypeParameter(Class, Class)
[WARNING] /builds/workspace/Dropwizard/dropwizard-core/target/generated-sources/spoon/io/dropwizard/Application.java:66: warning - Tag @link: reference not found: Environment
[WARNING] /builds/workspace/Dropwizard/dropwizard-core/target/generated-sources/spoon/io/dropwizard/ConfiguredBundle.java:20: warning - Tag @link: reference not found: Environment
[WARNING] /builds/workspace/Dropwizard/dropwizard-core/target/generated-sources/spoon/io/dropwizard/cli/CheckCommand.java:8: warning - Tag @link: reference not found: Configuration
[WARNING] /builds/workspace/Dropwizard/dropwizard-core/target/generated-sources/spoon/io/dropwizard/cli/ServerCommand.java:8: warning - Tag @link: reference not found: Configuration
[WARNING] /builds/workspace/Dropwizard/dropwizard-core/target/generated-sources/spoon/io/dropwizard/setup/Bootstrap.java:117: warning - Tag @link: reference not found: Bundle
[WARNING] /builds/workspace/Dropwizard/dropwizard-core/target/generated-sources/spoon/io/dropwizard/setup/Bootstrap.java:128: warning - Tag @link: reference not found: ConfiguredBundle
[WARNING] /builds/workspace/Dropwizard/dropwizard-core/target/generated-sources/spoon/io/dropwizard/setup/Bootstrap.java:139: warning - Tag @link: reference not found: Command
[WARNING] /builds/workspace/Dropwizard/dropwizard-core/target/generated-sources/spoon/io/dropwizard/setup/Bootstrap.java:149: warning - Tag @link: reference not found: ConfiguredCommand
[WARNING] /builds/workspace/Dropwizard/dropwizard-core/target/generated-sources/spoon/io/dropwizard/setup/Bootstrap.java:168: warning - Tag @link: reference not found: Jackson#newMinimalObjectMapper()
[WARNING] /builds/workspace/Dropwizard/dropwizard-core/target/generated-sources/spoon/io/dropwizard/setup/Bootstrap.java:168: warning - Tag @link: reference not found: Jackson#newObjectMapper()
[INFO] Building jar: /builds/workspace/Dropwizard/dropwizard-core/target/dropwizard-core-1.1.0-SNAPSHOT-javadoc.jar
[INFO] 
[INFO] >>> findbugs-maven-plugin:3.0.4:check (default) > :findbugs @ dropwizard-core >>>
[INFO] 
[INFO] --- findbugs-maven-plugin:3.0.4:findbugs (findbugs) @ dropwizard-core ---
[INFO] Fork Value is true
     [java] Picked up JAVA_TOOL_OPTIONS: -Dfile.encoding=UTF8
[INFO] Done FindBugs Analysis....
[INFO] 
[INFO] <<< findbugs-maven-plugin:3.0.4:check (default) < :findbugs @ dropwizard-core <<<
[INFO] 
[INFO] --- findbugs-maven-plugin:3.0.4:check (default) @ dropwizard-core ---
[INFO] BugInstance size is 0
[INFO] Error size is 0
[INFO] No errors/warnings found
[INFO] 
[INFO] --- maven-install-plugin:2.5.2:install (default-install) @ dropwizard-core ---
[INFO] Installing /builds/workspace/Dropwizard/dropwizard-core/target/dropwizard-core-1.1.0-SNAPSHOT.jar to /builds/.m2/repository/io/dropwizard/dropwizard-core/1.1.0-SNAPSHOT/dropwizard-core-1.1.0-SNAPSHOT.jar
[INFO] Installing /builds/workspace/Dropwizard/dropwizard-core/pom.xml to /builds/.m2/repository/io/dropwizard/dropwizard-core/1.1.0-SNAPSHOT/dropwizard-core-1.1.0-SNAPSHOT.pom
[INFO] Installing /builds/workspace/Dropwizard/dropwizard-core/target/dropwizard-core-1.1.0-SNAPSHOT-sources.jar to /builds/.m2/repository/io/dropwizard/dropwizard-core/1.1.0-SNAPSHOT/dropwizard-core-1.1.0-SNAPSHOT-sources.jar
[INFO] Installing /builds/workspace/Dropwizard/dropwizard-core/target/dropwizard-core-1.1.0-SNAPSHOT-javadoc.jar to /builds/.m2/repository/io/dropwizard/dropwizard-core/1.1.0-SNAPSHOT/dropwizard-core-1.1.0-SNAPSHOT-javadoc.jar
[INFO]                                                                         
[INFO] ------------------------------------------------------------------------
[INFO] Building Dropwizard Test Helpers 1.1.0-SNAPSHOT
[INFO] ------------------------------------------------------------------------
[INFO] 
[INFO] --- maven-clean-plugin:3.0.0:clean (default-clean) @ dropwizard-testing ---
[INFO] Deleting /builds/workspace/Dropwizard/dropwizard-testing/target
[INFO] 
[INFO] --- spoon-maven-plugin:3.1:generate (default) @ dropwizard-testing ---
[INFO] Running in NOCLASSPATH mode (doc: http://spoon.gforge.inria.fr/launcher.html).
[INFO] Running in NOCLASSPATH mode (doc: http://spoon.gforge.inria.fr/launcher.html).
[INFO] Spoon version 8.1.0-SNAPSHOT
[INFO] running Spoon...
[INFO] start processing...
[INFO] spoon.processing.SpoonTagger
[INFO] spoon.support.JavaOutputProcessor
[INFO] end of processing: 
[INFO] no errors, no warnings
[INFO] 
[INFO] --- maven-resources-plugin:3.0.1:resources (default-resources) @ dropwizard-testing ---
[INFO] Using 'UTF-8' encoding to copy filtered resources.
[INFO] skip non existing resourceDirectory /builds/workspace/Dropwizard/dropwizard-testing/src/main/resources
[INFO] 
[INFO] --- maven-compiler-plugin:3.5.1:compile (default-compile) @ dropwizard-testing ---
[INFO] Changes detected - recompiling the module!
[INFO] Compiling 12 source files to /builds/workspace/Dropwizard/dropwizard-testing/target/classes
[INFO] 
[INFO] --- maven-resources-plugin:3.0.1:testResources (default-testResources) @ dropwizard-testing ---
[INFO] Using 'UTF-8' encoding to copy filtered resources.
[INFO] Copying 5 resources
[INFO] 
[INFO] --- maven-compiler-plugin:3.5.1:testCompile (default-testCompile) @ dropwizard-testing ---
[INFO] Changes detected - recompiling the module!
[INFO] Compiling 23 source files to /builds/workspace/Dropwizard/dropwizard-testing/target/test-classes
[INFO] 
[INFO] --- maven-surefire-plugin:2.19.1:test (default-test) @ dropwizard-testing ---

-------------------------------------------------------
 T E S T S
-------------------------------------------------------
Picked up JAVA_TOOL_OPTIONS: -Dfile.encoding=UTF8
Running io.dropwizard.testing.FixtureHelpersTest
Tests run: 2, Failures: 0, Errors: 0, Skipped: 0, Time elapsed: 0.206 sec - in io.dropwizard.testing.FixtureHelpersTest
Running io.dropwizard.testing.junit.DropwizardClientRuleTest
INFO  [2020-02-22 18:32:20,371] org.eclipse.jetty.util.log: Logging initialized @1950ms
INFO  [2020-02-22 18:32:20,451] io.dropwizard.server.DefaultServerFactory: Registering jersey handler with root path prefix: /
INFO  [2020-02-22 18:32:20,452] io.dropwizard.server.DefaultServerFactory: Registering admin handler with root path prefix: /
INFO  [2020-02-22 18:32:20,456] io.dropwizard.server.SimpleServerFactory: Registering jersey handler with root path prefix: /application
INFO  [2020-02-22 18:32:20,456] io.dropwizard.server.SimpleServerFactory: Registering admin handler with root path prefix: /admin
INFO  [2020-02-22 18:32:20,456] io.dropwizard.server.ServerFactory: Starting FakeApplication
INFO  [2020-02-22 18:32:20,533] org.eclipse.jetty.setuid.SetUIDListener: Opened FakeApplication@440e3ce6{HTTP/1.1,[http/1.1]}{0.0.0.0:36034}
INFO  [2020-02-22 18:32:20,535] org.eclipse.jetty.server.Server: jetty-9.3.14.v20161028
INFO  [2020-02-22 18:32:21,024] io.dropwizard.jersey.DropwizardResourceConfig: The following paths were found for the configured resources:

    GET     /test (io.dropwizard.testing.junit.TestResource)

INFO  [2020-02-22 18:32:21,027] org.eclipse.jetty.server.handler.ContextHandler: Started i.d.j.MutableServletContextHandler@1c240cf2{/application,null,AVAILABLE}
INFO  [2020-02-22 18:32:21,030] io.dropwizard.setup.AdminEnvironment: tasks = 

    POST    /tasks/log-level (io.dropwizard.servlets.tasks.LogConfigurationTask)
    POST    /tasks/gc (io.dropwizard.servlets.tasks.GarbageCollectionTask)

INFO  [2020-02-22 18:32:21,039] org.eclipse.jetty.server.handler.ContextHandler: Started i.d.j.MutableServletContextHandler@6f25bf88{/admin,null,AVAILABLE}
INFO  [2020-02-22 18:32:21,046] org.eclipse.jetty.server.AbstractConnector: Started FakeApplication@440e3ce6{HTTP/1.1,[http/1.1]}{0.0.0.0:36034}
INFO  [2020-02-22 18:32:21,046] org.eclipse.jetty.server.Server: Started @2627ms
INFO  [2020-02-22 18:32:21,159] io.dropwizard.server.DefaultServerFactory: Registering jersey handler with root path prefix: /
INFO  [2020-02-22 18:32:21,159] io.dropwizard.server.DefaultServerFactory: Registering admin handler with root path prefix: /
INFO  [2020-02-22 18:32:21,159] io.dropwizard.server.SimpleServerFactory: Registering jersey handler with root path prefix: /application
INFO  [2020-02-22 18:32:21,159] io.dropwizard.server.SimpleServerFactory: Registering admin handler with root path prefix: /admin
INFO  [2020-02-22 18:32:21,160] io.dropwizard.server.ServerFactory: Starting FakeApplication
INFO  [2020-02-22 18:32:21,173] org.eclipse.jetty.setuid.SetUIDListener: Opened FakeApplication@ac4e690{HTTP/1.1,[http/1.1]}{0.0.0.0:33579}
INFO  [2020-02-22 18:32:21,173] org.eclipse.jetty.server.Server: jetty-9.3.14.v20161028
INFO  [2020-02-22 18:32:21,298] io.dropwizard.jersey.DropwizardResourceConfig: The following paths were found for the configured resources:

    GET     /test (io.dropwizard.testing.junit.TestResource)

INFO  [2020-02-22 18:32:21,301] org.eclipse.jetty.server.handler.ContextHandler: Started i.d.j.MutableServletContextHandler@433d93e7{/application,null,AVAILABLE}
INFO  [2020-02-22 18:32:21,308] io.dropwizard.setup.AdminEnvironment: tasks = 

    POST    /tasks/log-level (io.dropwizard.servlets.tasks.LogConfigurationTask)
    POST    /tasks/gc (io.dropwizard.servlets.tasks.GarbageCollectionTask)

INFO  [2020-02-22 18:32:21,309] org.eclipse.jetty.server.handler.ContextHandler: Started i.d.j.MutableServletContextHandler@213012a0{/admin,null,AVAILABLE}
INFO  [2020-02-22 18:32:21,320] org.eclipse.jetty.server.AbstractConnector: Started FakeApplication@ac4e690{HTTP/1.1,[http/1.1]}{0.0.0.0:33579}
INFO  [2020-02-22 18:32:21,320] org.eclipse.jetty.server.Server: Started @2901ms
127.0.0.1 - - [22/Feb/2020:18:32:21 +0000] "GET /application/test HTTP/1.1" 200 3 "-" "Java/1.8.0_151" 64
127.0.0.1 - - [22/Feb/2020:18:32:21 +0000] "GET /application/test HTTP/1.1" 200 15 "-" "Java/1.8.0_151" 8
INFO  [2020-02-22 18:32:21,486] org.eclipse.jetty.server.AbstractConnector: Stopped FakeApplication@ac4e690{HTTP/1.1,[http/1.1]}{0.0.0.0:0}
INFO  [2020-02-22 18:32:21,487] org.eclipse.jetty.server.handler.ContextHandler: Stopped i.d.j.MutableServletContextHandler@213012a0{/admin,null,UNAVAILABLE}
INFO  [2020-02-22 18:32:21,490] org.eclipse.jetty.server.handler.ContextHandler: Stopped i.d.j.MutableServletContextHandler@433d93e7{/application,null,UNAVAILABLE}
Tests run: 2, Failures: 0, Errors: 0, Skipped: 0, Time elapsed: 2.49 sec - in io.dropwizard.testing.junit.DropwizardClientRuleTest
Running io.dropwizard.testing.junit.DropwizardAppRuleReentrantTest
Tests run: 1, Failures: 0, Errors: 0, Skipped: 0, Time elapsed: 0.568 sec - in io.dropwizard.testing.junit.DropwizardAppRuleReentrantTest
Running io.dropwizard.testing.junit.DropwizardAppRuleResetConfigOverrideTest
Tests run: 1, Failures: 0, Errors: 0, Skipped: 0, Time elapsed: 0.597 sec - in io.dropwizard.testing.junit.DropwizardAppRuleResetConfigOverrideTest
Running io.dropwizard.testing.junit.DropwizardAppRuleWithExplicitTest
INFO  [2020-02-22 18:32:22,679] io.dropwizard.server.DefaultServerFactory: Registering jersey handler with root path prefix: /
INFO  [2020-02-22 18:32:22,679] io.dropwizard.server.DefaultServerFactory: Registering admin handler with root path prefix: /
INFO  [2020-02-22 18:32:22,679] io.dropwizard.server.DefaultServerFactory: Registering jersey handler with root path prefix: /
INFO  [2020-02-22 18:32:22,679] io.dropwizard.server.DefaultServerFactory: Registering admin handler with root path prefix: /
INFO  [2020-02-22 18:32:22,680] io.dropwizard.server.ServerFactory: Starting TestApplication
INFO  [2020-02-22 18:32:22,685] org.eclipse.jetty.setuid.SetUIDListener: Opened application@1f39b3ba{HTTP/1.1,[http/1.1]}{0.0.0.0:43388}
INFO  [2020-02-22 18:32:22,685] org.eclipse.jetty.setuid.SetUIDListener: Opened admin@53b579d2{HTTP/1.1,[http/1.1]}{0.0.0.0:46132}
INFO  [2020-02-22 18:32:22,685] org.eclipse.jetty.server.Server: jetty-9.3.14.v20161028
INFO  [2020-02-22 18:32:22,738] io.dropwizard.jersey.DropwizardResourceConfig: The following paths were found for the configured resources:

    GET     /test (io.dropwizard.testing.junit.DropwizardAppRuleWithExplicitTest.TestResource)

INFO  [2020-02-22 18:32:22,738] org.eclipse.jetty.server.handler.ContextHandler: Started i.d.j.MutableServletContextHandler@37c49a55{/,null,AVAILABLE}
INFO  [2020-02-22 18:32:22,739] io.dropwizard.setup.AdminEnvironment: tasks = 

    POST    /tasks/log-level (io.dropwizard.servlets.tasks.LogConfigurationTask)
    POST    /tasks/gc (io.dropwizard.servlets.tasks.GarbageCollectionTask)

WARN  [2020-02-22 18:32:22,740] io.dropwizard.setup.AdminEnvironment: 
!!!!!!!!!!!!!!!!!!!!!!!!!!!!!!!!!!!!!!!!!!!!!!!!!!!!!!!!!!!!!!!!!!!!!!!!!!!!!!!!
!!!!!!!!!!!!!!!!!!!!!!!!!!!!!!!!!!!!!!!!!!!!!!!!!!!!!!!!!!!!!!!!!!!!!!!!!!!!!!!!
!    THIS APPLICATION HAS NO HEALTHCHECKS. THIS MEANS YOU WILL NEVER KNOW      !
!     IF IT DIES IN PRODUCTION, WHICH MEANS YOU WILL NEVER KNOW IF YOU'RE      !
!    LETTING YOUR USERS DOWN. YOU SHOULD ADD A HEALTHCHECK FOR EACH OF YOUR    !
!         APPLICATION'S DEPENDENCIES WHICH FULLY (BUT LIGHTLY) TESTS IT.       !
!!!!!!!!!!!!!!!!!!!!!!!!!!!!!!!!!!!!!!!!!!!!!!!!!!!!!!!!!!!!!!!!!!!!!!!!!!!!!!!!
!!!!!!!!!!!!!!!!!!!!!!!!!!!!!!!!!!!!!!!!!!!!!!!!!!!!!!!!!!!!!!!!!!!!!!!!!!!!!!!!
INFO  [2020-02-22 18:32:22,742] org.eclipse.jetty.server.handler.ContextHandler: Started i.d.j.MutableServletContextHandler@4f5d7091{/,null,AVAILABLE}
INFO  [2020-02-22 18:32:22,743] org.eclipse.jetty.server.AbstractConnector: Started application@1f39b3ba{HTTP/1.1,[http/1.1]}{0.0.0.0:43388}
INFO  [2020-02-22 18:32:22,744] org.eclipse.jetty.server.AbstractConnector: Started admin@53b579d2{HTTP/1.1,[http/1.1]}{0.0.0.0:46132}
INFO  [2020-02-22 18:32:22,744] org.eclipse.jetty.server.Server: Started @4325ms
127.0.0.1 - - [22/Feb/2020:18:32:22 +0000] "GET /test HTTP/1.1" 200 20 "-" "Jersey/2.24 (HttpUrlConnection 1.8.0_151)" 20
INFO  [2020-02-22 18:32:22,851] org.eclipse.jetty.server.AbstractConnector: Stopped application@1f39b3ba{HTTP/1.1,[http/1.1]}{0.0.0.0:0}
INFO  [2020-02-22 18:32:22,853] org.eclipse.jetty.server.AbstractConnector: Stopped admin@53b579d2{HTTP/1.1,[http/1.1]}{0.0.0.0:0}
INFO  [2020-02-22 18:32:22,854] org.eclipse.jetty.server.handler.ContextHandler: Stopped i.d.j.MutableServletContextHandler@4f5d7091{/,null,UNAVAILABLE}
INFO  [2020-02-22 18:32:22,857] org.eclipse.jetty.server.handler.ContextHandler: Stopped i.d.j.MutableServletContextHandler@37c49a55{/,null,UNAVAILABLE}
Tests run: 2, Failures: 0, Errors: 0, Skipped: 0, Time elapsed: 0.191 sec - in io.dropwizard.testing.junit.DropwizardAppRuleWithExplicitTest
Running io.dropwizard.testing.junit.DropwizardAppRuleWithoutConfigTest
INFO  [2020-02-22 18:32:22,998] io.dropwizard.server.DefaultServerFactory: Registering jersey handler with root path prefix: /
INFO  [2020-02-22 18:32:22,998] io.dropwizard.server.DefaultServerFactory: Registering admin handler with root path prefix: /
INFO  [2020-02-22 18:32:22,999] io.dropwizard.server.DefaultServerFactory: Registering jersey handler with root path prefix: /
INFO  [2020-02-22 18:32:22,999] io.dropwizard.server.DefaultServerFactory: Registering admin handler with root path prefix: /
INFO  [2020-02-22 18:32:22,999] io.dropwizard.server.ServerFactory: Starting TestApplication
INFO  [2020-02-22 18:32:23,010] org.eclipse.jetty.setuid.SetUIDListener: Opened application@5d27a744{HTTP/1.1,[http/1.1]}{0.0.0.0:44729}
INFO  [2020-02-22 18:32:23,010] org.eclipse.jetty.setuid.SetUIDListener: Opened admin@41185195{HTTP/1.1,[http/1.1]}{0.0.0.0:34302}
INFO  [2020-02-22 18:32:23,010] org.eclipse.jetty.server.Server: jetty-9.3.14.v20161028
INFO  [2020-02-22 18:32:23,089] io.dropwizard.jersey.DropwizardResourceConfig: The following paths were found for the configured resources:

    GET     /test (io.dropwizard.testing.junit.DropwizardAppRuleWithoutConfigTest.TestResource)

INFO  [2020-02-22 18:32:23,090] org.eclipse.jetty.server.handler.ContextHandler: Started i.d.j.MutableServletContextHandler@77393f2e{/,null,AVAILABLE}
INFO  [2020-02-22 18:32:23,091] io.dropwizard.setup.AdminEnvironment: tasks = 

    POST    /tasks/log-level (io.dropwizard.servlets.tasks.LogConfigurationTask)
    POST    /tasks/gc (io.dropwizard.servlets.tasks.GarbageCollectionTask)

WARN  [2020-02-22 18:32:23,091] io.dropwizard.setup.AdminEnvironment: 
!!!!!!!!!!!!!!!!!!!!!!!!!!!!!!!!!!!!!!!!!!!!!!!!!!!!!!!!!!!!!!!!!!!!!!!!!!!!!!!!
!!!!!!!!!!!!!!!!!!!!!!!!!!!!!!!!!!!!!!!!!!!!!!!!!!!!!!!!!!!!!!!!!!!!!!!!!!!!!!!!
!    THIS APPLICATION HAS NO HEALTHCHECKS. THIS MEANS YOU WILL NEVER KNOW      !
!     IF IT DIES IN PRODUCTION, WHICH MEANS YOU WILL NEVER KNOW IF YOU'RE      !
!    LETTING YOUR USERS DOWN. YOU SHOULD ADD A HEALTHCHECK FOR EACH OF YOUR    !
!         APPLICATION'S DEPENDENCIES WHICH FULLY (BUT LIGHTLY) TESTS IT.       !
!!!!!!!!!!!!!!!!!!!!!!!!!!!!!!!!!!!!!!!!!!!!!!!!!!!!!!!!!!!!!!!!!!!!!!!!!!!!!!!!
!!!!!!!!!!!!!!!!!!!!!!!!!!!!!!!!!!!!!!!!!!!!!!!!!!!!!!!!!!!!!!!!!!!!!!!!!!!!!!!!
INFO  [2020-02-22 18:32:23,092] org.eclipse.jetty.server.handler.ContextHandler: Started i.d.j.MutableServletContextHandler@67f5066e{/,null,AVAILABLE}
INFO  [2020-02-22 18:32:23,093] org.eclipse.jetty.server.AbstractConnector: Started application@5d27a744{HTTP/1.1,[http/1.1]}{0.0.0.0:44729}
INFO  [2020-02-22 18:32:23,094] org.eclipse.jetty.server.AbstractConnector: Started admin@41185195{HTTP/1.1,[http/1.1]}{0.0.0.0:34302}
INFO  [2020-02-22 18:32:23,100] org.eclipse.jetty.server.Server: Started @4675ms
127.0.0.1 - - [22/Feb/2020:18:32:23 +0000] "GET /test HTTP/1.1" 200 18 "-" "Jersey/2.24 (HttpUrlConnection 1.8.0_151)" 6
INFO  [2020-02-22 18:32:23,130] org.eclipse.jetty.server.AbstractConnector: Stopped application@5d27a744{HTTP/1.1,[http/1.1]}{0.0.0.0:0}
INFO  [2020-02-22 18:32:23,132] org.eclipse.jetty.server.AbstractConnector: Stopped admin@41185195{HTTP/1.1,[http/1.1]}{0.0.0.0:0}
INFO  [2020-02-22 18:32:23,132] org.eclipse.jetty.server.handler.ContextHandler: Stopped i.d.j.MutableServletContextHandler@67f5066e{/,null,UNAVAILABLE}
INFO  [2020-02-22 18:32:23,133] org.eclipse.jetty.server.handler.ContextHandler: Stopped i.d.j.MutableServletContextHandler@77393f2e{/,null,UNAVAILABLE}
Tests run: 1, Failures: 0, Errors: 0, Skipped: 0, Time elapsed: 0.269 sec - in io.dropwizard.testing.junit.DropwizardAppRuleWithoutConfigTest
Running io.dropwizard.testing.junit.DropwizardAppRuleTest
Tests run: 6, Failures: 0, Errors: 0, Skipped: 0, Time elapsed: 0.215 sec - in io.dropwizard.testing.junit.DropwizardAppRuleTest
Running io.dropwizard.testing.junit.DropwizardAppRuleConfigOverrideTest
Tests run: 2, Failures: 0, Errors: 0, Skipped: 0, Time elapsed: 0.134 sec - in io.dropwizard.testing.junit.DropwizardAppRuleConfigOverrideTest
Running io.dropwizard.testing.junit.DAOTestRuleConfigTest
Hibernate: 
    drop table test_entities if exists
Hibernate: 
    create table test_entities (
        id bigint generated by default as identity,
        desc varchar(255) not null,
        primary key (id)
    )
Hibernate: 
    /* insert io.dropwizard.testing.junit.TestEntity
        */ insert 
        into
            test_entities
            (id, desc) 
        values
            (null, ?)
Tests run: 1, Failures: 0, Errors: 0, Skipped: 0, Time elapsed: 0.986 sec - in io.dropwizard.testing.junit.DAOTestRuleConfigTest
Running io.dropwizard.testing.junit.DAOTestRuleTest
Tests run: 5, Failures: 0, Errors: 0, Skipped: 0, Time elapsed: 0.138 sec - in io.dropwizard.testing.junit.DAOTestRuleTest
Running io.dropwizard.testing.app.PersonResourceTest
Tests run: 9, Failures: 0, Errors: 0, Skipped: 0, Time elapsed: 0.18 sec - in io.dropwizard.testing.app.PersonResourceTest
Running io.dropwizard.testing.app.GzipDefaultVaryBehaviourTest
Tests run: 1, Failures: 0, Errors: 0, Skipped: 0, Time elapsed: 0.134 sec - in io.dropwizard.testing.app.GzipDefaultVaryBehaviourTest
Running io.dropwizard.testing.app.PersonResourceExceptionMapperTest
Tests run: 4, Failures: 0, Errors: 0, Skipped: 0, Time elapsed: 0.151 sec - in io.dropwizard.testing.app.PersonResourceExceptionMapperTest
Running io.dropwizard.testing.DropwizardTestSupportTest
Tests run: 6, Failures: 0, Errors: 0, Skipped: 0, Time elapsed: 0.198 sec - in io.dropwizard.testing.DropwizardTestSupportTest

Results :

Tests run: 43, Failures: 0, Errors: 0, Skipped: 0

[INFO] 
[INFO] --- maven-jar-plugin:3.0.2:jar (default-jar) @ dropwizard-testing ---
[INFO] Building jar: /builds/workspace/Dropwizard/dropwizard-testing/target/dropwizard-testing-1.1.0-SNAPSHOT.jar
[INFO] 
[INFO] >>> maven-source-plugin:3.0.1:jar (attach-sources) > generate-sources @ dropwizard-testing >>>
[INFO] 
[INFO] --- spoon-maven-plugin:3.1:generate (default) @ dropwizard-testing ---
[INFO] Running in NOCLASSPATH mode (doc: http://spoon.gforge.inria.fr/launcher.html).
[INFO] Running in NOCLASSPATH mode (doc: http://spoon.gforge.inria.fr/launcher.html).
[INFO] Spoon version 8.1.0-SNAPSHOT
[INFO] running Spoon...
[INFO] start processing...
[INFO] spoon.processing.SpoonTagger
[INFO] spoon.support.JavaOutputProcessor
[INFO] end of processing: 
[INFO] no errors, no warnings
[INFO] 
[INFO] <<< maven-source-plugin:3.0.1:jar (attach-sources) < generate-sources @ dropwizard-testing <<<
[INFO] 
[INFO] --- maven-source-plugin:3.0.1:jar (attach-sources) @ dropwizard-testing ---
[INFO] Building jar: /builds/workspace/Dropwizard/dropwizard-testing/target/dropwizard-testing-1.1.0-SNAPSHOT-sources.jar
[INFO] 
[INFO] --- maven-javadoc-plugin:2.10.4:jar (attach-javadocs) @ dropwizard-testing ---
[INFO] 
3 warnings
[WARNING] Javadoc Warnings
[WARNING] Picked up JAVA_TOOL_OPTIONS: -Dfile.encoding=UTF8
[WARNING] /builds/workspace/Dropwizard/dropwizard-testing/target/generated-sources/spoon/io/dropwizard/testing/DropwizardTestSupport.java:89: warning - Tag @link: reference not found: Function
[WARNING] /builds/workspace/Dropwizard/dropwizard-testing/target/generated-sources/spoon/io/dropwizard/testing/DropwizardTestSupport.java:89: warning - Tag @link: reference not found: Command
[WARNING] /builds/workspace/Dropwizard/dropwizard-testing/target/generated-sources/spoon/io/dropwizard/testing/junit/DropwizardClientRule.java:41: warning - Tag @link: reference not found: URL#openStream()
[INFO] Building jar: /builds/workspace/Dropwizard/dropwizard-testing/target/dropwizard-testing-1.1.0-SNAPSHOT-javadoc.jar
[INFO] 
[INFO] >>> findbugs-maven-plugin:3.0.4:check (default) > :findbugs @ dropwizard-testing >>>
[INFO] 
[INFO] --- findbugs-maven-plugin:3.0.4:findbugs (findbugs) @ dropwizard-testing ---
[INFO] Fork Value is true
     [java] Picked up JAVA_TOOL_OPTIONS: -Dfile.encoding=UTF8
[INFO] Done FindBugs Analysis....
[INFO] 
[INFO] <<< findbugs-maven-plugin:3.0.4:check (default) < :findbugs @ dropwizard-testing <<<
[INFO] 
[INFO] --- findbugs-maven-plugin:3.0.4:check (default) @ dropwizard-testing ---
[INFO] BugInstance size is 0
[INFO] Error size is 0
[INFO] No errors/warnings found
[INFO] 
[INFO] --- maven-install-plugin:2.5.2:install (default-install) @ dropwizard-testing ---
[INFO] Installing /builds/workspace/Dropwizard/dropwizard-testing/target/dropwizard-testing-1.1.0-SNAPSHOT.jar to /builds/.m2/repository/io/dropwizard/dropwizard-testing/1.1.0-SNAPSHOT/dropwizard-testing-1.1.0-SNAPSHOT.jar
[INFO] Installing /builds/workspace/Dropwizard/dropwizard-testing/pom.xml to /builds/.m2/repository/io/dropwizard/dropwizard-testing/1.1.0-SNAPSHOT/dropwizard-testing-1.1.0-SNAPSHOT.pom
[INFO] Installing /builds/workspace/Dropwizard/dropwizard-testing/target/dropwizard-testing-1.1.0-SNAPSHOT-sources.jar to /builds/.m2/repository/io/dropwizard/dropwizard-testing/1.1.0-SNAPSHOT/dropwizard-testing-1.1.0-SNAPSHOT-sources.jar
[INFO] Installing /builds/workspace/Dropwizard/dropwizard-testing/target/dropwizard-testing-1.1.0-SNAPSHOT-javadoc.jar to /builds/.m2/repository/io/dropwizard/dropwizard-testing/1.1.0-SNAPSHOT/dropwizard-testing-1.1.0-SNAPSHOT-javadoc.jar
[INFO]                                                                         
[INFO] ------------------------------------------------------------------------
[INFO] Building Dropwizard HTTP Client 1.1.0-SNAPSHOT
[INFO] ------------------------------------------------------------------------
[INFO] 
[INFO] --- maven-clean-plugin:3.0.0:clean (default-clean) @ dropwizard-client ---
[INFO] Deleting /builds/workspace/Dropwizard/dropwizard-client/target
[INFO] 
[INFO] --- spoon-maven-plugin:3.1:generate (default) @ dropwizard-client ---
[INFO] Running in NOCLASSPATH mode (doc: http://spoon.gforge.inria.fr/launcher.html).
[INFO] Running in NOCLASSPATH mode (doc: http://spoon.gforge.inria.fr/launcher.html).
[INFO] Spoon version 8.1.0-SNAPSHOT
[INFO] running Spoon...
[INFO] start processing...
[INFO] spoon.processing.SpoonTagger
[INFO] spoon.support.JavaOutputProcessor
[INFO] end of processing: 
[INFO] no errors, no warnings
[INFO] 
[INFO] --- maven-resources-plugin:3.0.1:resources (default-resources) @ dropwizard-client ---
[INFO] Using 'UTF-8' encoding to copy filtered resources.
[INFO] skip non existing resourceDirectory /builds/workspace/Dropwizard/dropwizard-client/src/main/resources
[INFO] 
[INFO] --- maven-compiler-plugin:3.5.1:compile (default-compile) @ dropwizard-client ---
[INFO] Changes detected - recompiling the module!
[INFO] Compiling 14 source files to /builds/workspace/Dropwizard/dropwizard-client/target/classes
[INFO] 
[INFO] --- maven-resources-plugin:3.0.1:testResources (default-testResources) @ dropwizard-client ---
[INFO] Using 'UTF-8' encoding to copy filtered resources.
[INFO] Copying 21 resources
[INFO] 
[INFO] --- maven-compiler-plugin:3.5.1:testCompile (default-testCompile) @ dropwizard-client ---
[INFO] Changes detected - recompiling the module!
[INFO] Compiling 9 source files to /builds/workspace/Dropwizard/dropwizard-client/target/test-classes
[INFO] 
[INFO] --- maven-surefire-plugin:2.19.1:test (default-test) @ dropwizard-client ---

-------------------------------------------------------
 T E S T S
-------------------------------------------------------
Picked up JAVA_TOOL_OPTIONS: -Dfile.encoding=UTF8
Running io.dropwizard.client.JerseyClientIntegrationTest
Tests run: 7, Failures: 0, Errors: 0, Skipped: 0, Time elapsed: 1.898 sec - in io.dropwizard.client.JerseyClientIntegrationTest
Running io.dropwizard.client.HttpClientBuilderTest
Tests run: 40, Failures: 0, Errors: 0, Skipped: 0, Time elapsed: 1.004 sec - in io.dropwizard.client.HttpClientBuilderTest
Running io.dropwizard.client.ConfiguredCloseableHttpClientTest
Tests run: 2, Failures: 0, Errors: 0, Skipped: 0, Time elapsed: 0.07 sec - in io.dropwizard.client.ConfiguredCloseableHttpClientTest
Running io.dropwizard.client.ssl.DropwizardSSLConnectionSocketFactoryTest
INFO  [2020-02-22 18:32:38,121] org.eclipse.jetty.util.log: Logging initialized @3835ms
INFO  [2020-02-22 18:32:38,172] io.dropwizard.server.DefaultServerFactory: Registering jersey handler with root path prefix: /
INFO  [2020-02-22 18:32:38,172] io.dropwizard.server.DefaultServerFactory: Registering admin handler with root path prefix: /
INFO  [2020-02-22 18:32:38,177] io.dropwizard.server.DefaultServerFactory: Registering jersey handler with root path prefix: /
INFO  [2020-02-22 18:32:38,178] io.dropwizard.server.DefaultServerFactory: Registering admin handler with root path prefix: /
INFO  [2020-02-22 18:32:38,178] io.dropwizard.server.ServerFactory: Starting TlsTestApplication
INFO  [2020-02-22 18:32:38,285] org.eclipse.jetty.setuid.SetUIDListener: Opened application@7fe87c0e{SSL,[ssl, http/1.1]}{0.0.0.0:44449}
INFO  [2020-02-22 18:32:38,286] org.eclipse.jetty.setuid.SetUIDListener: Opened application@8f4b803{SSL,[ssl, http/1.1]}{0.0.0.0:44727}
INFO  [2020-02-22 18:32:38,287] org.eclipse.jetty.setuid.SetUIDListener: Opened application@42f9873e{SSL,[ssl, http/1.1]}{0.0.0.0:42402}
INFO  [2020-02-22 18:32:38,289] org.eclipse.jetty.setuid.SetUIDListener: Opened application@18483b8b{SSL,[ssl, http/1.1]}{0.0.0.0:35203}
INFO  [2020-02-22 18:32:38,289] org.eclipse.jetty.setuid.SetUIDListener: Opened application@24fc2c80{SSL,[ssl, http/1.1]}{0.0.0.0:39674}
INFO  [2020-02-22 18:32:38,290] org.eclipse.jetty.setuid.SetUIDListener: Opened admin@965bcbc{HTTP/1.1,[http/1.1]}{0.0.0.0:46841}
INFO  [2020-02-22 18:32:38,293] org.eclipse.jetty.server.Server: jetty-9.3.14.v20161028
INFO  [2020-02-22 18:32:38,384] org.eclipse.jetty.util.ssl.SslContextFactory: x509=X509@75b363c3(1,h=[],w=[]) for SslContextFactory@6ea3a513(file:///builds/workspace/Dropwizard/dropwizard-client/target/test-classes/stores/server/keycert.p12,null)
INFO  [2020-02-22 18:32:38,398] io.dropwizard.jetty.HttpsConnectorFactory: Supported protocols: [SSLv2Hello, SSLv3, TLSv1, TLSv1.1, TLSv1.2]
INFO  [2020-02-22 18:32:38,398] io.dropwizard.jetty.HttpsConnectorFactory: Supported cipher suites: [TLS_ECDHE_ECDSA_WITH_AES_128_CBC_SHA256, TLS_ECDHE_RSA_WITH_AES_128_CBC_SHA256, TLS_RSA_WITH_AES_128_CBC_SHA256, TLS_ECDH_ECDSA_WITH_AES_128_CBC_SHA256, TLS_ECDH_RSA_WITH_AES_128_CBC_SHA256, TLS_DHE_RSA_WITH_AES_128_CBC_SHA256, TLS_DHE_DSS_WITH_AES_128_CBC_SHA256, TLS_ECDHE_ECDSA_WITH_AES_128_CBC_SHA, TLS_ECDHE_RSA_WITH_AES_128_CBC_SHA, TLS_RSA_WITH_AES_128_CBC_SHA, TLS_ECDH_ECDSA_WITH_AES_128_CBC_SHA, TLS_ECDH_RSA_WITH_AES_128_CBC_SHA, TLS_DHE_RSA_WITH_AES_128_CBC_SHA, TLS_DHE_DSS_WITH_AES_128_CBC_SHA, TLS_ECDHE_ECDSA_WITH_AES_128_GCM_SHA256, TLS_ECDHE_RSA_WITH_AES_128_GCM_SHA256, TLS_RSA_WITH_AES_128_GCM_SHA256, TLS_ECDH_ECDSA_WITH_AES_128_GCM_SHA256, TLS_ECDH_RSA_WITH_AES_128_GCM_SHA256, TLS_DHE_RSA_WITH_AES_128_GCM_SHA256, TLS_DHE_DSS_WITH_AES_128_GCM_SHA256, TLS_ECDHE_ECDSA_WITH_3DES_EDE_CBC_SHA, TLS_ECDHE_RSA_WITH_3DES_EDE_CBC_SHA, SSL_RSA_WITH_3DES_EDE_CBC_SHA, TLS_ECDH_ECDSA_WITH_3DES_EDE_CBC_SHA, TLS_ECDH_RSA_WITH_3DES_EDE_CBC_SHA, SSL_DHE_RSA_WITH_3DES_EDE_CBC_SHA, SSL_DHE_DSS_WITH_3DES_EDE_CBC_SHA, TLS_EMPTY_RENEGOTIATION_INFO_SCSV, TLS_DH_anon_WITH_AES_128_GCM_SHA256, TLS_DH_anon_WITH_AES_128_CBC_SHA256, TLS_ECDH_anon_WITH_AES_128_CBC_SHA, TLS_DH_anon_WITH_AES_128_CBC_SHA, TLS_ECDH_anon_WITH_3DES_EDE_CBC_SHA, SSL_DH_anon_WITH_3DES_EDE_CBC_SHA, SSL_RSA_WITH_DES_CBC_SHA, SSL_DHE_RSA_WITH_DES_CBC_SHA, SSL_DHE_DSS_WITH_DES_CBC_SHA, SSL_DH_anon_WITH_DES_CBC_SHA, SSL_RSA_EXPORT_WITH_DES40_CBC_SHA, SSL_DHE_RSA_EXPORT_WITH_DES40_CBC_SHA, SSL_DHE_DSS_EXPORT_WITH_DES40_CBC_SHA, SSL_DH_anon_EXPORT_WITH_DES40_CBC_SHA, TLS_RSA_WITH_NULL_SHA256, TLS_ECDHE_ECDSA_WITH_NULL_SHA, TLS_ECDHE_RSA_WITH_NULL_SHA, SSL_RSA_WITH_NULL_SHA, TLS_ECDH_ECDSA_WITH_NULL_SHA, TLS_ECDH_RSA_WITH_NULL_SHA, TLS_ECDH_anon_WITH_NULL_SHA, SSL_RSA_WITH_NULL_MD5, TLS_KRB5_WITH_3DES_EDE_CBC_SHA, TLS_KRB5_WITH_3DES_EDE_CBC_MD5, TLS_KRB5_WITH_DES_CBC_SHA, TLS_KRB5_WITH_DES_CBC_MD5, TLS_KRB5_EXPORT_WITH_DES_CBC_40_SHA, TLS_KRB5_EXPORT_WITH_DES_CBC_40_MD5]
INFO  [2020-02-22 18:32:38,398] io.dropwizard.jetty.HttpsConnectorFactory: Configured protocols: [TLSv1.2]
INFO  [2020-02-22 18:32:38,406] org.eclipse.jetty.util.ssl.SslContextFactory: x509=X509@75c33608(1,h=[],w=[]) for SslContextFactory@25464154(file:///builds/workspace/Dropwizard/dropwizard-client/target/test-classes/stores/server/self_sign_keycert.p12,null)
INFO  [2020-02-22 18:32:38,414] org.eclipse.jetty.util.ssl.SslContextFactory: x509=X509@58ebee9(1,h=[],w=[]) for SslContextFactory@131c0b6f(file:///builds/workspace/Dropwizard/dropwizard-client/target/test-classes/stores/server/keycert.p12,file:///builds/workspace/Dropwizard/dropwizard-client/target/test-classes/stores/server/ca_truststore.ts)
INFO  [2020-02-22 18:32:38,424] org.eclipse.jetty.util.ssl.SslContextFactory: x509=X509@68d8ae27(1,h=[],w=[]) for SslContextFactory@18513c23(file:///builds/workspace/Dropwizard/dropwizard-client/target/test-classes/stores/server/bad_host_keycert.p12,null)
INFO  [2020-02-22 18:32:38,434] org.eclipse.jetty.util.ssl.SslContextFactory: x509=X509@ce2eaa7(1,h=[],w=[]) for SslContextFactory@2166c48a(file:///builds/workspace/Dropwizard/dropwizard-client/target/test-classes/stores/server/keycert.p12,null)
INFO  [2020-02-22 18:32:38,437] org.eclipse.jetty.util.ssl.SslContextFactory: Protocol SSLv1 not supported in [SSLv2Hello, SSLv3, TLSv1, TLSv1.1, TLSv1.2]
INFO  [2020-02-22 18:32:38,437] org.eclipse.jetty.util.ssl.SslContextFactory: Protocol SSLv2 not supported in [SSLv2Hello, SSLv3, TLSv1, TLSv1.1, TLSv1.2]
WARN  [2020-02-22 18:32:38,437] org.eclipse.jetty.util.ssl.SslContextFactory: No selected protocols from [SSLv2Hello, SSLv3, TLSv1, TLSv1.1, TLSv1.2]
INFO  [2020-02-22 18:32:38,680] io.dropwizard.jersey.DropwizardResourceConfig: The following paths were found for the configured resources:

    GET     / (io.dropwizard.client.ssl.DropwizardSSLConnectionSocketFactoryTest.TestResource)

INFO  [2020-02-22 18:32:38,683] org.eclipse.jetty.server.handler.ContextHandler: Started i.d.j.MutableServletContextHandler@40b54762{/,null,AVAILABLE}
INFO  [2020-02-22 18:32:38,686] io.dropwizard.setup.AdminEnvironment: tasks = 

    POST    /tasks/log-level (io.dropwizard.servlets.tasks.LogConfigurationTask)
    POST    /tasks/gc (io.dropwizard.servlets.tasks.GarbageCollectionTask)

WARN  [2020-02-22 18:32:38,687] io.dropwizard.setup.AdminEnvironment: 
!!!!!!!!!!!!!!!!!!!!!!!!!!!!!!!!!!!!!!!!!!!!!!!!!!!!!!!!!!!!!!!!!!!!!!!!!!!!!!!!
!!!!!!!!!!!!!!!!!!!!!!!!!!!!!!!!!!!!!!!!!!!!!!!!!!!!!!!!!!!!!!!!!!!!!!!!!!!!!!!!
!    THIS APPLICATION HAS NO HEALTHCHECKS. THIS MEANS YOU WILL NEVER KNOW      !
!     IF IT DIES IN PRODUCTION, WHICH MEANS YOU WILL NEVER KNOW IF YOU'RE      !
!    LETTING YOUR USERS DOWN. YOU SHOULD ADD A HEALTHCHECK FOR EACH OF YOUR    !
!         APPLICATION'S DEPENDENCIES WHICH FULLY (BUT LIGHTLY) TESTS IT.       !
!!!!!!!!!!!!!!!!!!!!!!!!!!!!!!!!!!!!!!!!!!!!!!!!!!!!!!!!!!!!!!!!!!!!!!!!!!!!!!!!
!!!!!!!!!!!!!!!!!!!!!!!!!!!!!!!!!!!!!!!!!!!!!!!!!!!!!!!!!!!!!!!!!!!!!!!!!!!!!!!!
INFO  [2020-02-22 18:32:38,693] org.eclipse.jetty.server.handler.ContextHandler: Started i.d.j.MutableServletContextHandler@452ec287{/,null,AVAILABLE}
INFO  [2020-02-22 18:32:38,713] org.eclipse.jetty.server.AbstractConnector: Started application@7fe87c0e{SSL,[ssl, http/1.1]}{0.0.0.0:44449}
INFO  [2020-02-22 18:32:38,714] org.eclipse.jetty.server.AbstractConnector: Started application@8f4b803{SSL,[ssl, http/1.1]}{0.0.0.0:44727}
INFO  [2020-02-22 18:32:38,714] org.eclipse.jetty.server.AbstractConnector: Started application@42f9873e{SSL,[ssl, http/1.1]}{0.0.0.0:42402}
INFO  [2020-02-22 18:32:38,715] org.eclipse.jetty.server.AbstractConnector: Started application@18483b8b{SSL,[ssl, http/1.1]}{0.0.0.0:35203}
INFO  [2020-02-22 18:32:38,715] org.eclipse.jetty.server.AbstractConnector: Started application@24fc2c80{SSL,[ssl, http/1.1]}{0.0.0.0:39674}
INFO  [2020-02-22 18:32:38,716] org.eclipse.jetty.server.AbstractConnector: Started admin@965bcbc{HTTP/1.1,[http/1.1]}{0.0.0.0:46841}
INFO  [2020-02-22 18:32:38,716] org.eclipse.jetty.server.Server: Started @4432ms
127.0.0.1 - - [22/Feb/2020:18:32:38 +0000] "GET / HTTP/1.1" 200 0 "-" "TlsTestApplication (bad_host_noop_verifier_working)" 55
127.0.0.1 - - [22/Feb/2020:18:32:39 +0000] "GET / HTTP/1.1" 200 0 "-" "TlsTestApplication (self_sign_permitted)" 7
127.0.0.1 - - [22/Feb/2020:18:32:39 +0000] "GET / HTTP/1.1" 200 0 "-" "TlsTestApplication (tls_working_client)" 13
127.0.0.1 - - [22/Feb/2020:18:32:39 +0000] "GET / HTTP/1.1" 200 0 "-" "TlsTestApplication (bad_host_fail_verifier_working)" 8
127.0.0.1 - - [22/Feb/2020:18:32:39 +0000] "GET / HTTP/1.1" 200 0 "-" "TlsTestApplication (bad_host_working)" 10
localhost - - [22/Feb/2020:18:32:39 +0000] "GET / HTTP/1.1" 200 0 "-" "TlsTestApplication (client_auth_working)" 2
INFO  [2020-02-22 18:32:39,647] org.eclipse.jetty.server.AbstractConnector: Stopped application@7fe87c0e{SSL,[ssl, http/1.1]}{0.0.0.0:0}
INFO  [2020-02-22 18:32:39,651] org.eclipse.jetty.server.AbstractConnector: Stopped application@8f4b803{SSL,[ssl, http/1.1]}{0.0.0.0:0}
INFO  [2020-02-22 18:32:39,652] org.eclipse.jetty.server.AbstractConnector: Stopped application@42f9873e{SSL,[ssl, http/1.1]}{0.0.0.0:0}
INFO  [2020-02-22 18:32:39,653] org.eclipse.jetty.server.AbstractConnector: Stopped application@18483b8b{SSL,[ssl, http/1.1]}{0.0.0.0:0}
INFO  [2020-02-22 18:32:39,654] org.eclipse.jetty.server.AbstractConnector: Stopped application@24fc2c80{SSL,[ssl, http/1.1]}{0.0.0.0:0}
INFO  [2020-02-22 18:32:39,655] org.eclipse.jetty.server.AbstractConnector: Stopped admin@965bcbc{HTTP/1.1,[http/1.1]}{0.0.0.0:0}
INFO  [2020-02-22 18:32:39,656] org.eclipse.jetty.server.handler.ContextHandler: Stopped i.d.j.MutableServletContextHandler@452ec287{/,null,UNAVAILABLE}
INFO  [2020-02-22 18:32:39,661] org.eclipse.jetty.server.handler.ContextHandler: Stopped i.d.j.MutableServletContextHandler@40b54762{/,null,UNAVAILABLE}
Tests run: 13, Failures: 0, Errors: 0, Skipped: 0, Time elapsed: 2.12 sec - in io.dropwizard.client.ssl.DropwizardSSLConnectionSocketFactoryTest
Running io.dropwizard.client.JerseyClientConfigurationTest
Tests run: 1, Failures: 0, Errors: 0, Skipped: 0, Time elapsed: 0.032 sec - in io.dropwizard.client.JerseyClientConfigurationTest
Running io.dropwizard.client.JerseyIgnoreRequestUserAgentHeaderFilterTest
INFO  [2020-02-22 18:32:39,769] io.dropwizard.server.DefaultServerFactory: Registering jersey handler with root path prefix: /
INFO  [2020-02-22 18:32:39,769] io.dropwizard.server.DefaultServerFactory: Registering admin handler with root path prefix: /
INFO  [2020-02-22 18:32:39,770] io.dropwizard.server.DefaultServerFactory: Registering jersey handler with root path prefix: /
INFO  [2020-02-22 18:32:39,770] io.dropwizard.server.DefaultServerFactory: Registering admin handler with root path prefix: /
INFO  [2020-02-22 18:32:39,770] io.dropwizard.server.ServerFactory: Starting TestApplication
INFO  [2020-02-22 18:32:39,773] org.eclipse.jetty.setuid.SetUIDListener: Opened application@4552e288{HTTP/1.1,[http/1.1]}{0.0.0.0:37983}
INFO  [2020-02-22 18:32:39,774] org.eclipse.jetty.setuid.SetUIDListener: Opened admin@1a67bde5{HTTP/1.1,[http/1.1]}{0.0.0.0:33255}
INFO  [2020-02-22 18:32:39,774] org.eclipse.jetty.server.Server: jetty-9.3.14.v20161028
INFO  [2020-02-22 18:32:39,827] io.dropwizard.jersey.DropwizardResourceConfig: The following paths were found for the configured resources:

    GET     /user_agent (io.dropwizard.client.JerseyIgnoreRequestUserAgentHeaderFilterTest.TestResource)

INFO  [2020-02-22 18:32:39,828] org.eclipse.jetty.server.handler.ContextHandler: Started i.d.j.MutableServletContextHandler@35d62807{/,null,AVAILABLE}
INFO  [2020-02-22 18:32:39,828] io.dropwizard.setup.AdminEnvironment: tasks = 

    POST    /tasks/log-level (io.dropwizard.servlets.tasks.LogConfigurationTask)
    POST    /tasks/gc (io.dropwizard.servlets.tasks.GarbageCollectionTask)

WARN  [2020-02-22 18:32:39,829] io.dropwizard.setup.AdminEnvironment: 
!!!!!!!!!!!!!!!!!!!!!!!!!!!!!!!!!!!!!!!!!!!!!!!!!!!!!!!!!!!!!!!!!!!!!!!!!!!!!!!!
!!!!!!!!!!!!!!!!!!!!!!!!!!!!!!!!!!!!!!!!!!!!!!!!!!!!!!!!!!!!!!!!!!!!!!!!!!!!!!!!
!    THIS APPLICATION HAS NO HEALTHCHECKS. THIS MEANS YOU WILL NEVER KNOW      !
!     IF IT DIES IN PRODUCTION, WHICH MEANS YOU WILL NEVER KNOW IF YOU'RE      !
!    LETTING YOUR USERS DOWN. YOU SHOULD ADD A HEALTHCHECK FOR EACH OF YOUR    !
!         APPLICATION'S DEPENDENCIES WHICH FULLY (BUT LIGHTLY) TESTS IT.       !
!!!!!!!!!!!!!!!!!!!!!!!!!!!!!!!!!!!!!!!!!!!!!!!!!!!!!!!!!!!!!!!!!!!!!!!!!!!!!!!!
!!!!!!!!!!!!!!!!!!!!!!!!!!!!!!!!!!!!!!!!!!!!!!!!!!!!!!!!!!!!!!!!!!!!!!!!!!!!!!!!
INFO  [2020-02-22 18:32:39,829] org.eclipse.jetty.server.handler.ContextHandler: Started i.d.j.MutableServletContextHandler@6e70861{/,null,AVAILABLE}
INFO  [2020-02-22 18:32:39,830] org.eclipse.jetty.server.AbstractConnector: Started application@4552e288{HTTP/1.1,[http/1.1]}{0.0.0.0:37983}
INFO  [2020-02-22 18:32:39,830] org.eclipse.jetty.server.AbstractConnector: Started admin@1a67bde5{HTTP/1.1,[http/1.1]}{0.0.0.0:33255}
INFO  [2020-02-22 18:32:39,831] org.eclipse.jetty.server.Server: Started @5547ms
127.0.0.1 - - [22/Feb/2020:18:32:39 +0000] "GET /user_agent HTTP/1.1" 200 27 "-" "RequestUserAgentHeaderValue" 18
127.0.0.1 - - [22/Feb/2020:18:32:39 +0000] "GET /user_agent HTTP/1.1" 200 10 "-" "ClientName" 2
127.0.0.1 - - [22/Feb/2020:18:32:39 +0000] "GET /user_agent HTTP/1.1" 200 26 "-" "ClientUserAgentHeaderValue" 1
127.0.0.1 - - [22/Feb/2020:18:32:39 +0000] "GET /user_agent HTTP/1.1" 200 27 "-" "RequestUserAgentHeaderValue" 1
INFO  [2020-02-22 18:32:39,920] org.eclipse.jetty.server.AbstractConnector: Stopped application@4552e288{HTTP/1.1,[http/1.1]}{0.0.0.0:0}
INFO  [2020-02-22 18:32:39,922] org.eclipse.jetty.server.AbstractConnector: Stopped admin@1a67bde5{HTTP/1.1,[http/1.1]}{0.0.0.0:0}
INFO  [2020-02-22 18:32:39,922] org.eclipse.jetty.server.handler.ContextHandler: Stopped i.d.j.MutableServletContextHandler@6e70861{/,null,UNAVAILABLE}
INFO  [2020-02-22 18:32:39,924] org.eclipse.jetty.server.handler.ContextHandler: Stopped i.d.j.MutableServletContextHandler@35d62807{/,null,UNAVAILABLE}
Tests run: 4, Failures: 0, Errors: 0, Skipped: 0, Time elapsed: 0.226 sec - in io.dropwizard.client.JerseyIgnoreRequestUserAgentHeaderFilterTest
Running io.dropwizard.client.proxy.NonProxyListProxyRoutePlannerTest
Tests run: 5, Failures: 0, Errors: 0, Skipped: 0, Time elapsed: 0.026 sec - in io.dropwizard.client.proxy.NonProxyListProxyRoutePlannerTest
Running io.dropwizard.client.JerseyClientBuilderTest
Tests run: 22, Failures: 0, Errors: 0, Skipped: 0, Time elapsed: 0.608 sec - in io.dropwizard.client.JerseyClientBuilderTest
Running io.dropwizard.client.DropwizardExecutorProviderTest
Tests run: 2, Failures: 0, Errors: 0, Skipped: 0, Time elapsed: 0 sec - in io.dropwizard.client.DropwizardExecutorProviderTest

Results :

Tests run: 96, Failures: 0, Errors: 0, Skipped: 0

[INFO] 
[INFO] --- maven-jar-plugin:3.0.2:jar (default-jar) @ dropwizard-client ---
[INFO] Building jar: /builds/workspace/Dropwizard/dropwizard-client/target/dropwizard-client-1.1.0-SNAPSHOT.jar
[INFO] 
[INFO] >>> maven-source-plugin:3.0.1:jar (attach-sources) > generate-sources @ dropwizard-client >>>
[INFO] 
[INFO] --- spoon-maven-plugin:3.1:generate (default) @ dropwizard-client ---
[INFO] Running in NOCLASSPATH mode (doc: http://spoon.gforge.inria.fr/launcher.html).
[INFO] Running in NOCLASSPATH mode (doc: http://spoon.gforge.inria.fr/launcher.html).
[INFO] Spoon version 8.1.0-SNAPSHOT
[INFO] running Spoon...
[INFO] start processing...
[INFO] spoon.processing.SpoonTagger
[INFO] spoon.support.JavaOutputProcessor
[INFO] end of processing: 
[INFO] no errors, no warnings
[INFO] 
[INFO] <<< maven-source-plugin:3.0.1:jar (attach-sources) < generate-sources @ dropwizard-client <<<
[INFO] 
[INFO] --- maven-source-plugin:3.0.1:jar (attach-sources) @ dropwizard-client ---
[INFO] Building jar: /builds/workspace/Dropwizard/dropwizard-client/target/dropwizard-client-1.1.0-SNAPSHOT-sources.jar
[INFO] 
[INFO] --- maven-javadoc-plugin:2.10.4:jar (attach-javadocs) @ dropwizard-client ---
[INFO] 
3 warnings
[WARNING] Javadoc Warnings
[WARNING] Picked up JAVA_TOOL_OPTIONS: -Dfile.encoding=UTF8
[WARNING] /builds/workspace/Dropwizard/dropwizard-client/target/generated-sources/spoon/io/dropwizard/client/HttpClientBuilder.java:104: warning - Tag @link: reference not found: HostnameVerifier
[WARNING] /builds/workspace/Dropwizard/dropwizard-client/target/generated-sources/spoon/io/dropwizard/client/HttpClientBuilder.java:212: warning - Tag @link: reference not found: CloseableHttpClient
[WARNING] /builds/workspace/Dropwizard/dropwizard-client/target/generated-sources/spoon/io/dropwizard/client/HttpClientBuilder.java:265: warning - Tag @link: reference not found: CloseableHttpClient
[INFO] Building jar: /builds/workspace/Dropwizard/dropwizard-client/target/dropwizard-client-1.1.0-SNAPSHOT-javadoc.jar
[INFO] 
[INFO] >>> findbugs-maven-plugin:3.0.4:check (default) > :findbugs @ dropwizard-client >>>
[INFO] 
[INFO] --- findbugs-maven-plugin:3.0.4:findbugs (findbugs) @ dropwizard-client ---
[INFO] Fork Value is true
     [java] Picked up JAVA_TOOL_OPTIONS: -Dfile.encoding=UTF8
[INFO] Done FindBugs Analysis....
[INFO] 
[INFO] <<< findbugs-maven-plugin:3.0.4:check (default) < :findbugs @ dropwizard-client <<<
[INFO] 
[INFO] --- findbugs-maven-plugin:3.0.4:check (default) @ dropwizard-client ---
[INFO] BugInstance size is 0
[INFO] Error size is 0
[INFO] No errors/warnings found
[INFO] 
[INFO] --- maven-install-plugin:2.5.2:install (default-install) @ dropwizard-client ---
[INFO] Installing /builds/workspace/Dropwizard/dropwizard-client/target/dropwizard-client-1.1.0-SNAPSHOT.jar to /builds/.m2/repository/io/dropwizard/dropwizard-client/1.1.0-SNAPSHOT/dropwizard-client-1.1.0-SNAPSHOT.jar
[INFO] Installing /builds/workspace/Dropwizard/dropwizard-client/pom.xml to /builds/.m2/repository/io/dropwizard/dropwizard-client/1.1.0-SNAPSHOT/dropwizard-client-1.1.0-SNAPSHOT.pom
[INFO] Installing /builds/workspace/Dropwizard/dropwizard-client/target/dropwizard-client-1.1.0-SNAPSHOT-sources.jar to /builds/.m2/repository/io/dropwizard/dropwizard-client/1.1.0-SNAPSHOT/dropwizard-client-1.1.0-SNAPSHOT-sources.jar
[INFO] Installing /builds/workspace/Dropwizard/dropwizard-client/target/dropwizard-client-1.1.0-SNAPSHOT-javadoc.jar to /builds/.m2/repository/io/dropwizard/dropwizard-client/1.1.0-SNAPSHOT/dropwizard-client-1.1.0-SNAPSHOT-javadoc.jar
[INFO]                                                                         
[INFO] ------------------------------------------------------------------------
[INFO] Building Dropwizard Database Support 1.1.0-SNAPSHOT
[INFO] ------------------------------------------------------------------------
[INFO] 
[INFO] --- maven-clean-plugin:3.0.0:clean (default-clean) @ dropwizard-db ---
[INFO] Deleting /builds/workspace/Dropwizard/dropwizard-db/target
[INFO] 
[INFO] --- spoon-maven-plugin:3.1:generate (default) @ dropwizard-db ---
[INFO] Running in NOCLASSPATH mode (doc: http://spoon.gforge.inria.fr/launcher.html).
[INFO] Running in NOCLASSPATH mode (doc: http://spoon.gforge.inria.fr/launcher.html).
[INFO] Spoon version 8.1.0-SNAPSHOT
[INFO] running Spoon...
[INFO] start processing...
[INFO] spoon.processing.SpoonTagger
[INFO] spoon.support.JavaOutputProcessor
[INFO] end of processing: 
[INFO] no errors, no warnings
[INFO] 
[INFO] --- maven-resources-plugin:3.0.1:resources (default-resources) @ dropwizard-db ---
[INFO] Using 'UTF-8' encoding to copy filtered resources.
[INFO] skip non existing resourceDirectory /builds/workspace/Dropwizard/dropwizard-db/src/main/resources
[INFO] 
[INFO] --- maven-compiler-plugin:3.5.1:compile (default-compile) @ dropwizard-db ---
[INFO] Changes detected - recompiling the module!
[INFO] Compiling 7 source files to /builds/workspace/Dropwizard/dropwizard-db/target/classes
[INFO] 
[INFO] --- maven-resources-plugin:3.0.1:testResources (default-testResources) @ dropwizard-db ---
[INFO] Using 'UTF-8' encoding to copy filtered resources.
[INFO] Copying 5 resources
[INFO] 
[INFO] --- maven-compiler-plugin:3.5.1:testCompile (default-testCompile) @ dropwizard-db ---
[INFO] Changes detected - recompiling the module!
[INFO] Compiling 5 source files to /builds/workspace/Dropwizard/dropwizard-db/target/test-classes
[INFO] 
[INFO] --- maven-surefire-plugin:2.19.1:test (default-test) @ dropwizard-db ---

-------------------------------------------------------
 T E S T S
-------------------------------------------------------
Picked up JAVA_TOOL_OPTIONS: -Dfile.encoding=UTF8
Running io.dropwizard.db.ManagedPooledDataSourceTest
Tests run: 1, Failures: 0, Errors: 0, Skipped: 0, Time elapsed: 0.132 sec - in io.dropwizard.db.ManagedPooledDataSourceTest
Running io.dropwizard.db.DataSourceConfigurationTest
Tests run: 4, Failures: 0, Errors: 0, Skipped: 0, Time elapsed: 0.929 sec - in io.dropwizard.db.DataSourceConfigurationTest
Running io.dropwizard.db.TimeBoundHealthCheckTest
Tests run: 1, Failures: 0, Errors: 0, Skipped: 0, Time elapsed: 0.552 sec - in io.dropwizard.db.TimeBoundHealthCheckTest
Running io.dropwizard.db.DataSourceFactoryTest
Feb 22, 2020 7:32:50 PM org.apache.tomcat.jdbc.pool.ConnectionPool init
SEVERE: Unable to create initial connections of pool.
java.sql.SQLException: Unable to load class: org.example.no.driver.here from ClassLoader:sun.misc.Launcher$AppClassLoader@6bc7c054;ClassLoader:sun.misc.Launcher$AppClassLoader@6bc7c054
	at org.apache.tomcat.jdbc.pool.PooledConnection.connectUsingDriver(PooledConnection.java:283)
	at org.apache.tomcat.jdbc.pool.PooledConnection.connect(PooledConnection.java:203)
	at org.apache.tomcat.jdbc.pool.ConnectionPool.createConnection(ConnectionPool.java:718)
	at org.apache.tomcat.jdbc.pool.ConnectionPool.borrowConnection(ConnectionPool.java:650)
	at org.apache.tomcat.jdbc.pool.ConnectionPool.init(ConnectionPool.java:468)
	at org.apache.tomcat.jdbc.pool.ConnectionPool.<init>(ConnectionPool.java:143)
	at org.apache.tomcat.jdbc.pool.DataSourceProxy.pCreatePool(DataSourceProxy.java:118)
	at org.apache.tomcat.jdbc.pool.DataSourceProxy.createPool(DataSourceProxy.java:107)
	at org.apache.tomcat.jdbc.pool.DataSourceProxy.getConnection(DataSourceProxy.java:131)
	at io.dropwizard.db.DataSourceFactoryTest.invalidJDBCDriverClassThrowsSQLException(DataSourceFactoryTest.java:94)
	at sun.reflect.NativeMethodAccessorImpl.invoke0(Native Method)
	at sun.reflect.NativeMethodAccessorImpl.invoke(NativeMethodAccessorImpl.java:62)
	at sun.reflect.DelegatingMethodAccessorImpl.invoke(DelegatingMethodAccessorImpl.java:43)
	at java.lang.reflect.Method.invoke(Method.java:498)
	at org.junit.runners.model.FrameworkMethod$1.runReflectiveCall(FrameworkMethod.java:50)
	at org.junit.internal.runners.model.ReflectiveCallable.run(ReflectiveCallable.java:12)
	at org.junit.runners.model.FrameworkMethod.invokeExplosively(FrameworkMethod.java:47)
	at org.junit.internal.runners.statements.InvokeMethod.evaluate(InvokeMethod.java:17)
	at org.junit.internal.runners.statements.ExpectException.evaluate(ExpectException.java:19)
	at org.junit.internal.runners.statements.RunBefores.evaluate(RunBefores.java:26)
	at org.junit.internal.runners.statements.RunAfters.evaluate(RunAfters.java:27)
	at org.junit.runners.ParentRunner.runLeaf(ParentRunner.java:325)
	at org.junit.runners.BlockJUnit4ClassRunner.runChild(BlockJUnit4ClassRunner.java:78)
	at org.junit.runners.BlockJUnit4ClassRunner.runChild(BlockJUnit4ClassRunner.java:57)
	at org.junit.runners.ParentRunner$3.run(ParentRunner.java:290)
	at org.junit.runners.ParentRunner$1.schedule(ParentRunner.java:71)
	at org.junit.runners.ParentRunner.runChildren(ParentRunner.java:288)
	at org.junit.runners.ParentRunner.access$000(ParentRunner.java:58)
	at org.junit.runners.ParentRunner$2.evaluate(ParentRunner.java:268)
	at org.junit.runners.ParentRunner.run(ParentRunner.java:363)
	at org.apache.maven.surefire.junit4.JUnit4Provider.execute(JUnit4Provider.java:367)
	at org.apache.maven.surefire.junit4.JUnit4Provider.executeWithRerun(JUnit4Provider.java:274)
	at org.apache.maven.surefire.junit4.JUnit4Provider.executeTestSet(JUnit4Provider.java:238)
	at org.apache.maven.surefire.junit4.JUnit4Provider.invoke(JUnit4Provider.java:161)
	at org.apache.maven.surefire.booter.ForkedBooter.invokeProviderInSameClassLoader(ForkedBooter.java:290)
	at org.apache.maven.surefire.booter.ForkedBooter.runSuitesInProcess(ForkedBooter.java:242)
	at org.apache.maven.surefire.booter.ForkedBooter.main(ForkedBooter.java:121)
Caused by: java.lang.ClassNotFoundException: Unable to load class: org.example.no.driver.here from ClassLoader:sun.misc.Launcher$AppClassLoader@6bc7c054;ClassLoader:sun.misc.Launcher$AppClassLoader@6bc7c054
	at org.apache.tomcat.jdbc.pool.ClassLoaderUtil.loadClass(ClassLoaderUtil.java:56)
	at org.apache.tomcat.jdbc.pool.PooledConnection.connectUsingDriver(PooledConnection.java:271)
	... 36 more
Caused by: java.lang.ClassNotFoundException: org.example.no.driver.here
	at java.net.URLClassLoader.findClass(URLClassLoader.java:381)
	at java.lang.ClassLoader.loadClass(ClassLoader.java:424)
	at sun.misc.Launcher$AppClassLoader.loadClass(Launcher.java:335)
	at java.lang.ClassLoader.loadClass(ClassLoader.java:357)
	at java.lang.Class.forName0(Native Method)
	at java.lang.Class.forName(Class.java:348)
	at org.apache.tomcat.jdbc.pool.ClassLoaderUtil.loadClass(ClassLoaderUtil.java:38)
	... 37 more

Tests run: 7, Failures: 0, Errors: 0, Skipped: 0, Time elapsed: 0.259 sec - in io.dropwizard.db.DataSourceFactoryTest

Results :

Tests run: 13, Failures: 0, Errors: 0, Skipped: 0

[INFO] 
[INFO] --- maven-jar-plugin:3.0.2:jar (default-jar) @ dropwizard-db ---
[INFO] Building jar: /builds/workspace/Dropwizard/dropwizard-db/target/dropwizard-db-1.1.0-SNAPSHOT.jar
[INFO] 
[INFO] >>> maven-source-plugin:3.0.1:jar (attach-sources) > generate-sources @ dropwizard-db >>>
[INFO] 
[INFO] --- spoon-maven-plugin:3.1:generate (default) @ dropwizard-db ---
[INFO] Running in NOCLASSPATH mode (doc: http://spoon.gforge.inria.fr/launcher.html).
[INFO] Running in NOCLASSPATH mode (doc: http://spoon.gforge.inria.fr/launcher.html).
[INFO] Spoon version 8.1.0-SNAPSHOT
[INFO] running Spoon...
[INFO] start processing...
[INFO] spoon.processing.SpoonTagger
[INFO] spoon.support.JavaOutputProcessor
[INFO] end of processing: 
[INFO] no errors, no warnings
[INFO] 
[INFO] <<< maven-source-plugin:3.0.1:jar (attach-sources) < generate-sources @ dropwizard-db <<<
[INFO] 
[INFO] --- maven-source-plugin:3.0.1:jar (attach-sources) @ dropwizard-db ---
[INFO] Building jar: /builds/workspace/Dropwizard/dropwizard-db/target/dropwizard-db-1.1.0-SNAPSHOT-sources.jar
[INFO] 
[INFO] --- maven-javadoc-plugin:2.10.4:jar (attach-javadocs) @ dropwizard-db ---
[WARNING] Javadoc Warnings
[WARNING] Picked up JAVA_TOOL_OPTIONS: -Dfile.encoding=UTF8
[INFO] Building jar: /builds/workspace/Dropwizard/dropwizard-db/target/dropwizard-db-1.1.0-SNAPSHOT-javadoc.jar
[INFO] 
[INFO] >>> findbugs-maven-plugin:3.0.4:check (default) > :findbugs @ dropwizard-db >>>
[INFO] 
[INFO] --- findbugs-maven-plugin:3.0.4:findbugs (findbugs) @ dropwizard-db ---
[INFO] Fork Value is true
     [java] Picked up JAVA_TOOL_OPTIONS: -Dfile.encoding=UTF8
[INFO] Done FindBugs Analysis....
[INFO] 
[INFO] <<< findbugs-maven-plugin:3.0.4:check (default) < :findbugs @ dropwizard-db <<<
[INFO] 
[INFO] --- findbugs-maven-plugin:3.0.4:check (default) @ dropwizard-db ---
[INFO] BugInstance size is 0
[INFO] Error size is 0
[INFO] No errors/warnings found
[INFO] 
[INFO] --- maven-install-plugin:2.5.2:install (default-install) @ dropwizard-db ---
[INFO] Installing /builds/workspace/Dropwizard/dropwizard-db/target/dropwizard-db-1.1.0-SNAPSHOT.jar to /builds/.m2/repository/io/dropwizard/dropwizard-db/1.1.0-SNAPSHOT/dropwizard-db-1.1.0-SNAPSHOT.jar
[INFO] Installing /builds/workspace/Dropwizard/dropwizard-db/pom.xml to /builds/.m2/repository/io/dropwizard/dropwizard-db/1.1.0-SNAPSHOT/dropwizard-db-1.1.0-SNAPSHOT.pom
[INFO] Installing /builds/workspace/Dropwizard/dropwizard-db/target/dropwizard-db-1.1.0-SNAPSHOT-sources.jar to /builds/.m2/repository/io/dropwizard/dropwizard-db/1.1.0-SNAPSHOT/dropwizard-db-1.1.0-SNAPSHOT-sources.jar
[INFO] Installing /builds/workspace/Dropwizard/dropwizard-db/target/dropwizard-db-1.1.0-SNAPSHOT-javadoc.jar to /builds/.m2/repository/io/dropwizard/dropwizard-db/1.1.0-SNAPSHOT/dropwizard-db-1.1.0-SNAPSHOT-javadoc.jar
[INFO]                                                                         
[INFO] ------------------------------------------------------------------------
[INFO] Building Dropwizard JDBI Support 1.1.0-SNAPSHOT
[INFO] ------------------------------------------------------------------------
[INFO] 
[INFO] --- maven-clean-plugin:3.0.0:clean (default-clean) @ dropwizard-jdbi ---
[INFO] Deleting /builds/workspace/Dropwizard/dropwizard-jdbi/target
[INFO] 
[INFO] --- spoon-maven-plugin:3.1:generate (default) @ dropwizard-jdbi ---
[INFO] Running in NOCLASSPATH mode (doc: http://spoon.gforge.inria.fr/launcher.html).
[INFO] Running in NOCLASSPATH mode (doc: http://spoon.gforge.inria.fr/launcher.html).
[INFO] Spoon version 8.1.0-SNAPSHOT
[INFO] running Spoon...
[INFO] start processing...
[INFO] spoon.processing.SpoonTagger
[INFO] spoon.support.JavaOutputProcessor
[INFO] end of processing: 
[INFO] no errors, no warnings
[INFO] 
[INFO] --- maven-resources-plugin:3.0.1:resources (default-resources) @ dropwizard-jdbi ---
[INFO] Using 'UTF-8' encoding to copy filtered resources.
[INFO] skip non existing resourceDirectory /builds/workspace/Dropwizard/dropwizard-jdbi/src/main/resources
[INFO] 
[INFO] --- maven-compiler-plugin:3.5.1:compile (default-compile) @ dropwizard-jdbi ---
[INFO] Changes detected - recompiling the module!
[INFO] Compiling 50 source files to /builds/workspace/Dropwizard/dropwizard-jdbi/target/classes
[INFO] 
[INFO] --- maven-resources-plugin:3.0.1:testResources (default-testResources) @ dropwizard-jdbi ---
[INFO] Using 'UTF-8' encoding to copy filtered resources.
[INFO] skip non existing resourceDirectory /builds/workspace/Dropwizard/dropwizard-jdbi/src/test/resources
[INFO] 
[INFO] --- maven-compiler-plugin:3.5.1:testCompile (default-testCompile) @ dropwizard-jdbi ---
[INFO] No sources to compile
[INFO] 
[INFO] --- maven-surefire-plugin:2.19.1:test (default-test) @ dropwizard-jdbi ---
[INFO] No tests to run.
[INFO] 
[INFO] --- maven-jar-plugin:3.0.2:jar (default-jar) @ dropwizard-jdbi ---
[INFO] Building jar: /builds/workspace/Dropwizard/dropwizard-jdbi/target/dropwizard-jdbi-1.1.0-SNAPSHOT.jar
[INFO] 
[INFO] >>> maven-source-plugin:3.0.1:jar (attach-sources) > generate-sources @ dropwizard-jdbi >>>
[INFO] 
[INFO] --- spoon-maven-plugin:3.1:generate (default) @ dropwizard-jdbi ---
[INFO] Running in NOCLASSPATH mode (doc: http://spoon.gforge.inria.fr/launcher.html).
[INFO] Running in NOCLASSPATH mode (doc: http://spoon.gforge.inria.fr/launcher.html).
[INFO] Spoon version 8.1.0-SNAPSHOT
[INFO] running Spoon...
[INFO] start processing...
[INFO] spoon.processing.SpoonTagger
[INFO] spoon.support.JavaOutputProcessor
[INFO] end of processing: 
[INFO] no errors, no warnings
[INFO] 
[INFO] <<< maven-source-plugin:3.0.1:jar (attach-sources) < generate-sources @ dropwizard-jdbi <<<
[INFO] 
[INFO] --- maven-source-plugin:3.0.1:jar (attach-sources) @ dropwizard-jdbi ---
[INFO] Building jar: /builds/workspace/Dropwizard/dropwizard-jdbi/target/dropwizard-jdbi-1.1.0-SNAPSHOT-sources.jar
[INFO] 
[INFO] --- maven-javadoc-plugin:2.10.4:jar (attach-javadocs) @ dropwizard-jdbi ---
[WARNING] Javadoc Warnings
[WARNING] Picked up JAVA_TOOL_OPTIONS: -Dfile.encoding=UTF8
[INFO] Building jar: /builds/workspace/Dropwizard/dropwizard-jdbi/target/dropwizard-jdbi-1.1.0-SNAPSHOT-javadoc.jar
[INFO] 
[INFO] >>> findbugs-maven-plugin:3.0.4:check (default) > :findbugs @ dropwizard-jdbi >>>
[INFO] 
[INFO] --- findbugs-maven-plugin:3.0.4:findbugs (findbugs) @ dropwizard-jdbi ---
[INFO] Fork Value is true
     [java] Picked up JAVA_TOOL_OPTIONS: -Dfile.encoding=UTF8
[INFO] Done FindBugs Analysis....
[INFO] 
[INFO] <<< findbugs-maven-plugin:3.0.4:check (default) < :findbugs @ dropwizard-jdbi <<<
[INFO] 
[INFO] --- findbugs-maven-plugin:3.0.4:check (default) @ dropwizard-jdbi ---
[INFO] BugInstance size is 0
[INFO] Error size is 0
[INFO] No errors/warnings found
[INFO] 
[INFO] --- maven-install-plugin:2.5.2:install (default-install) @ dropwizard-jdbi ---
[INFO] Installing /builds/workspace/Dropwizard/dropwizard-jdbi/target/dropwizard-jdbi-1.1.0-SNAPSHOT.jar to /builds/.m2/repository/io/dropwizard/dropwizard-jdbi/1.1.0-SNAPSHOT/dropwizard-jdbi-1.1.0-SNAPSHOT.jar
[INFO] Installing /builds/workspace/Dropwizard/dropwizard-jdbi/pom.xml to /builds/.m2/repository/io/dropwizard/dropwizard-jdbi/1.1.0-SNAPSHOT/dropwizard-jdbi-1.1.0-SNAPSHOT.pom
[INFO] Installing /builds/workspace/Dropwizard/dropwizard-jdbi/target/dropwizard-jdbi-1.1.0-SNAPSHOT-sources.jar to /builds/.m2/repository/io/dropwizard/dropwizard-jdbi/1.1.0-SNAPSHOT/dropwizard-jdbi-1.1.0-SNAPSHOT-sources.jar
[INFO] Installing /builds/workspace/Dropwizard/dropwizard-jdbi/target/dropwizard-jdbi-1.1.0-SNAPSHOT-javadoc.jar to /builds/.m2/repository/io/dropwizard/dropwizard-jdbi/1.1.0-SNAPSHOT/dropwizard-jdbi-1.1.0-SNAPSHOT-javadoc.jar
[INFO]                                                                         
[INFO] ------------------------------------------------------------------------
[INFO] Building Dropwizard Migrations 1.1.0-SNAPSHOT
[INFO] ------------------------------------------------------------------------
[INFO] 
[INFO] --- maven-clean-plugin:3.0.0:clean (default-clean) @ dropwizard-migrations ---
[INFO] Deleting /builds/workspace/Dropwizard/dropwizard-migrations/target
[INFO] 
[INFO] --- spoon-maven-plugin:3.1:generate (default) @ dropwizard-migrations ---
[INFO] Running in NOCLASSPATH mode (doc: http://spoon.gforge.inria.fr/launcher.html).
[INFO] Running in NOCLASSPATH mode (doc: http://spoon.gforge.inria.fr/launcher.html).
[INFO] Spoon version 8.1.0-SNAPSHOT
[INFO] running Spoon...
[INFO] start processing...
[INFO] spoon.processing.SpoonTagger
[INFO] spoon.support.JavaOutputProcessor
[INFO] end of processing: 
[INFO] no errors, no warnings
[INFO] 
[INFO] --- maven-resources-plugin:3.0.1:resources (default-resources) @ dropwizard-migrations ---
[INFO] Using 'UTF-8' encoding to copy filtered resources.
[INFO] skip non existing resourceDirectory /builds/workspace/Dropwizard/dropwizard-migrations/src/main/resources
[INFO] 
[INFO] --- maven-compiler-plugin:3.5.1:compile (default-compile) @ dropwizard-migrations ---
[INFO] Changes detected - recompiling the module!
[INFO] Compiling 20 source files to /builds/workspace/Dropwizard/dropwizard-migrations/target/classes
[INFO] 
[INFO] --- maven-resources-plugin:3.0.1:testResources (default-testResources) @ dropwizard-migrations ---
[INFO] Using 'UTF-8' encoding to copy filtered resources.
[INFO] Copying 4 resources
[INFO] 
[INFO] --- maven-compiler-plugin:3.5.1:testCompile (default-testCompile) @ dropwizard-migrations ---
[INFO] Changes detected - recompiling the module!
[INFO] Compiling 8 source files to /builds/workspace/Dropwizard/dropwizard-migrations/target/test-classes
[INFO] 
[INFO] --- maven-surefire-plugin:2.19.1:test (default-test) @ dropwizard-migrations ---

-------------------------------------------------------
 T E S T S
-------------------------------------------------------
Picked up JAVA_TOOL_OPTIONS: -Dfile.encoding=UTF8
Running io.dropwizard.migrations.DbMigrateCommandTest
Tests run: 4, Failures: 0, Errors: 0, Skipped: 0, Time elapsed: 2.555 sec - in io.dropwizard.migrations.DbMigrateCommandTest
Running io.dropwizard.migrations.DbStatusCommandTest
Tests run: 4, Failures: 0, Errors: 0, Skipped: 0, Time elapsed: 0.143 sec - in io.dropwizard.migrations.DbStatusCommandTest
Running io.dropwizard.migrations.DbMigrateDifferentFileCommandTest
Tests run: 1, Failures: 0, Errors: 0, Skipped: 0, Time elapsed: 0.28 sec - in io.dropwizard.migrations.DbMigrateDifferentFileCommandTest
Running io.dropwizard.migrations.CloseableLiquibaseTest
Tests run: 1, Failures: 0, Errors: 0, Skipped: 0, Time elapsed: 0.009 sec - in io.dropwizard.migrations.CloseableLiquibaseTest
Running io.dropwizard.migrations.DbDumpCommandTest
Tests run: 5, Failures: 0, Errors: 0, Skipped: 0, Time elapsed: 0.247 sec - in io.dropwizard.migrations.DbDumpCommandTest

Results :

Tests run: 15, Failures: 0, Errors: 0, Skipped: 0

[INFO] 
[INFO] --- maven-jar-plugin:3.0.2:jar (default-jar) @ dropwizard-migrations ---
[INFO] Building jar: /builds/workspace/Dropwizard/dropwizard-migrations/target/dropwizard-migrations-1.1.0-SNAPSHOT.jar
[INFO] 
[INFO] >>> maven-source-plugin:3.0.1:jar (attach-sources) > generate-sources @ dropwizard-migrations >>>
[INFO] 
[INFO] --- spoon-maven-plugin:3.1:generate (default) @ dropwizard-migrations ---
[INFO] Running in NOCLASSPATH mode (doc: http://spoon.gforge.inria.fr/launcher.html).
[INFO] Running in NOCLASSPATH mode (doc: http://spoon.gforge.inria.fr/launcher.html).
[INFO] Spoon version 8.1.0-SNAPSHOT
[INFO] running Spoon...
[INFO] start processing...
[INFO] spoon.processing.SpoonTagger
[INFO] spoon.support.JavaOutputProcessor
[INFO] end of processing: 
[INFO] no errors, no warnings
[INFO] 
[INFO] <<< maven-source-plugin:3.0.1:jar (attach-sources) < generate-sources @ dropwizard-migrations <<<
[INFO] 
[INFO] --- maven-source-plugin:3.0.1:jar (attach-sources) @ dropwizard-migrations ---
[INFO] Building jar: /builds/workspace/Dropwizard/dropwizard-migrations/target/dropwizard-migrations-1.1.0-SNAPSHOT-sources.jar
[INFO] 
[INFO] --- maven-javadoc-plugin:2.10.4:jar (attach-javadocs) @ dropwizard-migrations ---
[WARNING] Javadoc Warnings
[WARNING] Picked up JAVA_TOOL_OPTIONS: -Dfile.encoding=UTF8
[INFO] Building jar: /builds/workspace/Dropwizard/dropwizard-migrations/target/dropwizard-migrations-1.1.0-SNAPSHOT-javadoc.jar
[INFO] 
[INFO] >>> findbugs-maven-plugin:3.0.4:check (default) > :findbugs @ dropwizard-migrations >>>
[INFO] 
[INFO] --- findbugs-maven-plugin:3.0.4:findbugs (findbugs) @ dropwizard-migrations ---
[INFO] Fork Value is true
     [java] Picked up JAVA_TOOL_OPTIONS: -Dfile.encoding=UTF8
[INFO] Done FindBugs Analysis....
[INFO] 
[INFO] <<< findbugs-maven-plugin:3.0.4:check (default) < :findbugs @ dropwizard-migrations <<<
[INFO] 
[INFO] --- findbugs-maven-plugin:3.0.4:check (default) @ dropwizard-migrations ---
[INFO] BugInstance size is 0
[INFO] Error size is 0
[INFO] No errors/warnings found
[INFO] 
[INFO] --- maven-install-plugin:2.5.2:install (default-install) @ dropwizard-migrations ---
[INFO] Installing /builds/workspace/Dropwizard/dropwizard-migrations/target/dropwizard-migrations-1.1.0-SNAPSHOT.jar to /builds/.m2/repository/io/dropwizard/dropwizard-migrations/1.1.0-SNAPSHOT/dropwizard-migrations-1.1.0-SNAPSHOT.jar
[INFO] Installing /builds/workspace/Dropwizard/dropwizard-migrations/pom.xml to /builds/.m2/repository/io/dropwizard/dropwizard-migrations/1.1.0-SNAPSHOT/dropwizard-migrations-1.1.0-SNAPSHOT.pom
[INFO] Installing /builds/workspace/Dropwizard/dropwizard-migrations/target/dropwizard-migrations-1.1.0-SNAPSHOT-sources.jar to /builds/.m2/repository/io/dropwizard/dropwizard-migrations/1.1.0-SNAPSHOT/dropwizard-migrations-1.1.0-SNAPSHOT-sources.jar
[INFO] Installing /builds/workspace/Dropwizard/dropwizard-migrations/target/dropwizard-migrations-1.1.0-SNAPSHOT-javadoc.jar to /builds/.m2/repository/io/dropwizard/dropwizard-migrations/1.1.0-SNAPSHOT/dropwizard-migrations-1.1.0-SNAPSHOT-javadoc.jar
[INFO]                                                                         
[INFO] ------------------------------------------------------------------------
[INFO] Building Dropwizard Hibernate Support 1.1.0-SNAPSHOT
[INFO] ------------------------------------------------------------------------
[INFO] 
[INFO] --- maven-clean-plugin:3.0.0:clean (default-clean) @ dropwizard-hibernate ---
[INFO] Deleting /builds/workspace/Dropwizard/dropwizard-hibernate/target
[INFO] 
[INFO] --- spoon-maven-plugin:3.1:generate (default) @ dropwizard-hibernate ---
[INFO] Running in NOCLASSPATH mode (doc: http://spoon.gforge.inria.fr/launcher.html).
[INFO] Running in NOCLASSPATH mode (doc: http://spoon.gforge.inria.fr/launcher.html).
[INFO] Spoon version 8.1.0-SNAPSHOT
[INFO] running Spoon...
[INFO] start processing...
[INFO] spoon.processing.SpoonTagger
[INFO] spoon.support.JavaOutputProcessor
[INFO] end of processing: 
[INFO] no errors, no warnings
[INFO] 
[INFO] --- maven-resources-plugin:3.0.1:resources (default-resources) @ dropwizard-hibernate ---
[INFO] Using 'UTF-8' encoding to copy filtered resources.
[INFO] skip non existing resourceDirectory /builds/workspace/Dropwizard/dropwizard-hibernate/src/main/resources
[INFO] 
[INFO] --- maven-compiler-plugin:3.5.1:compile (default-compile) @ dropwizard-hibernate ---
[INFO] Changes detected - recompiling the module!
[INFO] Compiling 11 source files to /builds/workspace/Dropwizard/dropwizard-hibernate/target/classes
[INFO] 
[INFO] --- maven-resources-plugin:3.0.1:testResources (default-testResources) @ dropwizard-hibernate ---
[INFO] Using 'UTF-8' encoding to copy filtered resources.
[INFO] Copying 2 resources
[INFO] 
[INFO] --- maven-compiler-plugin:3.5.1:testCompile (default-testCompile) @ dropwizard-hibernate ---
[INFO] Changes detected - recompiling the module!
[INFO] Compiling 22 source files to /builds/workspace/Dropwizard/dropwizard-hibernate/target/test-classes
[INFO] 
[INFO] --- maven-surefire-plugin:2.19.1:test (default-test) @ dropwizard-hibernate ---

-------------------------------------------------------
 T E S T S
-------------------------------------------------------
Picked up JAVA_TOOL_OPTIONS: -Dfile.encoding=UTF8
Running io.dropwizard.hibernate.UnitOfWorkApplicationListenerTest
Tests run: 17, Failures: 0, Errors: 0, Skipped: 0, Time elapsed: 1.271 sec - in io.dropwizard.hibernate.UnitOfWorkApplicationListenerTest
Running io.dropwizard.hibernate.UnitOfWorkAwareProxyFactoryTest
Tests run: 4, Failures: 0, Errors: 0, Skipped: 0, Time elapsed: 1.392 sec - in io.dropwizard.hibernate.UnitOfWorkAwareProxyFactoryTest
Running io.dropwizard.hibernate.SessionFactoryManagerTest
Tests run: 3, Failures: 0, Errors: 0, Skipped: 0, Time elapsed: 0.042 sec - in io.dropwizard.hibernate.SessionFactoryManagerTest
Running io.dropwizard.hibernate.UnitOfWorkTest
Tests run: 4, Failures: 0, Errors: 0, Skipped: 0, Time elapsed: 0.003 sec - in io.dropwizard.hibernate.UnitOfWorkTest
Running io.dropwizard.hibernate.AbstractDAOTest
Tests run: 11, Failures: 0, Errors: 0, Skipped: 0, Time elapsed: 0.33 sec - in io.dropwizard.hibernate.AbstractDAOTest
Running io.dropwizard.hibernate.JerseyIntegrationTest
Tests run: 4, Failures: 0, Errors: 0, Skipped: 0, Time elapsed: 1.815 sec - in io.dropwizard.hibernate.JerseyIntegrationTest
Running io.dropwizard.hibernate.ScanningHibernateBundleTest
Tests run: 2, Failures: 0, Errors: 0, Skipped: 0, Time elapsed: 0.066 sec - in io.dropwizard.hibernate.ScanningHibernateBundleTest
Running io.dropwizard.hibernate.SessionFactoryHealthCheckTest
Tests run: 4, Failures: 0, Errors: 0, Skipped: 0, Time elapsed: 0.143 sec - in io.dropwizard.hibernate.SessionFactoryHealthCheckTest
Running io.dropwizard.hibernate.HibernateBundleTest
Tests run: 6, Failures: 0, Errors: 0, Skipped: 0, Time elapsed: 0.591 sec - in io.dropwizard.hibernate.HibernateBundleTest
Running io.dropwizard.hibernate.LazyLoadingTest
Tests run: 3, Failures: 0, Errors: 0, Skipped: 0, Time elapsed: 1.576 sec - in io.dropwizard.hibernate.LazyLoadingTest
Running io.dropwizard.hibernate.SessionFactoryFactoryTest
Hibernate: DROP TABLE people IF EXISTS
Hibernate: CREATE TABLE people (name varchar(100) primary key, email varchar(100), birthday timestamp(0))
Hibernate: INSERT INTO people VALUES ('Coda', 'coda@example.com', '1979-01-02 00:22:00')
Hibernate: select person0_.name as name1_0_0_, person0_.birthday as birthday2_0_0_, person0_.email as email3_0_0_ from people person0_ where person0_.name=?
Tests run: 6, Failures: 0, Errors: 0, Skipped: 0, Time elapsed: 0.253 sec - in io.dropwizard.hibernate.SessionFactoryFactoryTest

Results :

Tests run: 64, Failures: 0, Errors: 0, Skipped: 0

[INFO] 
[INFO] --- maven-jar-plugin:3.0.2:jar (default-jar) @ dropwizard-hibernate ---
[INFO] Building jar: /builds/workspace/Dropwizard/dropwizard-hibernate/target/dropwizard-hibernate-1.1.0-SNAPSHOT.jar
[INFO] 
[INFO] >>> maven-source-plugin:3.0.1:jar (attach-sources) > generate-sources @ dropwizard-hibernate >>>
[INFO] 
[INFO] --- spoon-maven-plugin:3.1:generate (default) @ dropwizard-hibernate ---
[INFO] Running in NOCLASSPATH mode (doc: http://spoon.gforge.inria.fr/launcher.html).
[INFO] Running in NOCLASSPATH mode (doc: http://spoon.gforge.inria.fr/launcher.html).
[INFO] Spoon version 8.1.0-SNAPSHOT
[INFO] running Spoon...
[INFO] start processing...
[INFO] spoon.processing.SpoonTagger
[INFO] spoon.support.JavaOutputProcessor
[INFO] end of processing: 
[INFO] no errors, no warnings
[INFO] 
[INFO] <<< maven-source-plugin:3.0.1:jar (attach-sources) < generate-sources @ dropwizard-hibernate <<<
[INFO] 
[INFO] --- maven-source-plugin:3.0.1:jar (attach-sources) @ dropwizard-hibernate ---
[INFO] Building jar: /builds/workspace/Dropwizard/dropwizard-hibernate/target/dropwizard-hibernate-1.1.0-SNAPSHOT-sources.jar
[INFO] 
[INFO] --- maven-javadoc-plugin:2.10.4:jar (attach-javadocs) @ dropwizard-hibernate ---
[INFO] 
2 warnings
[WARNING] Javadoc Warnings
[WARNING] Picked up JAVA_TOOL_OPTIONS: -Dfile.encoding=UTF8
[WARNING] /builds/workspace/Dropwizard/dropwizard-hibernate/target/generated-sources/spoon/io/dropwizard/hibernate/UnitOfWorkApplicationListener.java:33: warning - Tag @link: reference not found: SessionFactory
[WARNING] /builds/workspace/Dropwizard/dropwizard-hibernate/target/generated-sources/spoon/io/dropwizard/hibernate/UnitOfWorkApplicationListener.java:45: warning - Tag @link: reference not found: SessionFactory
[INFO] Building jar: /builds/workspace/Dropwizard/dropwizard-hibernate/target/dropwizard-hibernate-1.1.0-SNAPSHOT-javadoc.jar
[INFO] 
[INFO] >>> findbugs-maven-plugin:3.0.4:check (default) > :findbugs @ dropwizard-hibernate >>>
[INFO] 
[INFO] --- findbugs-maven-plugin:3.0.4:findbugs (findbugs) @ dropwizard-hibernate ---
[INFO] Fork Value is true
     [java] Picked up JAVA_TOOL_OPTIONS: -Dfile.encoding=UTF8
[INFO] Done FindBugs Analysis....
[INFO] 
[INFO] <<< findbugs-maven-plugin:3.0.4:check (default) < :findbugs @ dropwizard-hibernate <<<
[INFO] 
[INFO] --- findbugs-maven-plugin:3.0.4:check (default) @ dropwizard-hibernate ---
[INFO] BugInstance size is 0
[INFO] Error size is 0
[INFO] No errors/warnings found
[INFO] 
[INFO] --- maven-install-plugin:2.5.2:install (default-install) @ dropwizard-hibernate ---
[INFO] Installing /builds/workspace/Dropwizard/dropwizard-hibernate/target/dropwizard-hibernate-1.1.0-SNAPSHOT.jar to /builds/.m2/repository/io/dropwizard/dropwizard-hibernate/1.1.0-SNAPSHOT/dropwizard-hibernate-1.1.0-SNAPSHOT.jar
[INFO] Installing /builds/workspace/Dropwizard/dropwizard-hibernate/pom.xml to /builds/.m2/repository/io/dropwizard/dropwizard-hibernate/1.1.0-SNAPSHOT/dropwizard-hibernate-1.1.0-SNAPSHOT.pom
[INFO] Installing /builds/workspace/Dropwizard/dropwizard-hibernate/target/dropwizard-hibernate-1.1.0-SNAPSHOT-sources.jar to /builds/.m2/repository/io/dropwizard/dropwizard-hibernate/1.1.0-SNAPSHOT/dropwizard-hibernate-1.1.0-SNAPSHOT-sources.jar
[INFO] Installing /builds/workspace/Dropwizard/dropwizard-hibernate/target/dropwizard-hibernate-1.1.0-SNAPSHOT-javadoc.jar to /builds/.m2/repository/io/dropwizard/dropwizard-hibernate/1.1.0-SNAPSHOT/dropwizard-hibernate-1.1.0-SNAPSHOT-javadoc.jar
[INFO]                                                                         
[INFO] ------------------------------------------------------------------------
[INFO] Building Dropwizard Authentication 1.1.0-SNAPSHOT
[INFO] ------------------------------------------------------------------------
[INFO] 
[INFO] --- maven-clean-plugin:3.0.0:clean (default-clean) @ dropwizard-auth ---
[INFO] Deleting /builds/workspace/Dropwizard/dropwizard-auth/target
[INFO] 
[INFO] --- spoon-maven-plugin:3.1:generate (default) @ dropwizard-auth ---
[INFO] Running in NOCLASSPATH mode (doc: http://spoon.gforge.inria.fr/launcher.html).
[INFO] Running in NOCLASSPATH mode (doc: http://spoon.gforge.inria.fr/launcher.html).
[INFO] Spoon version 8.1.0-SNAPSHOT
[INFO] running Spoon...
[INFO] start processing...
[INFO] spoon.processing.SpoonTagger
[INFO] spoon.support.JavaOutputProcessor
[INFO] end of processing: 
[INFO] no errors, no warnings
[INFO] 
[INFO] --- maven-resources-plugin:3.0.1:resources (default-resources) @ dropwizard-auth ---
[INFO] Using 'UTF-8' encoding to copy filtered resources.
[INFO] skip non existing resourceDirectory /builds/workspace/Dropwizard/dropwizard-auth/src/main/resources
[INFO] 
[INFO] --- maven-compiler-plugin:3.5.1:compile (default-compile) @ dropwizard-auth ---
[INFO] Changes detected - recompiling the module!
[INFO] Compiling 21 source files to /builds/workspace/Dropwizard/dropwizard-auth/target/classes
[INFO] 
[INFO] --- maven-resources-plugin:3.0.1:testResources (default-testResources) @ dropwizard-auth ---
[INFO] Using 'UTF-8' encoding to copy filtered resources.
[INFO] Copying 1 resource
[INFO] 
[INFO] --- maven-compiler-plugin:3.5.1:testCompile (default-testCompile) @ dropwizard-auth ---
[INFO] Changes detected - recompiling the module!
[INFO] Compiling 21 source files to /builds/workspace/Dropwizard/dropwizard-auth/target/test-classes
[INFO] 
[INFO] --- maven-surefire-plugin:2.19.1:test (default-test) @ dropwizard-auth ---

-------------------------------------------------------
 T E S T S
-------------------------------------------------------
Picked up JAVA_TOOL_OPTIONS: -Dfile.encoding=UTF8
Running io.dropwizard.auth.chained.ChainedAuthProviderTest
Tests run: 12, Failures: 0, Errors: 0, Skipped: 0, Time elapsed: 2.694 sec - in io.dropwizard.auth.chained.ChainedAuthProviderTest
Running io.dropwizard.auth.CachingAuthenticatorTest
Tests run: 11, Failures: 0, Errors: 0, Skipped: 0, Time elapsed: 0.387 sec - in io.dropwizard.auth.CachingAuthenticatorTest
Running io.dropwizard.auth.CachingAuthorizerTest
Tests run: 9, Failures: 0, Errors: 0, Skipped: 0, Time elapsed: 0.034 sec - in io.dropwizard.auth.CachingAuthorizerTest
Running io.dropwizard.auth.principal.PolymorphicPrincipalEntityTest
Tests run: 4, Failures: 0, Errors: 0, Skipped: 0, Time elapsed: 0.277 sec - in io.dropwizard.auth.principal.PolymorphicPrincipalEntityTest
Running io.dropwizard.auth.principal.NoAuthPrincipalEntityTest
Tests run: 2, Failures: 0, Errors: 0, Skipped: 0, Time elapsed: 0.344 sec - in io.dropwizard.auth.principal.NoAuthPrincipalEntityTest
Running io.dropwizard.auth.principal.NoAuthPolymorphicPrincipalEntityTest
Tests run: 4, Failures: 0, Errors: 0, Skipped: 0, Time elapsed: 0.328 sec - in io.dropwizard.auth.principal.NoAuthPolymorphicPrincipalEntityTest
Running io.dropwizard.auth.AuthFilterTest
Tests run: 1, Failures: 0, Errors: 0, Skipped: 0, Time elapsed: 0.041 sec - in io.dropwizard.auth.AuthFilterTest
Running io.dropwizard.auth.oauth.OAuthCustomProviderTest
Tests run: 11, Failures: 0, Errors: 0, Skipped: 0, Time elapsed: 0.636 sec - in io.dropwizard.auth.oauth.OAuthCustomProviderTest
Running io.dropwizard.auth.oauth.OAuthProviderTest
Tests run: 12, Failures: 0, Errors: 0, Skipped: 0, Time elapsed: 0.575 sec - in io.dropwizard.auth.oauth.OAuthProviderTest
Running io.dropwizard.auth.basic.BasicCredentialsTest
Tests run: 5, Failures: 0, Errors: 0, Skipped: 0, Time elapsed: 0.003 sec - in io.dropwizard.auth.basic.BasicCredentialsTest
Running io.dropwizard.auth.basic.BasicAuthProviderTest
Tests run: 11, Failures: 0, Errors: 0, Skipped: 0, Time elapsed: 0.573 sec - in io.dropwizard.auth.basic.BasicAuthProviderTest
Running io.dropwizard.auth.basic.BasicCustomAuthProviderTest
Tests run: 11, Failures: 0, Errors: 0, Skipped: 0, Time elapsed: 0.462 sec - in io.dropwizard.auth.basic.BasicCustomAuthProviderTest

Results :

Tests run: 93, Failures: 0, Errors: 0, Skipped: 0

[INFO] 
[INFO] --- maven-jar-plugin:3.0.2:jar (default-jar) @ dropwizard-auth ---
[INFO] Building jar: /builds/workspace/Dropwizard/dropwizard-auth/target/dropwizard-auth-1.1.0-SNAPSHOT.jar
[INFO] 
[INFO] >>> maven-source-plugin:3.0.1:jar (attach-sources) > generate-sources @ dropwizard-auth >>>
[INFO] 
[INFO] --- spoon-maven-plugin:3.1:generate (default) @ dropwizard-auth ---
[INFO] Running in NOCLASSPATH mode (doc: http://spoon.gforge.inria.fr/launcher.html).
[INFO] Running in NOCLASSPATH mode (doc: http://spoon.gforge.inria.fr/launcher.html).
[INFO] Spoon version 8.1.0-SNAPSHOT
[INFO] running Spoon...
[INFO] start processing...
[INFO] spoon.processing.SpoonTagger
[INFO] spoon.support.JavaOutputProcessor
[INFO] end of processing: 
[INFO] no errors, no warnings
[INFO] 
[INFO] <<< maven-source-plugin:3.0.1:jar (attach-sources) < generate-sources @ dropwizard-auth <<<
[INFO] 
[INFO] --- maven-source-plugin:3.0.1:jar (attach-sources) @ dropwizard-auth ---
[INFO] Building jar: /builds/workspace/Dropwizard/dropwizard-auth/target/dropwizard-auth-1.1.0-SNAPSHOT-sources.jar
[INFO] 
[INFO] --- maven-javadoc-plugin:2.10.4:jar (attach-javadocs) @ dropwizard-auth ---
[INFO] 
24 warnings
[WARNING] Javadoc Warnings
[WARNING] Picked up JAVA_TOOL_OPTIONS: -Dfile.encoding=UTF8
[WARNING] /builds/workspace/Dropwizard/dropwizard-auth/target/generated-sources/spoon/io/dropwizard/auth/AuthDynamicFeature.java:22: warning - Tag @link: reference not found: FeatureContext#register(Class)
[WARNING] /builds/workspace/Dropwizard/dropwizard-auth/target/generated-sources/spoon/io/dropwizard/auth/AuthDynamicFeature.java:22: warning - Tag @link: reference not found: FeatureContext#register(Object)
[WARNING] /builds/workspace/Dropwizard/dropwizard-auth/target/generated-sources/spoon/io/dropwizard/auth/Authenticator.java:26: warning - Tag @link: reference not found: Optional#of(Object)
[WARNING] /builds/workspace/Dropwizard/dropwizard-auth/target/generated-sources/spoon/io/dropwizard/auth/Authenticator.java:26: warning - Tag @link: reference not found: Optional#empty()
[WARNING] /builds/workspace/Dropwizard/dropwizard-auth/target/generated-sources/spoon/io/dropwizard/auth/AuthFilter.java:131: warning - Tag @link: reference not found: SecurityContext
[WARNING] /builds/workspace/Dropwizard/dropwizard-auth/target/generated-sources/spoon/io/dropwizard/auth/Authorizer.java:18: warning - Tag @link: reference not found: Principal
[WARNING] /builds/workspace/Dropwizard/dropwizard-auth/target/generated-sources/spoon/io/dropwizard/auth/AuthValueFactoryProvider.java:75: warning - Tag @link: reference not found: AuthInjectionResolver
[WARNING] /builds/workspace/Dropwizard/dropwizard-auth/target/generated-sources/spoon/io/dropwizard/auth/AuthValueFactoryProvider.java:42: warning - Tag @link: reference not found: T
[WARNING] /builds/workspace/Dropwizard/dropwizard-auth/target/generated-sources/spoon/io/dropwizard/auth/AuthValueFactoryProvider.java:75: warning - Tag @link: reference not found: AuthInjectionResolver
[WARNING] /builds/workspace/Dropwizard/dropwizard-auth/target/generated-sources/spoon/io/dropwizard/auth/CachingAuthenticator.java:28: warning - Tag @link: reference not found: CacheBuilderSpec
[WARNING] /builds/workspace/Dropwizard/dropwizard-auth/target/generated-sources/spoon/io/dropwizard/auth/CachingAuthenticator.java:42: warning - Tag @link: reference not found: CacheBuilder
[WARNING] /builds/workspace/Dropwizard/dropwizard-auth/target/generated-sources/spoon/io/dropwizard/auth/Authenticator.java:26: warning - Tag @link: reference not found: Optional#of(Object)
[WARNING] /builds/workspace/Dropwizard/dropwizard-auth/target/generated-sources/spoon/io/dropwizard/auth/Authenticator.java:26: warning - Tag @link: reference not found: Optional#empty()
[WARNING] /builds/workspace/Dropwizard/dropwizard-auth/target/generated-sources/spoon/io/dropwizard/auth/CachingAuthorizer.java:41: warning - Tag @link: reference not found: CacheBuilderSpec
[WARNING] /builds/workspace/Dropwizard/dropwizard-auth/target/generated-sources/spoon/io/dropwizard/auth/CachingAuthorizer.java:55: warning - Tag @link: reference not found: CacheBuilder
[WARNING] /builds/workspace/Dropwizard/dropwizard-auth/target/generated-sources/spoon/io/dropwizard/auth/Authorizer.java:18: warning - Tag @link: reference not found: Principal
[WARNING] /builds/workspace/Dropwizard/dropwizard-auth/target/generated-sources/spoon/io/dropwizard/auth/Authorizer.java:18: warning - Tag @link: reference not found: Principal
[WARNING] /builds/workspace/Dropwizard/dropwizard-auth/target/generated-sources/spoon/io/dropwizard/auth/PolymorphicAuthValueFactoryProvider.java:77: warning - Tag @link: reference not found: AuthInjectionResolver
[WARNING] /builds/workspace/Dropwizard/dropwizard-auth/target/generated-sources/spoon/io/dropwizard/auth/PolymorphicAuthValueFactoryProvider.java:43: warning - Tag @link: reference not found: T
[WARNING] /builds/workspace/Dropwizard/dropwizard-auth/target/generated-sources/spoon/io/dropwizard/auth/PolymorphicAuthValueFactoryProvider.java:77: warning - Tag @link: reference not found: AuthInjectionResolver
[WARNING] /builds/workspace/Dropwizard/dropwizard-auth/target/generated-sources/spoon/io/dropwizard/auth/AuthValueFactoryProvider.java:75: warning - Tag @link: reference not found: AuthInjectionResolver
[WARNING] /builds/workspace/Dropwizard/dropwizard-auth/target/generated-sources/spoon/io/dropwizard/auth/PolymorphicAuthValueFactoryProvider.java:77: warning - Tag @link: reference not found: AuthInjectionResolver
[WARNING] /builds/workspace/Dropwizard/dropwizard-auth/target/generated-sources/spoon/io/dropwizard/auth/AuthValueFactoryProvider.java:75: warning - Tag @link: reference not found: AuthInjectionResolver
[WARNING] /builds/workspace/Dropwizard/dropwizard-auth/target/generated-sources/spoon/io/dropwizard/auth/PolymorphicAuthValueFactoryProvider.java:77: warning - Tag @link: reference not found: AuthInjectionResolver
[INFO] Building jar: /builds/workspace/Dropwizard/dropwizard-auth/target/dropwizard-auth-1.1.0-SNAPSHOT-javadoc.jar
[INFO] 
[INFO] >>> findbugs-maven-plugin:3.0.4:check (default) > :findbugs @ dropwizard-auth >>>
[INFO] 
[INFO] --- findbugs-maven-plugin:3.0.4:findbugs (findbugs) @ dropwizard-auth ---
[INFO] Fork Value is true
     [java] Picked up JAVA_TOOL_OPTIONS: -Dfile.encoding=UTF8
[INFO] Done FindBugs Analysis....
[INFO] 
[INFO] <<< findbugs-maven-plugin:3.0.4:check (default) < :findbugs @ dropwizard-auth <<<
[INFO] 
[INFO] --- findbugs-maven-plugin:3.0.4:check (default) @ dropwizard-auth ---
[INFO] BugInstance size is 0
[INFO] Error size is 0
[INFO] No errors/warnings found
[INFO] 
[INFO] --- maven-install-plugin:2.5.2:install (default-install) @ dropwizard-auth ---
[INFO] Installing /builds/workspace/Dropwizard/dropwizard-auth/target/dropwizard-auth-1.1.0-SNAPSHOT.jar to /builds/.m2/repository/io/dropwizard/dropwizard-auth/1.1.0-SNAPSHOT/dropwizard-auth-1.1.0-SNAPSHOT.jar
[INFO] Installing /builds/workspace/Dropwizard/dropwizard-auth/pom.xml to /builds/.m2/repository/io/dropwizard/dropwizard-auth/1.1.0-SNAPSHOT/dropwizard-auth-1.1.0-SNAPSHOT.pom
[INFO] Installing /builds/workspace/Dropwizard/dropwizard-auth/target/dropwizard-auth-1.1.0-SNAPSHOT-sources.jar to /builds/.m2/repository/io/dropwizard/dropwizard-auth/1.1.0-SNAPSHOT/dropwizard-auth-1.1.0-SNAPSHOT-sources.jar
[INFO] Installing /builds/workspace/Dropwizard/dropwizard-auth/target/dropwizard-auth-1.1.0-SNAPSHOT-javadoc.jar to /builds/.m2/repository/io/dropwizard/dropwizard-auth/1.1.0-SNAPSHOT/dropwizard-auth-1.1.0-SNAPSHOT-javadoc.jar
[INFO]                                                                         
[INFO] ------------------------------------------------------------------------
[INFO] Building Dropwizard Multipart Form Support 1.1.0-SNAPSHOT
[INFO] ------------------------------------------------------------------------
[INFO] 
[INFO] --- maven-clean-plugin:3.0.0:clean (default-clean) @ dropwizard-forms ---
[INFO] Deleting /builds/workspace/Dropwizard/dropwizard-forms/target
[INFO] 
[INFO] --- spoon-maven-plugin:3.1:generate (default) @ dropwizard-forms ---
[INFO] Running in NOCLASSPATH mode (doc: http://spoon.gforge.inria.fr/launcher.html).
[INFO] Running in NOCLASSPATH mode (doc: http://spoon.gforge.inria.fr/launcher.html).
[INFO] Spoon version 8.1.0-SNAPSHOT
[INFO] running Spoon...
[INFO] start processing...
[INFO] spoon.processing.SpoonTagger
[INFO] spoon.support.JavaOutputProcessor
[INFO] end of processing: 
[INFO] no errors, no warnings
[INFO] 
[INFO] --- maven-resources-plugin:3.0.1:resources (default-resources) @ dropwizard-forms ---
[INFO] Using 'UTF-8' encoding to copy filtered resources.
[INFO] skip non existing resourceDirectory /builds/workspace/Dropwizard/dropwizard-forms/src/main/resources
[INFO] 
[INFO] --- maven-compiler-plugin:3.5.1:compile (default-compile) @ dropwizard-forms ---
[INFO] Changes detected - recompiling the module!
[INFO] Compiling 2 source files to /builds/workspace/Dropwizard/dropwizard-forms/target/classes
[INFO] 
[INFO] --- maven-resources-plugin:3.0.1:testResources (default-testResources) @ dropwizard-forms ---
[INFO] Using 'UTF-8' encoding to copy filtered resources.
[INFO] skip non existing resourceDirectory /builds/workspace/Dropwizard/dropwizard-forms/src/test/resources
[INFO] 
[INFO] --- maven-compiler-plugin:3.5.1:testCompile (default-testCompile) @ dropwizard-forms ---
[INFO] Changes detected - recompiling the module!
[INFO] Compiling 1 source file to /builds/workspace/Dropwizard/dropwizard-forms/target/test-classes
[INFO] 
[INFO] --- maven-surefire-plugin:2.19.1:test (default-test) @ dropwizard-forms ---

-------------------------------------------------------
 T E S T S
-------------------------------------------------------
Picked up JAVA_TOOL_OPTIONS: -Dfile.encoding=UTF8
Running io.dropwizard.forms.MultiPartBundleTest
19:33:45.600 [main] DEBUG org.eclipse.jetty.util.log - Logging to Logger[org.eclipse.jetty.util.log] via org.eclipse.jetty.util.log.Slf4jLog
19:33:45.605 [main] INFO org.eclipse.jetty.util.log - Logging initialized @679ms
19:33:45.614 [main] DEBUG org.eclipse.jetty.util.DecoratedObjectFactory - Adding Decorator: org.eclipse.jetty.util.DeprecationWarning@5b12b668
19:33:45.619 [main] DEBUG org.eclipse.jetty.util.component.ContainerLifeCycle - i.d.j.MutableServletContextHandler@233795b6{/,null,null} added {org.eclipse.jetty.servlet.ServletHandler@3eb738bb,MANAGED}
19:33:45.621 [main] DEBUG org.eclipse.jetty.util.DecoratedObjectFactory - Adding Decorator: org.eclipse.jetty.util.DeprecationWarning@4116aac9
19:33:45.621 [main] DEBUG org.eclipse.jetty.util.component.ContainerLifeCycle - i.d.j.MutableServletContextHandler@62ddbd7e{/,null,null} added {org.eclipse.jetty.servlet.ServletHandler@74e52ef6,MANAGED}
19:33:45.633 [main] DEBUG org.eclipse.jetty.util.component.ContainerLifeCycle - org.eclipse.jetty.servlet.ServletHandler@74e52ef6 added {tasks@6907b8e==io.dropwizard.servlets.tasks.TaskServlet,1,true,AUTO}
19:33:45.635 [main] DEBUG org.eclipse.jetty.util.component.ContainerLifeCycle - org.eclipse.jetty.servlet.ServletHandler@74e52ef6 added {[/tasks/*]=>tasks,POJO}
Tests run: 1, Failures: 0, Errors: 0, Skipped: 0, Time elapsed: 0.588 sec - in io.dropwizard.forms.MultiPartBundleTest

Results :

Tests run: 1, Failures: 0, Errors: 0, Skipped: 0

[INFO] 
[INFO] --- maven-jar-plugin:3.0.2:jar (default-jar) @ dropwizard-forms ---
[INFO] Building jar: /builds/workspace/Dropwizard/dropwizard-forms/target/dropwizard-forms-1.1.0-SNAPSHOT.jar
[INFO] 
[INFO] >>> maven-source-plugin:3.0.1:jar (attach-sources) > generate-sources @ dropwizard-forms >>>
[INFO] 
[INFO] --- spoon-maven-plugin:3.1:generate (default) @ dropwizard-forms ---
[INFO] Running in NOCLASSPATH mode (doc: http://spoon.gforge.inria.fr/launcher.html).
[INFO] Running in NOCLASSPATH mode (doc: http://spoon.gforge.inria.fr/launcher.html).
[INFO] Spoon version 8.1.0-SNAPSHOT
[INFO] running Spoon...
[INFO] start processing...
[INFO] spoon.processing.SpoonTagger
[INFO] spoon.support.JavaOutputProcessor
[INFO] end of processing: 
[INFO] no errors, no warnings
[INFO] 
[INFO] <<< maven-source-plugin:3.0.1:jar (attach-sources) < generate-sources @ dropwizard-forms <<<
[INFO] 
[INFO] --- maven-source-plugin:3.0.1:jar (attach-sources) @ dropwizard-forms ---
[INFO] Building jar: /builds/workspace/Dropwizard/dropwizard-forms/target/dropwizard-forms-1.1.0-SNAPSHOT-sources.jar
[INFO] 
[INFO] --- maven-javadoc-plugin:2.10.4:jar (attach-javadocs) @ dropwizard-forms ---
[INFO] 
1 warning
[WARNING] Javadoc Warnings
[WARNING] Picked up JAVA_TOOL_OPTIONS: -Dfile.encoding=UTF8
[WARNING] /builds/workspace/Dropwizard/dropwizard-forms/target/generated-sources/spoon/io/dropwizard/forms/MultiPartBundle.java:9: warning - Tag @see: reference not found: org.glassfish.jersey.media.multipart.MultiPartFeature
[INFO] Building jar: /builds/workspace/Dropwizard/dropwizard-forms/target/dropwizard-forms-1.1.0-SNAPSHOT-javadoc.jar
[INFO] 
[INFO] >>> findbugs-maven-plugin:3.0.4:check (default) > :findbugs @ dropwizard-forms >>>
[INFO] 
[INFO] --- findbugs-maven-plugin:3.0.4:findbugs (findbugs) @ dropwizard-forms ---
[INFO] Fork Value is true
     [java] Picked up JAVA_TOOL_OPTIONS: -Dfile.encoding=UTF8
[INFO] Done FindBugs Analysis....
[INFO] 
[INFO] <<< findbugs-maven-plugin:3.0.4:check (default) < :findbugs @ dropwizard-forms <<<
[INFO] 
[INFO] --- findbugs-maven-plugin:3.0.4:check (default) @ dropwizard-forms ---
[INFO] BugInstance size is 0
[INFO] Error size is 0
[INFO] No errors/warnings found
[INFO] 
[INFO] --- maven-install-plugin:2.5.2:install (default-install) @ dropwizard-forms ---
[INFO] Installing /builds/workspace/Dropwizard/dropwizard-forms/target/dropwizard-forms-1.1.0-SNAPSHOT.jar to /builds/.m2/repository/io/dropwizard/dropwizard-forms/1.1.0-SNAPSHOT/dropwizard-forms-1.1.0-SNAPSHOT.jar
[INFO] Installing /builds/workspace/Dropwizard/dropwizard-forms/pom.xml to /builds/.m2/repository/io/dropwizard/dropwizard-forms/1.1.0-SNAPSHOT/dropwizard-forms-1.1.0-SNAPSHOT.pom
[INFO] Installing /builds/workspace/Dropwizard/dropwizard-forms/target/dropwizard-forms-1.1.0-SNAPSHOT-sources.jar to /builds/.m2/repository/io/dropwizard/dropwizard-forms/1.1.0-SNAPSHOT/dropwizard-forms-1.1.0-SNAPSHOT-sources.jar
[INFO] Installing /builds/workspace/Dropwizard/dropwizard-forms/target/dropwizard-forms-1.1.0-SNAPSHOT-javadoc.jar to /builds/.m2/repository/io/dropwizard/dropwizard-forms/1.1.0-SNAPSHOT/dropwizard-forms-1.1.0-SNAPSHOT-javadoc.jar
[INFO]                                                                         
[INFO] ------------------------------------------------------------------------
[INFO] Building Dropwizard Views 1.1.0-SNAPSHOT
[INFO] ------------------------------------------------------------------------
[INFO] 
[INFO] --- maven-clean-plugin:3.0.0:clean (default-clean) @ dropwizard-views ---
[INFO] Deleting /builds/workspace/Dropwizard/dropwizard-views/target
[INFO] 
[INFO] --- spoon-maven-plugin:3.1:generate (default) @ dropwizard-views ---
[INFO] Running in NOCLASSPATH mode (doc: http://spoon.gforge.inria.fr/launcher.html).
[INFO] Running in NOCLASSPATH mode (doc: http://spoon.gforge.inria.fr/launcher.html).
[INFO] Spoon version 8.1.0-SNAPSHOT
[INFO] running Spoon...
[INFO] start processing...
[INFO] spoon.processing.SpoonTagger
[INFO] spoon.support.JavaOutputProcessor
[INFO] end of processing: 
[INFO] no errors, no warnings
[INFO] 
[INFO] --- maven-resources-plugin:3.0.1:resources (default-resources) @ dropwizard-views ---
[INFO] Using 'UTF-8' encoding to copy filtered resources.
[INFO] skip non existing resourceDirectory /builds/workspace/Dropwizard/dropwizard-views/src/main/resources
[INFO] 
[INFO] --- maven-compiler-plugin:3.5.1:compile (default-compile) @ dropwizard-views ---
[INFO] Changes detected - recompiling the module!
[INFO] Compiling 7 source files to /builds/workspace/Dropwizard/dropwizard-views/target/classes
[INFO] 
[INFO] --- maven-resources-plugin:3.0.1:testResources (default-testResources) @ dropwizard-views ---
[INFO] Using 'UTF-8' encoding to copy filtered resources.
[INFO] Copying 1 resource
[INFO] 
[INFO] --- maven-compiler-plugin:3.5.1:testCompile (default-testCompile) @ dropwizard-views ---
[INFO] Changes detected - recompiling the module!
[INFO] Compiling 2 source files to /builds/workspace/Dropwizard/dropwizard-views/target/test-classes
[INFO] 
[INFO] --- maven-surefire-plugin:2.19.1:test (default-test) @ dropwizard-views ---

-------------------------------------------------------
 T E S T S
-------------------------------------------------------
Picked up JAVA_TOOL_OPTIONS: -Dfile.encoding=UTF8
Running io.dropwizard.views.ViewBundleTest
Tests run: 2, Failures: 0, Errors: 0, Skipped: 0, Time elapsed: 1.042 sec - in io.dropwizard.views.ViewBundleTest
Running io.dropwizard.views.ViewTest
Tests run: 1, Failures: 0, Errors: 0, Skipped: 0, Time elapsed: 0.005 sec - in io.dropwizard.views.ViewTest

Results :

Tests run: 3, Failures: 0, Errors: 0, Skipped: 0

[INFO] 
[INFO] --- maven-jar-plugin:3.0.2:jar (default-jar) @ dropwizard-views ---
[INFO] Building jar: /builds/workspace/Dropwizard/dropwizard-views/target/dropwizard-views-1.1.0-SNAPSHOT.jar
[INFO] 
[INFO] >>> maven-source-plugin:3.0.1:jar (attach-sources) > generate-sources @ dropwizard-views >>>
[INFO] 
[INFO] --- spoon-maven-plugin:3.1:generate (default) @ dropwizard-views ---
[INFO] Running in NOCLASSPATH mode (doc: http://spoon.gforge.inria.fr/launcher.html).
[INFO] Running in NOCLASSPATH mode (doc: http://spoon.gforge.inria.fr/launcher.html).
[INFO] Spoon version 8.1.0-SNAPSHOT
[INFO] running Spoon...
[INFO] start processing...
[INFO] spoon.processing.SpoonTagger
[INFO] spoon.support.JavaOutputProcessor
[INFO] end of processing: 
[INFO] no errors, no warnings
[INFO] 
[INFO] <<< maven-source-plugin:3.0.1:jar (attach-sources) < generate-sources @ dropwizard-views <<<
[INFO] 
[INFO] --- maven-source-plugin:3.0.1:jar (attach-sources) @ dropwizard-views ---
[INFO] Building jar: /builds/workspace/Dropwizard/dropwizard-views/target/dropwizard-views-1.1.0-SNAPSHOT-sources.jar
[INFO] 
[INFO] --- maven-javadoc-plugin:2.10.4:jar (attach-javadocs) @ dropwizard-views ---
[WARNING] Javadoc Warnings
[WARNING] Picked up JAVA_TOOL_OPTIONS: -Dfile.encoding=UTF8
[INFO] Building jar: /builds/workspace/Dropwizard/dropwizard-views/target/dropwizard-views-1.1.0-SNAPSHOT-javadoc.jar
[INFO] 
[INFO] >>> findbugs-maven-plugin:3.0.4:check (default) > :findbugs @ dropwizard-views >>>
[INFO] 
[INFO] --- findbugs-maven-plugin:3.0.4:findbugs (findbugs) @ dropwizard-views ---
[INFO] Fork Value is true
     [java] Picked up JAVA_TOOL_OPTIONS: -Dfile.encoding=UTF8
[INFO] Done FindBugs Analysis....
[INFO] 
[INFO] <<< findbugs-maven-plugin:3.0.4:check (default) < :findbugs @ dropwizard-views <<<
[INFO] 
[INFO] --- findbugs-maven-plugin:3.0.4:check (default) @ dropwizard-views ---
[INFO] BugInstance size is 0
[INFO] Error size is 0
[INFO] No errors/warnings found
[INFO] 
[INFO] --- maven-install-plugin:2.5.2:install (default-install) @ dropwizard-views ---
[INFO] Installing /builds/workspace/Dropwizard/dropwizard-views/target/dropwizard-views-1.1.0-SNAPSHOT.jar to /builds/.m2/repository/io/dropwizard/dropwizard-views/1.1.0-SNAPSHOT/dropwizard-views-1.1.0-SNAPSHOT.jar
[INFO] Installing /builds/workspace/Dropwizard/dropwizard-views/pom.xml to /builds/.m2/repository/io/dropwizard/dropwizard-views/1.1.0-SNAPSHOT/dropwizard-views-1.1.0-SNAPSHOT.pom
[INFO] Installing /builds/workspace/Dropwizard/dropwizard-views/target/dropwizard-views-1.1.0-SNAPSHOT-sources.jar to /builds/.m2/repository/io/dropwizard/dropwizard-views/1.1.0-SNAPSHOT/dropwizard-views-1.1.0-SNAPSHOT-sources.jar
[INFO] Installing /builds/workspace/Dropwizard/dropwizard-views/target/dropwizard-views-1.1.0-SNAPSHOT-javadoc.jar to /builds/.m2/repository/io/dropwizard/dropwizard-views/1.1.0-SNAPSHOT/dropwizard-views-1.1.0-SNAPSHOT-javadoc.jar
[INFO]                                                                         
[INFO] ------------------------------------------------------------------------
[INFO] Building Dropwizard Freemarker Views 1.1.0-SNAPSHOT
[INFO] ------------------------------------------------------------------------
[INFO] 
[INFO] --- maven-clean-plugin:3.0.0:clean (default-clean) @ dropwizard-views-freemarker ---
[INFO] Deleting /builds/workspace/Dropwizard/dropwizard-views-freemarker/target
[INFO] 
[INFO] --- spoon-maven-plugin:3.1:generate (default) @ dropwizard-views-freemarker ---
[INFO] Running in NOCLASSPATH mode (doc: http://spoon.gforge.inria.fr/launcher.html).
[INFO] Running in NOCLASSPATH mode (doc: http://spoon.gforge.inria.fr/launcher.html).
[INFO] Spoon version 8.1.0-SNAPSHOT
[INFO] running Spoon...
[INFO] start processing...
[INFO] spoon.processing.SpoonTagger
[INFO] spoon.support.JavaOutputProcessor
[INFO] end of processing: 
[INFO] no errors, no warnings
[INFO] 
[INFO] --- maven-resources-plugin:3.0.1:resources (default-resources) @ dropwizard-views-freemarker ---
[INFO] Using 'UTF-8' encoding to copy filtered resources.
[INFO] Copying 1 resource
[INFO] 
[INFO] --- maven-compiler-plugin:3.5.1:compile (default-compile) @ dropwizard-views-freemarker ---
[INFO] Changes detected - recompiling the module!
[INFO] Compiling 2 source files to /builds/workspace/Dropwizard/dropwizard-views-freemarker/target/classes
[INFO] 
[INFO] --- maven-resources-plugin:3.0.1:testResources (default-testResources) @ dropwizard-views-freemarker ---
[INFO] Using 'UTF-8' encoding to copy filtered resources.
[INFO] Copying 5 resources
[INFO] 
[INFO] --- maven-compiler-plugin:3.5.1:testCompile (default-testCompile) @ dropwizard-views-freemarker ---
[INFO] Changes detected - recompiling the module!
[INFO] Compiling 6 source files to /builds/workspace/Dropwizard/dropwizard-views-freemarker/target/test-classes
[INFO] 
[INFO] --- maven-surefire-plugin:2.19.1:test (default-test) @ dropwizard-views-freemarker ---

-------------------------------------------------------
 T E S T S
-------------------------------------------------------
Picked up JAVA_TOOL_OPTIONS: -Dfile.encoding=UTF8
Running io.dropwizard.views.freemarker.MultipleContentTypeTest
Tests run: 4, Failures: 0, Errors: 0, Skipped: 0, Time elapsed: 1.914 sec - in io.dropwizard.views.freemarker.MultipleContentTypeTest
Running io.dropwizard.views.freemarker.FreemarkerViewRendererTest
Tests run: 4, Failures: 0, Errors: 0, Skipped: 0, Time elapsed: 0.425 sec - in io.dropwizard.views.freemarker.FreemarkerViewRendererTest

Results :

Tests run: 8, Failures: 0, Errors: 0, Skipped: 0

[INFO] 
[INFO] --- maven-jar-plugin:3.0.2:jar (default-jar) @ dropwizard-views-freemarker ---
[INFO] Building jar: /builds/workspace/Dropwizard/dropwizard-views-freemarker/target/dropwizard-views-freemarker-1.1.0-SNAPSHOT.jar
[INFO] 
[INFO] >>> maven-source-plugin:3.0.1:jar (attach-sources) > generate-sources @ dropwizard-views-freemarker >>>
[INFO] 
[INFO] --- spoon-maven-plugin:3.1:generate (default) @ dropwizard-views-freemarker ---
[INFO] Running in NOCLASSPATH mode (doc: http://spoon.gforge.inria.fr/launcher.html).
[INFO] Running in NOCLASSPATH mode (doc: http://spoon.gforge.inria.fr/launcher.html).
[INFO] Spoon version 8.1.0-SNAPSHOT
[INFO] running Spoon...
[INFO] start processing...
[INFO] spoon.processing.SpoonTagger
[INFO] spoon.support.JavaOutputProcessor
[INFO] end of processing: 
[INFO] no errors, no warnings
[INFO] 
[INFO] <<< maven-source-plugin:3.0.1:jar (attach-sources) < generate-sources @ dropwizard-views-freemarker <<<
[INFO] 
[INFO] --- maven-source-plugin:3.0.1:jar (attach-sources) @ dropwizard-views-freemarker ---
[INFO] Building jar: /builds/workspace/Dropwizard/dropwizard-views-freemarker/target/dropwizard-views-freemarker-1.1.0-SNAPSHOT-sources.jar
[INFO] 
[INFO] --- maven-javadoc-plugin:2.10.4:jar (attach-javadocs) @ dropwizard-views-freemarker ---
[WARNING] Javadoc Warnings
[WARNING] Picked up JAVA_TOOL_OPTIONS: -Dfile.encoding=UTF8
[INFO] Building jar: /builds/workspace/Dropwizard/dropwizard-views-freemarker/target/dropwizard-views-freemarker-1.1.0-SNAPSHOT-javadoc.jar
[INFO] 
[INFO] >>> findbugs-maven-plugin:3.0.4:check (default) > :findbugs @ dropwizard-views-freemarker >>>
[INFO] 
[INFO] --- findbugs-maven-plugin:3.0.4:findbugs (findbugs) @ dropwizard-views-freemarker ---
[INFO] Fork Value is true
     [java] Picked up JAVA_TOOL_OPTIONS: -Dfile.encoding=UTF8
[INFO] Done FindBugs Analysis....
[INFO] 
[INFO] <<< findbugs-maven-plugin:3.0.4:check (default) < :findbugs @ dropwizard-views-freemarker <<<
[INFO] 
[INFO] --- findbugs-maven-plugin:3.0.4:check (default) @ dropwizard-views-freemarker ---
[INFO] BugInstance size is 0
[INFO] Error size is 0
[INFO] No errors/warnings found
[INFO] 
[INFO] --- maven-install-plugin:2.5.2:install (default-install) @ dropwizard-views-freemarker ---
[INFO] Installing /builds/workspace/Dropwizard/dropwizard-views-freemarker/target/dropwizard-views-freemarker-1.1.0-SNAPSHOT.jar to /builds/.m2/repository/io/dropwizard/dropwizard-views-freemarker/1.1.0-SNAPSHOT/dropwizard-views-freemarker-1.1.0-SNAPSHOT.jar
[INFO] Installing /builds/workspace/Dropwizard/dropwizard-views-freemarker/pom.xml to /builds/.m2/repository/io/dropwizard/dropwizard-views-freemarker/1.1.0-SNAPSHOT/dropwizard-views-freemarker-1.1.0-SNAPSHOT.pom
[INFO] Installing /builds/workspace/Dropwizard/dropwizard-views-freemarker/target/dropwizard-views-freemarker-1.1.0-SNAPSHOT-sources.jar to /builds/.m2/repository/io/dropwizard/dropwizard-views-freemarker/1.1.0-SNAPSHOT/dropwizard-views-freemarker-1.1.0-SNAPSHOT-sources.jar
[INFO] Installing /builds/workspace/Dropwizard/dropwizard-views-freemarker/target/dropwizard-views-freemarker-1.1.0-SNAPSHOT-javadoc.jar to /builds/.m2/repository/io/dropwizard/dropwizard-views-freemarker/1.1.0-SNAPSHOT/dropwizard-views-freemarker-1.1.0-SNAPSHOT-javadoc.jar
[INFO]                                                                         
[INFO] ------------------------------------------------------------------------
[INFO] Building Dropwizard Mustache Views 1.1.0-SNAPSHOT
[INFO] ------------------------------------------------------------------------
[INFO] 
[INFO] --- maven-clean-plugin:3.0.0:clean (default-clean) @ dropwizard-views-mustache ---
[INFO] Deleting /builds/workspace/Dropwizard/dropwizard-views-mustache/target
[INFO] 
[INFO] --- spoon-maven-plugin:3.1:generate (default) @ dropwizard-views-mustache ---
[INFO] Running in NOCLASSPATH mode (doc: http://spoon.gforge.inria.fr/launcher.html).
[INFO] Running in NOCLASSPATH mode (doc: http://spoon.gforge.inria.fr/launcher.html).
[INFO] Spoon version 8.1.0-SNAPSHOT
[INFO] running Spoon...
[INFO] start processing...
[INFO] spoon.processing.SpoonTagger
[INFO] spoon.support.JavaOutputProcessor
[INFO] end of processing: 
[INFO] no errors, no warnings
[INFO] 
[INFO] --- maven-resources-plugin:3.0.1:resources (default-resources) @ dropwizard-views-mustache ---
[INFO] Using 'UTF-8' encoding to copy filtered resources.
[INFO] Copying 1 resource
[INFO] 
[INFO] --- maven-compiler-plugin:3.5.1:compile (default-compile) @ dropwizard-views-mustache ---
[INFO] Changes detected - recompiling the module!
[INFO] Compiling 3 source files to /builds/workspace/Dropwizard/dropwizard-views-mustache/target/classes
[INFO] 
[INFO] --- maven-resources-plugin:3.0.1:testResources (default-testResources) @ dropwizard-views-mustache ---
[INFO] Using 'UTF-8' encoding to copy filtered resources.
[INFO] Copying 4 resources
[INFO] 
[INFO] --- maven-compiler-plugin:3.5.1:testCompile (default-testCompile) @ dropwizard-views-mustache ---
[INFO] Changes detected - recompiling the module!
[INFO] Compiling 5 source files to /builds/workspace/Dropwizard/dropwizard-views-mustache/target/test-classes
[INFO] 
[INFO] --- maven-surefire-plugin:2.19.1:test (default-test) @ dropwizard-views-mustache ---

-------------------------------------------------------
 T E S T S
-------------------------------------------------------
Picked up JAVA_TOOL_OPTIONS: -Dfile.encoding=UTF8
Running io.dropwizard.views.mustache.MustacheViewRendererTest
Tests run: 6, Failures: 0, Errors: 0, Skipped: 0, Time elapsed: 3.56 sec - in io.dropwizard.views.mustache.MustacheViewRendererTest

Results :

Tests run: 6, Failures: 0, Errors: 0, Skipped: 0

[INFO] 
[INFO] --- maven-jar-plugin:3.0.2:jar (default-jar) @ dropwizard-views-mustache ---
[INFO] Building jar: /builds/workspace/Dropwizard/dropwizard-views-mustache/target/dropwizard-views-mustache-1.1.0-SNAPSHOT.jar
[INFO] 
[INFO] >>> maven-source-plugin:3.0.1:jar (attach-sources) > generate-sources @ dropwizard-views-mustache >>>
[INFO] 
[INFO] --- spoon-maven-plugin:3.1:generate (default) @ dropwizard-views-mustache ---
[INFO] Running in NOCLASSPATH mode (doc: http://spoon.gforge.inria.fr/launcher.html).
[INFO] Running in NOCLASSPATH mode (doc: http://spoon.gforge.inria.fr/launcher.html).
[INFO] Spoon version 8.1.0-SNAPSHOT
[INFO] running Spoon...
[INFO] start processing...
[INFO] spoon.processing.SpoonTagger
[INFO] spoon.support.JavaOutputProcessor
[INFO] end of processing: 
[INFO] no errors, no warnings
[INFO] 
[INFO] <<< maven-source-plugin:3.0.1:jar (attach-sources) < generate-sources @ dropwizard-views-mustache <<<
[INFO] 
[INFO] --- maven-source-plugin:3.0.1:jar (attach-sources) @ dropwizard-views-mustache ---
[INFO] Building jar: /builds/workspace/Dropwizard/dropwizard-views-mustache/target/dropwizard-views-mustache-1.1.0-SNAPSHOT-sources.jar
[INFO] 
[INFO] --- maven-javadoc-plugin:2.10.4:jar (attach-javadocs) @ dropwizard-views-mustache ---
[WARNING] Javadoc Warnings
[WARNING] Picked up JAVA_TOOL_OPTIONS: -Dfile.encoding=UTF8
[INFO] Building jar: /builds/workspace/Dropwizard/dropwizard-views-mustache/target/dropwizard-views-mustache-1.1.0-SNAPSHOT-javadoc.jar
[INFO] 
[INFO] >>> findbugs-maven-plugin:3.0.4:check (default) > :findbugs @ dropwizard-views-mustache >>>
[INFO] 
[INFO] --- findbugs-maven-plugin:3.0.4:findbugs (findbugs) @ dropwizard-views-mustache ---
[INFO] Fork Value is true
     [java] Picked up JAVA_TOOL_OPTIONS: -Dfile.encoding=UTF8
[INFO] Done FindBugs Analysis....
[INFO] 
[INFO] <<< findbugs-maven-plugin:3.0.4:check (default) < :findbugs @ dropwizard-views-mustache <<<
[INFO] 
[INFO] --- findbugs-maven-plugin:3.0.4:check (default) @ dropwizard-views-mustache ---
[INFO] BugInstance size is 0
[INFO] Error size is 0
[INFO] No errors/warnings found
[INFO] 
[INFO] --- maven-install-plugin:2.5.2:install (default-install) @ dropwizard-views-mustache ---
[INFO] Installing /builds/workspace/Dropwizard/dropwizard-views-mustache/target/dropwizard-views-mustache-1.1.0-SNAPSHOT.jar to /builds/.m2/repository/io/dropwizard/dropwizard-views-mustache/1.1.0-SNAPSHOT/dropwizard-views-mustache-1.1.0-SNAPSHOT.jar
[INFO] Installing /builds/workspace/Dropwizard/dropwizard-views-mustache/pom.xml to /builds/.m2/repository/io/dropwizard/dropwizard-views-mustache/1.1.0-SNAPSHOT/dropwizard-views-mustache-1.1.0-SNAPSHOT.pom
[INFO] Installing /builds/workspace/Dropwizard/dropwizard-views-mustache/target/dropwizard-views-mustache-1.1.0-SNAPSHOT-sources.jar to /builds/.m2/repository/io/dropwizard/dropwizard-views-mustache/1.1.0-SNAPSHOT/dropwizard-views-mustache-1.1.0-SNAPSHOT-sources.jar
[INFO] Installing /builds/workspace/Dropwizard/dropwizard-views-mustache/target/dropwizard-views-mustache-1.1.0-SNAPSHOT-javadoc.jar to /builds/.m2/repository/io/dropwizard/dropwizard-views-mustache/1.1.0-SNAPSHOT/dropwizard-views-mustache-1.1.0-SNAPSHOT-javadoc.jar
[INFO]                                                                         
[INFO] ------------------------------------------------------------------------
[INFO] Building Dropwizard Metrics Support for Ganglia 1.1.0-SNAPSHOT
[INFO] ------------------------------------------------------------------------
[INFO] 
[INFO] --- maven-clean-plugin:3.0.0:clean (default-clean) @ dropwizard-metrics-ganglia ---
[INFO] Deleting /builds/workspace/Dropwizard/dropwizard-metrics-ganglia/target
[INFO] 
[INFO] --- spoon-maven-plugin:3.1:generate (default) @ dropwizard-metrics-ganglia ---
[INFO] Running in NOCLASSPATH mode (doc: http://spoon.gforge.inria.fr/launcher.html).
[INFO] Running in NOCLASSPATH mode (doc: http://spoon.gforge.inria.fr/launcher.html).
[INFO] Spoon version 8.1.0-SNAPSHOT
[INFO] running Spoon...
[INFO] start processing...
[INFO] spoon.processing.SpoonTagger
[INFO] spoon.support.JavaOutputProcessor
[INFO] end of processing: 
[INFO] no errors, no warnings
[INFO] 
[INFO] --- maven-resources-plugin:3.0.1:resources (default-resources) @ dropwizard-metrics-ganglia ---
[INFO] Using 'UTF-8' encoding to copy filtered resources.
[INFO] Copying 1 resource
[INFO] 
[INFO] --- maven-compiler-plugin:3.5.1:compile (default-compile) @ dropwizard-metrics-ganglia ---
[INFO] Changes detected - recompiling the module!
[INFO] Compiling 2 source files to /builds/workspace/Dropwizard/dropwizard-metrics-ganglia/target/classes
[INFO] 
[INFO] --- maven-resources-plugin:3.0.1:testResources (default-testResources) @ dropwizard-metrics-ganglia ---
[INFO] Using 'UTF-8' encoding to copy filtered resources.
[INFO] skip non existing resourceDirectory /builds/workspace/Dropwizard/dropwizard-metrics-ganglia/src/test/resources
[INFO] 
[INFO] --- maven-compiler-plugin:3.5.1:testCompile (default-testCompile) @ dropwizard-metrics-ganglia ---
[INFO] Changes detected - recompiling the module!
[INFO] Compiling 1 source file to /builds/workspace/Dropwizard/dropwizard-metrics-ganglia/target/test-classes
[INFO] 
[INFO] --- maven-surefire-plugin:2.19.1:test (default-test) @ dropwizard-metrics-ganglia ---

-------------------------------------------------------
 T E S T S
-------------------------------------------------------
Picked up JAVA_TOOL_OPTIONS: -Dfile.encoding=UTF8
Running io.dropwizard.metrics.ganglia.GangliaReporterFactoryTest
19:34:19.775 [main] DEBUG org.jboss.logging - Logging Provider: org.jboss.logging.Slf4jLoggerProvider
19:34:19.785 [main] INFO org.hibernate.validator.internal.util.Version - HV000001: Hibernate Validator 5.3.0.Final
19:34:19.834 [main] DEBUG org.hibernate.validator.internal.engine.resolver.DefaultTraversableResolver - Cannot find javax.persistence.Persistence on classpath. Assuming non JPA 2 environment. All properties will per default be traversable.
19:34:19.851 [main] DEBUG org.hibernate.validator.internal.xml.ValidationXmlParser - Trying to load META-INF/validation.xml for XML based Validator configuration.
19:34:19.860 [main] DEBUG org.hibernate.validator.internal.xml.ResourceLoaderHelper - Trying to load META-INF/validation.xml via TCCL
19:34:19.861 [main] DEBUG org.hibernate.validator.internal.xml.ResourceLoaderHelper - Trying to load META-INF/validation.xml via Hibernate Validator's class loader
19:34:19.862 [main] DEBUG org.hibernate.validator.internal.xml.ValidationXmlParser - No META-INF/validation.xml found. Using annotation based configuration only.
19:34:20.886 [main] DEBUG org.hibernate.validator.internal.metadata.descriptor.ConstraintDescriptorImpl - Adding composing constraint: ConstraintDescriptorImpl{annotation=javax.validation.constraints.NotNull, payloads=[], hasComposingConstraints=true, isReportAsSingleInvalidConstraint=false, elementType=FIELD, definedOn=DEFINED_LOCALLY, groups=[interface javax.validation.groups.Default], attributes={message={javax.validation.constraints.NotNull.message}, payload=[Ljava.lang.Class;@4a07d605, groups=[Ljava.lang.Class;@74287ea3}, constraintType=GENERIC}.
19:34:20.888 [main] DEBUG org.hibernate.validator.internal.metadata.descriptor.ConstraintDescriptorImpl - Adding composing constraint: ConstraintDescriptorImpl{annotation=javax.validation.constraints.Size, payloads=[], hasComposingConstraints=true, isReportAsSingleInvalidConstraint=false, elementType=FIELD, definedOn=DEFINED_LOCALLY, groups=[interface javax.validation.groups.Default], attributes={groups=[Ljava.lang.Class;@7d7758be, min=1, message={javax.validation.constraints.Size.message}, payload=[Ljava.lang.Class;@2bdd8394, max=2147483647}, constraintType=GENERIC}.
19:34:20.906 [main] DEBUG org.hibernate.validator.internal.metadata.descriptor.ConstraintDescriptorImpl - Adding composing constraint: ConstraintDescriptorImpl{annotation=javax.validation.constraints.Min, payloads=[], hasComposingConstraints=true, isReportAsSingleInvalidConstraint=false, elementType=FIELD, definedOn=DEFINED_LOCALLY, groups=[interface javax.validation.groups.Default], attributes={groups=[Ljava.lang.Class;@a8ef162, message={javax.validation.constraints.Min.message}, payload=[Ljava.lang.Class;@2eea88a1, value=1}, constraintType=GENERIC}.
19:34:20.909 [main] DEBUG org.hibernate.validator.internal.metadata.descriptor.ConstraintDescriptorImpl - Adding composing constraint: ConstraintDescriptorImpl{annotation=javax.validation.constraints.Max, payloads=[], hasComposingConstraints=true, isReportAsSingleInvalidConstraint=false, elementType=FIELD, definedOn=DEFINED_LOCALLY, groups=[interface javax.validation.groups.Default], attributes={groups=[Ljava.lang.Class;@7ac296f6, message={javax.validation.constraints.Max.message}, payload=[Ljava.lang.Class;@7fd7a283, value=49151}, constraintType=GENERIC}.
19:34:20.922 [main] DEBUG org.hibernate.validator.internal.metadata.descriptor.ConstraintDescriptorImpl - Adding composing constraint: ConstraintDescriptorImpl{annotation=javax.validation.constraints.Min, payloads=[], hasComposingConstraints=true, isReportAsSingleInvalidConstraint=false, elementType=FIELD, definedOn=DEFINED_LOCALLY, groups=[interface javax.validation.groups.Default], attributes={groups=[Ljava.lang.Class;@16612a51, message={javax.validation.constraints.Min.message}, payload=[Ljava.lang.Class;@54e041a4, value=0}, constraintType=GENERIC}.
19:34:20.924 [main] DEBUG org.hibernate.validator.internal.metadata.descriptor.ConstraintDescriptorImpl - Adding composing constraint: ConstraintDescriptorImpl{annotation=javax.validation.constraints.Max, payloads=[], hasComposingConstraints=true, isReportAsSingleInvalidConstraint=false, elementType=FIELD, definedOn=DEFINED_LOCALLY, groups=[interface javax.validation.groups.Default], attributes={groups=[Ljava.lang.Class;@79defdc, message={javax.validation.constraints.Max.message}, payload=[Ljava.lang.Class;@18317edc, value=255}, constraintType=GENERIC}.
Tests run: 2, Failures: 0, Errors: 0, Skipped: 0, Time elapsed: 1.773 sec - in io.dropwizard.metrics.ganglia.GangliaReporterFactoryTest

Results :

Tests run: 2, Failures: 0, Errors: 0, Skipped: 0

[INFO] 
[INFO] --- maven-jar-plugin:3.0.2:jar (default-jar) @ dropwizard-metrics-ganglia ---
[INFO] Building jar: /builds/workspace/Dropwizard/dropwizard-metrics-ganglia/target/dropwizard-metrics-ganglia-1.1.0-SNAPSHOT.jar
[INFO] 
[INFO] >>> maven-source-plugin:3.0.1:jar (attach-sources) > generate-sources @ dropwizard-metrics-ganglia >>>
[INFO] 
[INFO] --- spoon-maven-plugin:3.1:generate (default) @ dropwizard-metrics-ganglia ---
[INFO] Running in NOCLASSPATH mode (doc: http://spoon.gforge.inria.fr/launcher.html).
[INFO] Running in NOCLASSPATH mode (doc: http://spoon.gforge.inria.fr/launcher.html).
[INFO] Spoon version 8.1.0-SNAPSHOT
[INFO] running Spoon...
[INFO] start processing...
[INFO] spoon.processing.SpoonTagger
[INFO] spoon.support.JavaOutputProcessor
[INFO] end of processing: 
[INFO] no errors, no warnings
[INFO] 
[INFO] <<< maven-source-plugin:3.0.1:jar (attach-sources) < generate-sources @ dropwizard-metrics-ganglia <<<
[INFO] 
[INFO] --- maven-source-plugin:3.0.1:jar (attach-sources) @ dropwizard-metrics-ganglia ---
[INFO] Building jar: /builds/workspace/Dropwizard/dropwizard-metrics-ganglia/target/dropwizard-metrics-ganglia-1.1.0-SNAPSHOT-sources.jar
[INFO] 
[INFO] --- maven-javadoc-plugin:2.10.4:jar (attach-javadocs) @ dropwizard-metrics-ganglia ---
[WARNING] Javadoc Warnings
[WARNING] Picked up JAVA_TOOL_OPTIONS: -Dfile.encoding=UTF8
[INFO] Building jar: /builds/workspace/Dropwizard/dropwizard-metrics-ganglia/target/dropwizard-metrics-ganglia-1.1.0-SNAPSHOT-javadoc.jar
[INFO] 
[INFO] >>> findbugs-maven-plugin:3.0.4:check (default) > :findbugs @ dropwizard-metrics-ganglia >>>
[INFO] 
[INFO] --- findbugs-maven-plugin:3.0.4:findbugs (findbugs) @ dropwizard-metrics-ganglia ---
[INFO] Fork Value is true
     [java] Picked up JAVA_TOOL_OPTIONS: -Dfile.encoding=UTF8
[INFO] Done FindBugs Analysis....
[INFO] 
[INFO] <<< findbugs-maven-plugin:3.0.4:check (default) < :findbugs @ dropwizard-metrics-ganglia <<<
[INFO] 
[INFO] --- findbugs-maven-plugin:3.0.4:check (default) @ dropwizard-metrics-ganglia ---
[INFO] BugInstance size is 0
[INFO] Error size is 0
[INFO] No errors/warnings found
[INFO] 
[INFO] --- maven-install-plugin:2.5.2:install (default-install) @ dropwizard-metrics-ganglia ---
[INFO] Installing /builds/workspace/Dropwizard/dropwizard-metrics-ganglia/target/dropwizard-metrics-ganglia-1.1.0-SNAPSHOT.jar to /builds/.m2/repository/io/dropwizard/dropwizard-metrics-ganglia/1.1.0-SNAPSHOT/dropwizard-metrics-ganglia-1.1.0-SNAPSHOT.jar
[INFO] Installing /builds/workspace/Dropwizard/dropwizard-metrics-ganglia/pom.xml to /builds/.m2/repository/io/dropwizard/dropwizard-metrics-ganglia/1.1.0-SNAPSHOT/dropwizard-metrics-ganglia-1.1.0-SNAPSHOT.pom
[INFO] Installing /builds/workspace/Dropwizard/dropwizard-metrics-ganglia/target/dropwizard-metrics-ganglia-1.1.0-SNAPSHOT-sources.jar to /builds/.m2/repository/io/dropwizard/dropwizard-metrics-ganglia/1.1.0-SNAPSHOT/dropwizard-metrics-ganglia-1.1.0-SNAPSHOT-sources.jar
[INFO] Installing /builds/workspace/Dropwizard/dropwizard-metrics-ganglia/target/dropwizard-metrics-ganglia-1.1.0-SNAPSHOT-javadoc.jar to /builds/.m2/repository/io/dropwizard/dropwizard-metrics-ganglia/1.1.0-SNAPSHOT/dropwizard-metrics-ganglia-1.1.0-SNAPSHOT-javadoc.jar
[INFO]                                                                         
[INFO] ------------------------------------------------------------------------
[INFO] Building Dropwizard Metrics Support for Graphite 1.1.0-SNAPSHOT
[INFO] ------------------------------------------------------------------------
[INFO] 
[INFO] --- maven-clean-plugin:3.0.0:clean (default-clean) @ dropwizard-metrics-graphite ---
[INFO] Deleting /builds/workspace/Dropwizard/dropwizard-metrics-graphite/target
[INFO] 
[INFO] --- spoon-maven-plugin:3.1:generate (default) @ dropwizard-metrics-graphite ---
[INFO] Running in NOCLASSPATH mode (doc: http://spoon.gforge.inria.fr/launcher.html).
[INFO] Running in NOCLASSPATH mode (doc: http://spoon.gforge.inria.fr/launcher.html).
[INFO] Spoon version 8.1.0-SNAPSHOT
[INFO] running Spoon...
[INFO] start processing...
[INFO] spoon.processing.SpoonTagger
[INFO] spoon.support.JavaOutputProcessor
[INFO] end of processing: 
[INFO] no errors, no warnings
[INFO] 
[INFO] --- maven-resources-plugin:3.0.1:resources (default-resources) @ dropwizard-metrics-graphite ---
[INFO] Using 'UTF-8' encoding to copy filtered resources.
[INFO] Copying 1 resource
[INFO] 
[INFO] --- maven-compiler-plugin:3.5.1:compile (default-compile) @ dropwizard-metrics-graphite ---
[INFO] Changes detected - recompiling the module!
[INFO] Compiling 2 source files to /builds/workspace/Dropwizard/dropwizard-metrics-graphite/target/classes
[INFO] 
[INFO] --- maven-resources-plugin:3.0.1:testResources (default-testResources) @ dropwizard-metrics-graphite ---
[INFO] Using 'UTF-8' encoding to copy filtered resources.
[INFO] skip non existing resourceDirectory /builds/workspace/Dropwizard/dropwizard-metrics-graphite/src/test/resources
[INFO] 
[INFO] --- maven-compiler-plugin:3.5.1:testCompile (default-testCompile) @ dropwizard-metrics-graphite ---
[INFO] Changes detected - recompiling the module!
[INFO] Compiling 1 source file to /builds/workspace/Dropwizard/dropwizard-metrics-graphite/target/test-classes
[INFO] 
[INFO] --- maven-surefire-plugin:2.19.1:test (default-test) @ dropwizard-metrics-graphite ---

-------------------------------------------------------
 T E S T S
-------------------------------------------------------
Picked up JAVA_TOOL_OPTIONS: -Dfile.encoding=UTF8
Running io.dropwizard.metrics.graphite.GraphiteReporterFactoryTest
19:34:30.351 [main] DEBUG org.jboss.logging - Logging Provider: org.jboss.logging.Slf4jLoggerProvider
19:34:30.355 [main] INFO org.hibernate.validator.internal.util.Version - HV000001: Hibernate Validator 5.3.0.Final
19:34:30.414 [main] DEBUG org.hibernate.validator.internal.engine.resolver.DefaultTraversableResolver - Cannot find javax.persistence.Persistence on classpath. Assuming non JPA 2 environment. All properties will per default be traversable.
19:34:30.432 [main] DEBUG org.hibernate.validator.internal.xml.ValidationXmlParser - Trying to load META-INF/validation.xml for XML based Validator configuration.
19:34:30.433 [main] DEBUG org.hibernate.validator.internal.xml.ResourceLoaderHelper - Trying to load META-INF/validation.xml via TCCL
19:34:30.434 [main] DEBUG org.hibernate.validator.internal.xml.ResourceLoaderHelper - Trying to load META-INF/validation.xml via Hibernate Validator's class loader
19:34:30.434 [main] DEBUG org.hibernate.validator.internal.xml.ValidationXmlParser - No META-INF/validation.xml found. Using annotation based configuration only.
19:34:31.174 [main] DEBUG org.hibernate.validator.internal.metadata.descriptor.ConstraintDescriptorImpl - Adding composing constraint: ConstraintDescriptorImpl{annotation=javax.validation.constraints.NotNull, payloads=[], hasComposingConstraints=true, isReportAsSingleInvalidConstraint=false, elementType=FIELD, definedOn=DEFINED_LOCALLY, groups=[interface javax.validation.groups.Default], attributes={message={javax.validation.constraints.NotNull.message}, groups=[Ljava.lang.Class;@4044fb95, payload=[Ljava.lang.Class;@aa549e5}, constraintType=GENERIC}.
19:34:31.178 [main] DEBUG org.hibernate.validator.internal.metadata.descriptor.ConstraintDescriptorImpl - Adding composing constraint: ConstraintDescriptorImpl{annotation=javax.validation.constraints.Size, payloads=[], hasComposingConstraints=true, isReportAsSingleInvalidConstraint=false, elementType=FIELD, definedOn=DEFINED_LOCALLY, groups=[interface javax.validation.groups.Default], attributes={groups=[Ljava.lang.Class;@5c00384f, min=1, message={javax.validation.constraints.Size.message}, max=2147483647, payload=[Ljava.lang.Class;@3b7ff809}, constraintType=GENERIC}.
Tests run: 4, Failures: 0, Errors: 0, Skipped: 0, Time elapsed: 1.873 sec - in io.dropwizard.metrics.graphite.GraphiteReporterFactoryTest

Results :

Tests run: 4, Failures: 0, Errors: 0, Skipped: 0

[INFO] 
[INFO] --- maven-jar-plugin:3.0.2:jar (default-jar) @ dropwizard-metrics-graphite ---
[INFO] Building jar: /builds/workspace/Dropwizard/dropwizard-metrics-graphite/target/dropwizard-metrics-graphite-1.1.0-SNAPSHOT.jar
[INFO] 
[INFO] >>> maven-source-plugin:3.0.1:jar (attach-sources) > generate-sources @ dropwizard-metrics-graphite >>>
[INFO] 
[INFO] --- spoon-maven-plugin:3.1:generate (default) @ dropwizard-metrics-graphite ---
[INFO] Running in NOCLASSPATH mode (doc: http://spoon.gforge.inria.fr/launcher.html).
[INFO] Running in NOCLASSPATH mode (doc: http://spoon.gforge.inria.fr/launcher.html).
[INFO] Spoon version 8.1.0-SNAPSHOT
[INFO] running Spoon...
[INFO] start processing...
[INFO] spoon.processing.SpoonTagger
[INFO] spoon.support.JavaOutputProcessor
[INFO] end of processing: 
[INFO] no errors, no warnings
[INFO] 
[INFO] <<< maven-source-plugin:3.0.1:jar (attach-sources) < generate-sources @ dropwizard-metrics-graphite <<<
[INFO] 
[INFO] --- maven-source-plugin:3.0.1:jar (attach-sources) @ dropwizard-metrics-graphite ---
[INFO] Building jar: /builds/workspace/Dropwizard/dropwizard-metrics-graphite/target/dropwizard-metrics-graphite-1.1.0-SNAPSHOT-sources.jar
[INFO] 
[INFO] --- maven-javadoc-plugin:2.10.4:jar (attach-javadocs) @ dropwizard-metrics-graphite ---
[WARNING] Javadoc Warnings
[WARNING] Picked up JAVA_TOOL_OPTIONS: -Dfile.encoding=UTF8
[INFO] Building jar: /builds/workspace/Dropwizard/dropwizard-metrics-graphite/target/dropwizard-metrics-graphite-1.1.0-SNAPSHOT-javadoc.jar
[INFO] 
[INFO] >>> findbugs-maven-plugin:3.0.4:check (default) > :findbugs @ dropwizard-metrics-graphite >>>
[INFO] 
[INFO] --- findbugs-maven-plugin:3.0.4:findbugs (findbugs) @ dropwizard-metrics-graphite ---
[INFO] Fork Value is true
     [java] Picked up JAVA_TOOL_OPTIONS: -Dfile.encoding=UTF8
[INFO] Done FindBugs Analysis....
[INFO] 
[INFO] <<< findbugs-maven-plugin:3.0.4:check (default) < :findbugs @ dropwizard-metrics-graphite <<<
[INFO] 
[INFO] --- findbugs-maven-plugin:3.0.4:check (default) @ dropwizard-metrics-graphite ---
[INFO] BugInstance size is 0
[INFO] Error size is 0
[INFO] No errors/warnings found
[INFO] 
[INFO] --- maven-install-plugin:2.5.2:install (default-install) @ dropwizard-metrics-graphite ---
[INFO] Installing /builds/workspace/Dropwizard/dropwizard-metrics-graphite/target/dropwizard-metrics-graphite-1.1.0-SNAPSHOT.jar to /builds/.m2/repository/io/dropwizard/dropwizard-metrics-graphite/1.1.0-SNAPSHOT/dropwizard-metrics-graphite-1.1.0-SNAPSHOT.jar
[INFO] Installing /builds/workspace/Dropwizard/dropwizard-metrics-graphite/pom.xml to /builds/.m2/repository/io/dropwizard/dropwizard-metrics-graphite/1.1.0-SNAPSHOT/dropwizard-metrics-graphite-1.1.0-SNAPSHOT.pom
[INFO] Installing /builds/workspace/Dropwizard/dropwizard-metrics-graphite/target/dropwizard-metrics-graphite-1.1.0-SNAPSHOT-sources.jar to /builds/.m2/repository/io/dropwizard/dropwizard-metrics-graphite/1.1.0-SNAPSHOT/dropwizard-metrics-graphite-1.1.0-SNAPSHOT-sources.jar
[INFO] Installing /builds/workspace/Dropwizard/dropwizard-metrics-graphite/target/dropwizard-metrics-graphite-1.1.0-SNAPSHOT-javadoc.jar to /builds/.m2/repository/io/dropwizard/dropwizard-metrics-graphite/1.1.0-SNAPSHOT/dropwizard-metrics-graphite-1.1.0-SNAPSHOT-javadoc.jar
[INFO]                                                                         
[INFO] ------------------------------------------------------------------------
[INFO] Building Dropwizard Asset Bundle 1.1.0-SNAPSHOT
[INFO] ------------------------------------------------------------------------
[INFO] 
[INFO] --- maven-clean-plugin:3.0.0:clean (default-clean) @ dropwizard-assets ---
[INFO] Deleting /builds/workspace/Dropwizard/dropwizard-assets/target
[INFO] 
[INFO] --- spoon-maven-plugin:3.1:generate (default) @ dropwizard-assets ---
[INFO] Running in NOCLASSPATH mode (doc: http://spoon.gforge.inria.fr/launcher.html).
[INFO] Running in NOCLASSPATH mode (doc: http://spoon.gforge.inria.fr/launcher.html).
[INFO] Spoon version 8.1.0-SNAPSHOT
[INFO] running Spoon...
[INFO] start processing...
[INFO] spoon.processing.SpoonTagger
[INFO] spoon.support.JavaOutputProcessor
[INFO] end of processing: 
[INFO] no errors, no warnings
[INFO] 
[INFO] --- maven-resources-plugin:3.0.1:resources (default-resources) @ dropwizard-assets ---
[INFO] Using 'UTF-8' encoding to copy filtered resources.
[INFO] skip non existing resourceDirectory /builds/workspace/Dropwizard/dropwizard-assets/src/main/resources
[INFO] 
[INFO] --- maven-compiler-plugin:3.5.1:compile (default-compile) @ dropwizard-assets ---
[INFO] Changes detected - recompiling the module!
[INFO] Compiling 2 source files to /builds/workspace/Dropwizard/dropwizard-assets/target/classes
[INFO] 
[INFO] --- maven-resources-plugin:3.0.1:testResources (default-testResources) @ dropwizard-assets ---
[INFO] Using 'UTF-8' encoding to copy filtered resources.
[INFO] Copying 2 resources
[INFO] 
[INFO] --- maven-compiler-plugin:3.5.1:testCompile (default-testCompile) @ dropwizard-assets ---
[INFO] Changes detected - recompiling the module!
[INFO] Compiling 1 source file to /builds/workspace/Dropwizard/dropwizard-assets/target/test-classes
[INFO] 
[INFO] --- maven-surefire-plugin:2.19.1:test (default-test) @ dropwizard-assets ---

-------------------------------------------------------
 T E S T S
-------------------------------------------------------
Picked up JAVA_TOOL_OPTIONS: -Dfile.encoding=UTF8
Running io.dropwizard.assets.AssetsBundleTest
19:34:40.505 [main] INFO io.dropwizard.assets.AssetsBundle - Registering AssetBundle with name: customAsset1 for path /what/new/*
19:34:40.752 [main] INFO io.dropwizard.assets.AssetsBundle - Registering AssetBundle with name: customAsset2 for path /what/old/*
19:34:40.754 [main] INFO io.dropwizard.assets.AssetsBundle - Registering AssetBundle with name: assets for path /what/*
19:34:40.763 [main] INFO io.dropwizard.assets.AssetsBundle - Registering AssetBundle with name: assets for path /what/*
19:34:40.765 [main] INFO io.dropwizard.assets.AssetsBundle - Registering AssetBundle with name: assets for path /json/*
19:34:40.766 [main] INFO io.dropwizard.assets.AssetsBundle - Registering AssetBundle with name: assets for path /assets/*
Tests run: 5, Failures: 0, Errors: 0, Skipped: 0, Time elapsed: 1.85 sec - in io.dropwizard.assets.AssetsBundleTest

Results :

Tests run: 5, Failures: 0, Errors: 0, Skipped: 0

[INFO] 
[INFO] --- maven-jar-plugin:3.0.2:jar (default-jar) @ dropwizard-assets ---
[INFO] Building jar: /builds/workspace/Dropwizard/dropwizard-assets/target/dropwizard-assets-1.1.0-SNAPSHOT.jar
[INFO] 
[INFO] >>> maven-source-plugin:3.0.1:jar (attach-sources) > generate-sources @ dropwizard-assets >>>
[INFO] 
[INFO] --- spoon-maven-plugin:3.1:generate (default) @ dropwizard-assets ---
[INFO] Running in NOCLASSPATH mode (doc: http://spoon.gforge.inria.fr/launcher.html).
[INFO] Running in NOCLASSPATH mode (doc: http://spoon.gforge.inria.fr/launcher.html).
[INFO] Spoon version 8.1.0-SNAPSHOT
[INFO] running Spoon...
[INFO] start processing...
[INFO] spoon.processing.SpoonTagger
[INFO] spoon.support.JavaOutputProcessor
[INFO] end of processing: 
[INFO] no errors, no warnings
[INFO] 
[INFO] <<< maven-source-plugin:3.0.1:jar (attach-sources) < generate-sources @ dropwizard-assets <<<
[INFO] 
[INFO] --- maven-source-plugin:3.0.1:jar (attach-sources) @ dropwizard-assets ---
[INFO] Building jar: /builds/workspace/Dropwizard/dropwizard-assets/target/dropwizard-assets-1.1.0-SNAPSHOT-sources.jar
[INFO] 
[INFO] --- maven-javadoc-plugin:2.10.4:jar (attach-javadocs) @ dropwizard-assets ---
[WARNING] Javadoc Warnings
[WARNING] Picked up JAVA_TOOL_OPTIONS: -Dfile.encoding=UTF8
[INFO] Building jar: /builds/workspace/Dropwizard/dropwizard-assets/target/dropwizard-assets-1.1.0-SNAPSHOT-javadoc.jar
[INFO] 
[INFO] >>> findbugs-maven-plugin:3.0.4:check (default) > :findbugs @ dropwizard-assets >>>
[INFO] 
[INFO] --- findbugs-maven-plugin:3.0.4:findbugs (findbugs) @ dropwizard-assets ---
[INFO] Fork Value is true
     [java] Picked up JAVA_TOOL_OPTIONS: -Dfile.encoding=UTF8
[INFO] Done FindBugs Analysis....
[INFO] 
[INFO] <<< findbugs-maven-plugin:3.0.4:check (default) < :findbugs @ dropwizard-assets <<<
[INFO] 
[INFO] --- findbugs-maven-plugin:3.0.4:check (default) @ dropwizard-assets ---
[INFO] BugInstance size is 0
[INFO] Error size is 0
[INFO] No errors/warnings found
[INFO] 
[INFO] --- maven-install-plugin:2.5.2:install (default-install) @ dropwizard-assets ---
[INFO] Installing /builds/workspace/Dropwizard/dropwizard-assets/target/dropwizard-assets-1.1.0-SNAPSHOT.jar to /builds/.m2/repository/io/dropwizard/dropwizard-assets/1.1.0-SNAPSHOT/dropwizard-assets-1.1.0-SNAPSHOT.jar
[INFO] Installing /builds/workspace/Dropwizard/dropwizard-assets/pom.xml to /builds/.m2/repository/io/dropwizard/dropwizard-assets/1.1.0-SNAPSHOT/dropwizard-assets-1.1.0-SNAPSHOT.pom
[INFO] Installing /builds/workspace/Dropwizard/dropwizard-assets/target/dropwizard-assets-1.1.0-SNAPSHOT-sources.jar to /builds/.m2/repository/io/dropwizard/dropwizard-assets/1.1.0-SNAPSHOT/dropwizard-assets-1.1.0-SNAPSHOT-sources.jar
[INFO] Installing /builds/workspace/Dropwizard/dropwizard-assets/target/dropwizard-assets-1.1.0-SNAPSHOT-javadoc.jar to /builds/.m2/repository/io/dropwizard/dropwizard-assets/1.1.0-SNAPSHOT/dropwizard-assets-1.1.0-SNAPSHOT-javadoc.jar
[INFO]                                                                         
[INFO] ------------------------------------------------------------------------
[INFO] Building Dropwizard Benchmarks 1.1.0-SNAPSHOT
[INFO] ------------------------------------------------------------------------
[INFO] 
[INFO] --- maven-clean-plugin:3.0.0:clean (default-clean) @ dropwizard-benchmarks ---
[INFO] Deleting /builds/workspace/Dropwizard/dropwizard-benchmarks/target
[INFO] 
[INFO] --- spoon-maven-plugin:3.1:generate (default) @ dropwizard-benchmarks ---
[INFO] Running in NOCLASSPATH mode (doc: http://spoon.gforge.inria.fr/launcher.html).
[INFO] Running in NOCLASSPATH mode (doc: http://spoon.gforge.inria.fr/launcher.html).
[INFO] Spoon version 8.1.0-SNAPSHOT
[INFO] running Spoon...
[INFO] start processing...
[INFO] spoon.processing.SpoonTagger
[INFO] spoon.support.JavaOutputProcessor
[INFO] end of processing: 
[INFO] no errors, no warnings
[INFO] 
[INFO] --- maven-resources-plugin:3.0.1:resources (default-resources) @ dropwizard-benchmarks ---
[INFO] Using 'UTF-8' encoding to copy filtered resources.
[INFO] skip non existing resourceDirectory /builds/workspace/Dropwizard/dropwizard-benchmarks/src/main/resources
[INFO] 
[INFO] --- maven-compiler-plugin:3.5.1:compile (default-compile) @ dropwizard-benchmarks ---
[INFO] Compiling 26 source files to /builds/workspace/Dropwizard/dropwizard-benchmarks/target/classes
[INFO] -------------------------------------------------------------
[ERROR] COMPILATION ERROR : 
[INFO] -------------------------------------------------------------
[ERROR] bootstrap class path not set in conjunction with -source 1.8
/builds/workspace/Dropwizard/dropwizard-benchmarks/target/generated-sources/annotations/io/dropwizard/benchmarks/util/generated/SizeBenchmark_jmhType_B1.java:[3,7] error: duplicate class: io.dropwizard.benchmarks.util.generated.SizeBenchmark_jmhType_B1
[ERROR] /builds/workspace/Dropwizard/dropwizard-benchmarks/target/generated-sources/annotations/io/dropwizard/benchmarks/util/generated/SizeBenchmark_jmhType_B2.java:[3,7] error: duplicate class: io.dropwizard.benchmarks.util.generated.SizeBenchmark_jmhType_B2
[ERROR] /builds/workspace/Dropwizard/dropwizard-benchmarks/target/generated-sources/annotations/io/dropwizard/benchmarks/util/generated/SizeBenchmark_jmhType_B3.java:[2,7] error: duplicate class: io.dropwizard.benchmarks.util.generated.SizeBenchmark_jmhType_B3
[ERROR] /builds/workspace/Dropwizard/dropwizard-benchmarks/target/generated-sources/annotations/io/dropwizard/benchmarks/util/generated/SizeBenchmark_jmhType.java:[2,7] error: duplicate class: io.dropwizard.benchmarks.util.generated.SizeBenchmark_jmhType
[ERROR] /builds/workspace/Dropwizard/dropwizard-benchmarks/target/generated-sources/annotations/io/dropwizard/benchmarks/util/generated/SizeBenchmark_parseSize_jmhTest.java:[36,13] error: duplicate class: io.dropwizard.benchmarks.util.generated.SizeBenchmark_parseSize_jmhTest
[ERROR] /builds/workspace/Dropwizard/dropwizard-benchmarks/target/generated-sources/annotations/io/dropwizard/benchmarks/util/generated/DurationBenchmark_jmhType_B1.java:[3,7] error: duplicate class: io.dropwizard.benchmarks.util.generated.DurationBenchmark_jmhType_B1
[ERROR] /builds/workspace/Dropwizard/dropwizard-benchmarks/target/generated-sources/annotations/io/dropwizard/benchmarks/util/generated/DurationBenchmark_jmhType_B2.java:[3,7] error: duplicate class: io.dropwizard.benchmarks.util.generated.DurationBenchmark_jmhType_B2
[ERROR] /builds/workspace/Dropwizard/dropwizard-benchmarks/target/generated-sources/annotations/io/dropwizard/benchmarks/util/generated/DurationBenchmark_jmhType_B3.java:[2,7] error: duplicate class: io.dropwizard.benchmarks.util.generated.DurationBenchmark_jmhType_B3
[ERROR] /builds/workspace/Dropwizard/dropwizard-benchmarks/target/generated-sources/annotations/io/dropwizard/benchmarks/util/generated/DurationBenchmark_jmhType.java:[2,7] error: duplicate class: io.dropwizard.benchmarks.util.generated.DurationBenchmark_jmhType
[ERROR] /builds/workspace/Dropwizard/dropwizard-benchmarks/target/generated-sources/annotations/io/dropwizard/benchmarks/util/generated/DurationBenchmark_parseDuration_jmhTest.java:[36,13] error: duplicate class: io.dropwizard.benchmarks.util.generated.DurationBenchmark_parseDuration_jmhTest
[ERROR] /builds/workspace/Dropwizard/dropwizard-benchmarks/target/generated-sources/annotations/io/dropwizard/benchmarks/jersey/generated/DropwizardResourceConfigBenchmark_jmhType_B1.java:[3,7] error: duplicate class: io.dropwizard.benchmarks.jersey.generated.DropwizardResourceConfigBenchmark_jmhType_B1
[ERROR] /builds/workspace/Dropwizard/dropwizard-benchmarks/target/generated-sources/annotations/io/dropwizard/benchmarks/jersey/generated/DropwizardResourceConfigBenchmark_jmhType_B2.java:[3,7] error: duplicate class: io.dropwizard.benchmarks.jersey.generated.DropwizardResourceConfigBenchmark_jmhType_B2
[ERROR] /builds/workspace/Dropwizard/dropwizard-benchmarks/target/generated-sources/annotations/io/dropwizard/benchmarks/jersey/generated/DropwizardResourceConfigBenchmark_jmhType_B3.java:[2,7] error: duplicate class: io.dropwizard.benchmarks.jersey.generated.DropwizardResourceConfigBenchmark_jmhType_B3
[ERROR] /builds/workspace/Dropwizard/dropwizard-benchmarks/target/generated-sources/annotations/io/dropwizard/benchmarks/jersey/generated/DropwizardResourceConfigBenchmark_jmhType.java:[2,7] error: duplicate class: io.dropwizard.benchmarks.jersey.generated.DropwizardResourceConfigBenchmark_jmhType
[ERROR] /builds/workspace/Dropwizard/dropwizard-benchmarks/target/generated-sources/annotations/io/dropwizard/benchmarks/jersey/generated/DropwizardResourceConfigBenchmark_getEndpointsInfo_jmhTest.java:[36,13] error: duplicate class: io.dropwizard.benchmarks.jersey.generated.DropwizardResourceConfigBenchmark_getEndpointsInfo_jmhTest
[ERROR] /builds/workspace/Dropwizard/dropwizard-benchmarks/target/generated-sources/annotations/io/dropwizard/benchmarks/jersey/generated/ConstraintViolationBenchmark_jmhType_B1.java:[3,7] error: duplicate class: io.dropwizard.benchmarks.jersey.generated.ConstraintViolationBenchmark_jmhType_B1
[ERROR] /builds/workspace/Dropwizard/dropwizard-benchmarks/target/generated-sources/annotations/io/dropwizard/benchmarks/jersey/generated/ConstraintViolationBenchmark_jmhType_B2.java:[3,7] error: duplicate class: io.dropwizard.benchmarks.jersey.generated.ConstraintViolationBenchmark_jmhType_B2
[ERROR] /builds/workspace/Dropwizard/dropwizard-benchmarks/target/generated-sources/annotations/io/dropwizard/benchmarks/jersey/generated/ConstraintViolationBenchmark_jmhType_B3.java:[2,7] error: duplicate class: io.dropwizard.benchmarks.jersey.generated.ConstraintViolationBenchmark_jmhType_B3
[ERROR] /builds/workspace/Dropwizard/dropwizard-benchmarks/target/generated-sources/annotations/io/dropwizard/benchmarks/jersey/generated/ConstraintViolationBenchmark_jmhType.java:[2,7] error: duplicate class: io.dropwizard.benchmarks.jersey.generated.ConstraintViolationBenchmark_jmhType
[ERROR] /builds/workspace/Dropwizard/dropwizard-benchmarks/target/generated-sources/annotations/io/dropwizard/benchmarks/jersey/generated/ConstraintViolationBenchmark_objViolation_jmhTest.java:[36,13] error: duplicate class: io.dropwizard.benchmarks.jersey.generated.ConstraintViolationBenchmark_objViolation_jmhTest
[ERROR] /builds/workspace/Dropwizard/dropwizard-benchmarks/target/generated-sources/annotations/io/dropwizard/benchmarks/jersey/generated/ConstraintViolationBenchmark_paramViolation_jmhTest.java:[36,13] error: duplicate class: io.dropwizard.benchmarks.jersey.generated.ConstraintViolationBenchmark_paramViolation_jmhTest
[INFO] 21 errors 
[INFO] -------------------------------------------------------------
[INFO] ------------------------------------------------------------------------
[INFO] Reactor Summary:
[INFO] 
[INFO] Dropwizard Project ................................. SUCCESS [  2.595 s]
[INFO] Dropwizard BOM ..................................... SUCCESS [  6.343 s]
[INFO] Dropwizard Utility Classes ......................... SUCCESS [ 10.847 s]
[INFO] Dropwizard Jackson Support ......................... SUCCESS [ 10.127 s]
[INFO] Dropwizard Validation Support ...................... SUCCESS [  7.336 s]
[INFO] Dropwizard Configuration Support ................... SUCCESS [ 15.782 s]
[INFO] Dropwizard Logging Support ......................... SUCCESS [ 10.765 s]
[INFO] Dropwizard Lifecycle Support ....................... SUCCESS [  6.734 s]
[INFO] Dropwizard Metrics Support ......................... SUCCESS [  7.975 s]
[INFO] Dropwizard Jersey Support .......................... SUCCESS [ 27.643 s]
[INFO] Dropwizard Servlet Support ......................... SUCCESS [  9.586 s]
[INFO] Dropwizard Jetty Support ........................... SUCCESS [ 13.582 s]
[INFO] Dropwizard Request Logging Support ................. SUCCESS [  8.855 s]
[INFO] Dropwizard ......................................... SUCCESS [ 15.919 s]
[INFO] Dropwizard Test Helpers ............................ SUCCESS [ 15.815 s]
[INFO] Dropwizard HTTP Client ............................. SUCCESS [ 14.524 s]
[INFO] Dropwizard Database Support ........................ SUCCESS [  8.451 s]
[INFO] Dropwizard JDBI Support ............................ SUCCESS [  8.012 s]
[INFO] Dropwizard Migrations .............................. SUCCESS [ 11.033 s]
[INFO] Dropwizard Hibernate Support ....................... SUCCESS [ 15.445 s]
[INFO] Dropwizard Authentication .......................... SUCCESS [ 13.973 s]
[INFO] Dropwizard Multipart Form Support .................. SUCCESS [  5.172 s]
[INFO] Dropwizard Views ................................... SUCCESS [  7.097 s]
[INFO] Dropwizard Freemarker Views ........................ SUCCESS [  9.279 s]
[INFO] Dropwizard Mustache Views .......................... SUCCESS [ 12.308 s]
[INFO] Dropwizard Metrics Support for Ganglia ............. SUCCESS [ 10.385 s]
[INFO] Dropwizard Metrics Support for Graphite ............ SUCCESS [  9.201 s]
[INFO] Dropwizard Asset Bundle ............................ SUCCESS [  9.513 s]
[INFO] Dropwizard Benchmarks .............................. FAILURE [  1.541 s]
[INFO] Dropwizard HTTP/2 Support .......................... SKIPPED
[INFO] ------------------------------------------------------------------------
[INFO] BUILD FAILURE
[INFO] ------------------------------------------------------------------------
[INFO] Total time: 05:06 min
[INFO] Finished at: 2020-02-22T19:34:49+01:00
[INFO] Final Memory: 83M/299M
[INFO] ------------------------------------------------------------------------
[ERROR] Failed to execute goal org.apache.maven.plugins:maven-compiler-plugin:3.5.1:compile (default-compile) on project dropwizard-benchmarks: Compilation failure: Compilation failure:
[ERROR] bootstrap class path not set in conjunction with -source 1.8
[ERROR] /builds/workspace/Dropwizard/dropwizard-benchmarks/target/generated-sources/annotations/io/dropwizard/benchmarks/util/generated/SizeBenchmark_jmhType_B1.java:[3,7] error: duplicate class: io.dropwizard.benchmarks.util.generated.SizeBenchmark_jmhType_B1
[ERROR] /builds/workspace/Dropwizard/dropwizard-benchmarks/target/generated-sources/annotations/io/dropwizard/benchmarks/util/generated/SizeBenchmark_jmhType_B2.java:[3,7] error: duplicate class: io.dropwizard.benchmarks.util.generated.SizeBenchmark_jmhType_B2
[ERROR] /builds/workspace/Dropwizard/dropwizard-benchmarks/target/generated-sources/annotations/io/dropwizard/benchmarks/util/generated/SizeBenchmark_jmhType_B3.java:[2,7] error: duplicate class: io.dropwizard.benchmarks.util.generated.SizeBenchmark_jmhType_B3
[ERROR] /builds/workspace/Dropwizard/dropwizard-benchmarks/target/generated-sources/annotations/io/dropwizard/benchmarks/util/generated/SizeBenchmark_jmhType.java:[2,7] error: duplicate class: io.dropwizard.benchmarks.util.generated.SizeBenchmark_jmhType
[ERROR] /builds/workspace/Dropwizard/dropwizard-benchmarks/target/generated-sources/annotations/io/dropwizard/benchmarks/util/generated/SizeBenchmark_parseSize_jmhTest.java:[36,13] error: duplicate class: io.dropwizard.benchmarks.util.generated.SizeBenchmark_parseSize_jmhTest
[ERROR] /builds/workspace/Dropwizard/dropwizard-benchmarks/target/generated-sources/annotations/io/dropwizard/benchmarks/util/generated/DurationBenchmark_jmhType_B1.java:[3,7] error: duplicate class: io.dropwizard.benchmarks.util.generated.DurationBenchmark_jmhType_B1
[ERROR] /builds/workspace/Dropwizard/dropwizard-benchmarks/target/generated-sources/annotations/io/dropwizard/benchmarks/util/generated/DurationBenchmark_jmhType_B2.java:[3,7] error: duplicate class: io.dropwizard.benchmarks.util.generated.DurationBenchmark_jmhType_B2
[ERROR] /builds/workspace/Dropwizard/dropwizard-benchmarks/target/generated-sources/annotations/io/dropwizard/benchmarks/util/generated/DurationBenchmark_jmhType_B3.java:[2,7] error: duplicate class: io.dropwizard.benchmarks.util.generated.DurationBenchmark_jmhType_B3
[ERROR] /builds/workspace/Dropwizard/dropwizard-benchmarks/target/generated-sources/annotations/io/dropwizard/benchmarks/util/generated/DurationBenchmark_jmhType.java:[2,7] error: duplicate class: io.dropwizard.benchmarks.util.generated.DurationBenchmark_jmhType
[ERROR] /builds/workspace/Dropwizard/dropwizard-benchmarks/target/generated-sources/annotations/io/dropwizard/benchmarks/util/generated/DurationBenchmark_parseDuration_jmhTest.java:[36,13] error: duplicate class: io.dropwizard.benchmarks.util.generated.DurationBenchmark_parseDuration_jmhTest
[ERROR] /builds/workspace/Dropwizard/dropwizard-benchmarks/target/generated-sources/annotations/io/dropwizard/benchmarks/jersey/generated/DropwizardResourceConfigBenchmark_jmhType_B1.java:[3,7] error: duplicate class: io.dropwizard.benchmarks.jersey.generated.DropwizardResourceConfigBenchmark_jmhType_B1
[ERROR] /builds/workspace/Dropwizard/dropwizard-benchmarks/target/generated-sources/annotations/io/dropwizard/benchmarks/jersey/generated/DropwizardResourceConfigBenchmark_jmhType_B2.java:[3,7] error: duplicate class: io.dropwizard.benchmarks.jersey.generated.DropwizardResourceConfigBenchmark_jmhType_B2
[ERROR] /builds/workspace/Dropwizard/dropwizard-benchmarks/target/generated-sources/annotations/io/dropwizard/benchmarks/jersey/generated/DropwizardResourceConfigBenchmark_jmhType_B3.java:[2,7] error: duplicate class: io.dropwizard.benchmarks.jersey.generated.DropwizardResourceConfigBenchmark_jmhType_B3
[ERROR] /builds/workspace/Dropwizard/dropwizard-benchmarks/target/generated-sources/annotations/io/dropwizard/benchmarks/jersey/generated/DropwizardResourceConfigBenchmark_jmhType.java:[2,7] error: duplicate class: io.dropwizard.benchmarks.jersey.generated.DropwizardResourceConfigBenchmark_jmhType
[ERROR] /builds/workspace/Dropwizard/dropwizard-benchmarks/target/generated-sources/annotations/io/dropwizard/benchmarks/jersey/generated/DropwizardResourceConfigBenchmark_getEndpointsInfo_jmhTest.java:[36,13] error: duplicate class: io.dropwizard.benchmarks.jersey.generated.DropwizardResourceConfigBenchmark_getEndpointsInfo_jmhTest
[ERROR] /builds/workspace/Dropwizard/dropwizard-benchmarks/target/generated-sources/annotations/io/dropwizard/benchmarks/jersey/generated/ConstraintViolationBenchmark_jmhType_B1.java:[3,7] error: duplicate class: io.dropwizard.benchmarks.jersey.generated.ConstraintViolationBenchmark_jmhType_B1
[ERROR] /builds/workspace/Dropwizard/dropwizard-benchmarks/target/generated-sources/annotations/io/dropwizard/benchmarks/jersey/generated/ConstraintViolationBenchmark_jmhType_B2.java:[3,7] error: duplicate class: io.dropwizard.benchmarks.jersey.generated.ConstraintViolationBenchmark_jmhType_B2
[ERROR] /builds/workspace/Dropwizard/dropwizard-benchmarks/target/generated-sources/annotations/io/dropwizard/benchmarks/jersey/generated/ConstraintViolationBenchmark_jmhType_B3.java:[2,7] error: duplicate class: io.dropwizard.benchmarks.jersey.generated.ConstraintViolationBenchmark_jmhType_B3
[ERROR] /builds/workspace/Dropwizard/dropwizard-benchmarks/target/generated-sources/annotations/io/dropwizard/benchmarks/jersey/generated/ConstraintViolationBenchmark_jmhType.java:[2,7] error: duplicate class: io.dropwizard.benchmarks.jersey.generated.ConstraintViolationBenchmark_jmhType
[ERROR] /builds/workspace/Dropwizard/dropwizard-benchmarks/target/generated-sources/annotations/io/dropwizard/benchmarks/jersey/generated/ConstraintViolationBenchmark_objViolation_jmhTest.java:[36,13] error: duplicate class: io.dropwizard.benchmarks.jersey.generated.ConstraintViolationBenchmark_objViolation_jmhTest
[ERROR] /builds/workspace/Dropwizard/dropwizard-benchmarks/target/generated-sources/annotations/io/dropwizard/benchmarks/jersey/generated/ConstraintViolationBenchmark_paramViolation_jmhTest.java:[36,13] error: duplicate class: io.dropwizard.benchmarks.jersey.generated.ConstraintViolationBenchmark_paramViolation_jmhTest
[ERROR] -> [Help 1]
[ERROR] 
[ERROR] To see the full stack trace of the errors, re-run Maven with the -e switch.
[ERROR] Re-run Maven using the -X switch to enable full debug logging.
[ERROR] 
[ERROR] For more information about the errors and possible solutions, please read the following articles:
[ERROR] [Help 1] http://cwiki.apache.org/confluence/display/MAVEN/MojoFailureException
[ERROR] 
[ERROR] After correcting the problems, you can resume the build with the command
[ERROR]   mvn <goals> -rf :dropwizard-benchmarks
Error: Maven compile with spoon(spoon) unsuccessful!
Build step 'Execute shell' marked build as failure
Finished: FAILURE