FailedConsole Output

Started by timer
Running as SYSTEM
[EnvInject] - Loading node environment variables.
Building remotely on sos-builder01 (lin) in workspace /builds/workspace/JavaWriter
[WS-CLEANUP] Deleting project workspace...
[WS-CLEANUP] Deferred wipeout is used...
[WS-CLEANUP] Done
No credentials specified
Cloning the remote Git repository
Cloning repository https://github.com/square/javapoet.git
 > git init /builds/workspace/JavaWriter # timeout=10
Fetching upstream changes from https://github.com/square/javapoet.git
 > git --version # timeout=10
 > git fetch --tags --progress https://github.com/square/javapoet.git +refs/heads/*:refs/remotes/origin/*
 > git config remote.origin.url https://github.com/square/javapoet.git # timeout=10
 > git config --add remote.origin.fetch +refs/heads/*:refs/remotes/origin/* # timeout=10
 > git config remote.origin.url https://github.com/square/javapoet.git # timeout=10
Fetching upstream changes from https://github.com/square/javapoet.git
 > git fetch --tags --progress https://github.com/square/javapoet.git +refs/heads/*:refs/remotes/origin/*
 > git rev-parse refs/remotes/origin/master^{commit} # timeout=10
 > git rev-parse refs/remotes/origin/origin/master^{commit} # timeout=10
Checking out Revision e9460b84fc41464c2aa2ef85c84dd1ac87ae1692 (refs/remotes/origin/master)
 > git config core.sparsecheckout # timeout=10
 > git checkout -f e9460b84fc41464c2aa2ef85c84dd1ac87ae1692
Commit message: "Merge pull request #735 from ZacSweers/z/codeblockClear"
 > git rev-list --no-walk e9460b84fc41464c2aa2ef85c84dd1ac87ae1692 # timeout=10
[JavaWriter] $ /bin/sh -xe /tmp/jenkins1814137968192617077.sh
+ + stdbufcurl -i http://spoon.gforge.inria.fr/jenkins/build.sh
 50k bash
  % Total    % Received % Xferd  Average Speed   Time    Time     Time  Current
                                 Dload  Upload   Total   Spent    Left  Speed

  0     0    0     0    0     0      0      0 --:--:-- --:--:-- --:--:--     0
100 21193  100 21193    0     0  1517k      0 --:--:-- --:--:-- --:--:-- 1592k
 
-------------------------------------------------------
Initizalizes project
-------------------------------------------------------
 
HEAD is now at e9460b8 Merge pull request #735 from ZacSweers/z/codeblockClear

--- Displays variables used in the build ---
Artifact id: javapoet
Version: 1.12.0-SNAPSHOT
Modules job:
- JavaWriter
Has checkstyle: true
Has enforcer: true
Git version id: e9460b84fc41464c2aa2ef85c84dd1ac87ae1692
Java version: Picked up JAVA_TOOL_OPTIONS: -Dfile.encoding=UTF8
java version "1.8.0_151"
Java(TM) SE Runtime Environment (build 1.8.0_151-b12)
Java HotSpot(TM) 64-Bit Server VM (build 25.151-b12, mixed mode)
Java home: /builds/tools/hudson.model.JDK/JDK_8.0.151
 
-------------------------------------------------------
Compiles project (at the root project if it's a multi module project) without spoon
-------------------------------------------------------
 
Picked up JAVA_TOOL_OPTIONS: -Dfile.encoding=UTF8
[INFO] Scanning for projects...
[INFO]                                                                         
[INFO] ------------------------------------------------------------------------
[INFO] Building JavaPoet 1.12.0-SNAPSHOT
[INFO] ------------------------------------------------------------------------
[INFO] 
[INFO] --- maven-clean-plugin:2.5:clean (default-clean) @ javapoet ---
[INFO] 
[INFO] --- maven-enforcer-plugin:1.0:enforce (enforce-maven) @ javapoet ---
[INFO] 
[INFO] --- maven-resources-plugin:2.6:resources (default-resources) @ javapoet ---
[INFO] Using 'UTF-8' encoding to copy filtered resources.
[INFO] skip non existing resourceDirectory /builds/workspace/JavaWriter/src/main/resources
[INFO] 
[INFO] --- maven-compiler-plugin:3.8.0:compile (default-compile) @ javapoet ---
[INFO] Changes detected - recompiling the module!
[INFO] Compiling 17 source files to /builds/workspace/JavaWriter/target/classes
[INFO] 
[INFO] --- maven-resources-plugin:2.6:testResources (default-testResources) @ javapoet ---
[INFO] Using 'UTF-8' encoding to copy filtered resources.
[INFO] skip non existing resourceDirectory /builds/workspace/JavaWriter/src/test/resources
[INFO] 
[INFO] --- maven-compiler-plugin:3.8.0:testCompile (default-testCompile) @ javapoet ---
[INFO] Changes detected - recompiling the module!
[INFO] Compiling 20 source files to /builds/workspace/JavaWriter/target/test-classes
[INFO] 
[INFO] --- maven-surefire-plugin:2.17:test (default-test) @ javapoet ---
[INFO] Surefire report directory: /builds/workspace/JavaWriter/target/surefire-reports

-------------------------------------------------------
 T E S T S
-------------------------------------------------------
Picked up JAVA_TOOL_OPTIONS: -Dfile.encoding=UTF8
Running ClassNameNoPackageTest
Tests run: 1, Failures: 0, Errors: 0, Skipped: 0, Time elapsed: 0.108 sec - in ClassNameNoPackageTest
Running com.squareup.javapoet.JavaFileTest
Tests run: 30, Failures: 0, Errors: 0, Skipped: 1, Time elapsed: 0.173 sec - in com.squareup.javapoet.JavaFileTest
Running com.squareup.javapoet.MethodSpecTest
Tests run: 19, Failures: 0, Errors: 0, Skipped: 0, Time elapsed: 1.212 sec - in com.squareup.javapoet.MethodSpecTest
Running com.squareup.javapoet.TypeNameTest
Tests run: 12, Failures: 0, Errors: 0, Skipped: 0, Time elapsed: 0.023 sec - in com.squareup.javapoet.TypeNameTest
Running com.squareup.javapoet.AnnotationSpecTest
Tests run: 10, Failures: 0, Errors: 0, Skipped: 0, Time elapsed: 0.18 sec - in com.squareup.javapoet.AnnotationSpecTest
Running com.squareup.javapoet.FieldSpecTest
Tests run: 2, Failures: 0, Errors: 0, Skipped: 0, Time elapsed: 0.004 sec - in com.squareup.javapoet.FieldSpecTest
Running com.squareup.javapoet.TypesEclipseTest
Tests run: 20, Failures: 0, Errors: 0, Skipped: 0, Time elapsed: 3.971 sec - in com.squareup.javapoet.TypesEclipseTest
Running com.squareup.javapoet.ParameterSpecTest
Tests run: 3, Failures: 0, Errors: 0, Skipped: 0, Time elapsed: 0 sec - in com.squareup.javapoet.ParameterSpecTest
Running com.squareup.javapoet.AnnotatedTypeNameTest
Tests run: 22, Failures: 0, Errors: 0, Skipped: 0, Time elapsed: 0.002 sec - in com.squareup.javapoet.AnnotatedTypeNameTest
Running com.squareup.javapoet.FileReadingTest
Tests run: 5, Failures: 0, Errors: 0, Skipped: 0, Time elapsed: 0.121 sec - in com.squareup.javapoet.FileReadingTest
Running com.squareup.javapoet.ClassNameTest
Tests run: 13, Failures: 0, Errors: 0, Skipped: 0, Time elapsed: 2.084 sec - in com.squareup.javapoet.ClassNameTest
Running com.squareup.javapoet.UtilTest
Tests run: 2, Failures: 0, Errors: 0, Skipped: 0, Time elapsed: 0.006 sec - in com.squareup.javapoet.UtilTest
Running com.squareup.javapoet.LineWrapperTest
Tests run: 16, Failures: 0, Errors: 0, Skipped: 0, Time elapsed: 0.007 sec - in com.squareup.javapoet.LineWrapperTest
Running com.squareup.javapoet.FileWritingTest
Tests run: 11, Failures: 0, Errors: 0, Skipped: 0, Time elapsed: 0.233 sec - in com.squareup.javapoet.FileWritingTest
Running com.squareup.javapoet.TypeSpecTest
Tests run: 109, Failures: 0, Errors: 0, Skipped: 0, Time elapsed: 1.779 sec - in com.squareup.javapoet.TypeSpecTest
Running com.squareup.javapoet.TypesTest
Tests run: 20, Failures: 0, Errors: 0, Skipped: 0, Time elapsed: 0.297 sec - in com.squareup.javapoet.TypesTest
Running com.squareup.javapoet.CodeBlockTest
Tests run: 36, Failures: 0, Errors: 0, Skipped: 0, Time elapsed: 0.035 sec - in com.squareup.javapoet.CodeBlockTest
Running com.squareup.javapoet.NameAllocatorTest
Tests run: 11, Failures: 0, Errors: 0, Skipped: 0, Time elapsed: 0.009 sec - in com.squareup.javapoet.NameAllocatorTest

Results :

Tests run: 342, Failures: 0, Errors: 0, Skipped: 1

[INFO] 
[INFO] --- maven-jar-plugin:3.0.2:jar (default-jar) @ javapoet ---
[INFO] Building jar: /builds/workspace/JavaWriter/target/javapoet-1.12.0-SNAPSHOT.jar
[INFO] 
[INFO] --- maven-install-plugin:2.5.2:install (default-install) @ javapoet ---
[INFO] Installing /builds/workspace/JavaWriter/target/javapoet-1.12.0-SNAPSHOT.jar to /builds/.m2/repository/com/squareup/javapoet/1.12.0-SNAPSHOT/javapoet-1.12.0-SNAPSHOT.jar
[INFO] Installing /builds/workspace/JavaWriter/pom.xml to /builds/.m2/repository/com/squareup/javapoet/1.12.0-SNAPSHOT/javapoet-1.12.0-SNAPSHOT.pom
[INFO] ------------------------------------------------------------------------
[INFO] BUILD SUCCESS
[INFO] ------------------------------------------------------------------------
[INFO] Total time: 24.318 s
[INFO] Finished at: 2019-12-04T01:30:29+01:00
[INFO] Final Memory: 44M/199M
[INFO] ------------------------------------------------------------------------
 
--- Displays results of the maven compile ---
Time to compile: 25955
Number of tests: 342
Number of tests skipped: 1
Number of failures in tests: 0
Number of errors in tests: 0
 
-------------------------------------------------------
Inserts the maven plugin to spoon the project
-------------------------------------------------------
 
Picked up JAVA_TOOL_OPTIONS: -Dfile.encoding=UTF8
[INFO] Scanning for projects...
Downloading: https://repo.maven.apache.org/maven2/fr/inria/gforge/spoon/spoon-maven-plugin/3.1/spoon-maven-plugin-3.1.pom

[WARNING] Failed to retrieve plugin descriptor for fr.inria.gforge.spoon:spoon-maven-plugin:3.1: Plugin fr.inria.gforge.spoon:spoon-maven-plugin:3.1 or one of its dependencies could not be resolved: Failed to read artifact descriptor for fr.inria.gforge.spoon:spoon-maven-plugin:jar:3.1
[INFO]                                                                         
[INFO] ------------------------------------------------------------------------
[INFO] Building JavaPoet 1.12.0-SNAPSHOT
[INFO] ------------------------------------------------------------------------
[WARNING] Failed to retrieve plugin descriptor for fr.inria.gforge.spoon:spoon-maven-plugin:3.1: Plugin fr.inria.gforge.spoon:spoon-maven-plugin:3.1 or one of its dependencies could not be resolved: Failed to read artifact descriptor for fr.inria.gforge.spoon:spoon-maven-plugin:jar:3.1
[INFO] 
[INFO] --- maven-dependency-plugin:2.8:purge-local-repository (default-cli) @ javapoet ---
[INFO] ------------------------------------------------------------------------
[INFO] BUILD SUCCESS
[INFO] ------------------------------------------------------------------------
[INFO] Total time: 11.661 s
[INFO] Finished at: 2019-12-04T01:30:43+01:00
[INFO] Final Memory: 16M/151M
[INFO] ------------------------------------------------------------------------
Picked up JAVA_TOOL_OPTIONS: -Dfile.encoding=UTF8
[INFO] Scanning for projects...
[INFO]                                                                         
[INFO] ------------------------------------------------------------------------
[INFO] Building JavaPoet 1.12.0-SNAPSHOT
[INFO] ------------------------------------------------------------------------
Downloading: https://repo.maven.apache.org/maven2/fr/inria/gforge/spoon/spoon-maven-plugin/3.1/spoon-maven-plugin-3.1.pom

[INFO] ------------------------------------------------------------------------
[INFO] BUILD FAILURE
[INFO] ------------------------------------------------------------------------
[INFO] Total time: 10.800 s
[INFO] Finished at: 2019-12-04T01:30:55+01:00
[INFO] Final Memory: 9M/145M
[INFO] ------------------------------------------------------------------------
[ERROR] Plugin fr.inria.gforge.spoon:spoon-maven-plugin:3.1 or one of its dependencies could not be resolved: Failed to read artifact descriptor for fr.inria.gforge.spoon:spoon-maven-plugin:jar:3.1: Could not transfer artifact fr.inria.gforge.spoon:spoon-maven-plugin:pom:3.1 from/to central (https://repo.maven.apache.org/maven2): repo.maven.apache.org: Temporary failure in name resolution: Unknown host repo.maven.apache.org: Temporary failure in name resolution -> [Help 1]
[ERROR] 
[ERROR] To see the full stack trace of the errors, re-run Maven with the -e switch.
[ERROR] Re-run Maven using the -X switch to enable full debug logging.
[ERROR] 
[ERROR] For more information about the errors and possible solutions, please read the following articles:
[ERROR] [Help 1] http://cwiki.apache.org/confluence/display/MAVEN/PluginResolutionException
Error: Maven compile with spoon unsuccessful!
Build step 'Execute shell' marked build as failure
Archiving artifacts
/net/www/ci/sos/jobs/JavaWriter/builds/1550/archive does not exist.
ERROR: Step ‘Publish XML Summary Reports’ failed: /net/www/ci/sos/jobs/JavaWriter/builds/1550/archive does not exist.
Finished: FAILURE