FailedConsole Output

Started by timer
Running as SYSTEM
[EnvInject] - Loading node environment variables.
Building remotely on sos-builder01 (lin) in workspace /builds/workspace/Moshi
No credentials specified
 > git rev-parse --is-inside-work-tree # timeout=10
Fetching changes from the remote Git repository
 > git config remote.origin.url https://github.com/square/moshi.git # timeout=10
Fetching upstream changes from https://github.com/square/moshi.git
 > git --version # timeout=10
 > git fetch --tags --progress https://github.com/square/moshi.git +refs/heads/*:refs/remotes/origin/*
 > git rev-parse 8c18caf5742a53791b036bf5dc78e41c00f82f7a^{commit} # timeout=10
Checking out Revision 8c18caf5742a53791b036bf5dc78e41c00f82f7a (detached)
 > git config core.sparsecheckout # timeout=10
 > git checkout -f 8c18caf5742a53791b036bf5dc78e41c00f82f7a
Commit message: "Add a test to confirm types are canonicalized. (#278)"
 > git rev-list --no-walk 8c18caf5742a53791b036bf5dc78e41c00f82f7a # timeout=10
[Moshi] $ /bin/sh -xe /tmp/jenkins5273704674002106630.sh
+ curl http://spoon.gforge.inria.fr/jenkins/build.sh
+ stdbuf -i 50k bash
  % Total    % Received % Xferd  Average Speed   Time    Time     Time  Current
                                 Dload  Upload   Total   Spent    Left  Speed

  0     0    0     0    0     0      0      0 --:--:-- --:--:-- --:--:--     0 
-------------------------------------------------------
Initizalizes project
-------------------------------------------------------
 

100 21193  100 21193    0     0  1540k      0 --:--:-- --:--:-- --:--:-- 1592k
HEAD is now at 8c18caf Add a test to confirm types are canonicalized. (#278)

--- Displays variables used in the build ---
Artifact id: moshi-parent
Version: 1.5.0-SNAPSHOT
Modules job:
- moshi/q
- examples/q
- adapters/q
Has checkstyle: true
Has enforcer: true
Git version id: 8c18caf5742a53791b036bf5dc78e41c00f82f7a
Java version: Picked up JAVA_TOOL_OPTIONS: -Dfile.encoding=UTF8
java version "1.8.0_151"
Java(TM) SE Runtime Environment (build 1.8.0_151-b12)
Java HotSpot(TM) 64-Bit Server VM (build 25.151-b12, mixed mode)
Java home: /builds/tools/hudson.model.JDK/JDK_8.0.151
 
-------------------------------------------------------
Compiles project (at the root project if it's a multi module project) without spoon
-------------------------------------------------------
 
Picked up JAVA_TOOL_OPTIONS: -Dfile.encoding=UTF8
[INFO] Scanning for projects...
[INFO] ------------------------------------------------------------------------
[INFO] Reactor Build Order:
[INFO] 
[INFO] Moshi (Parent)
[INFO] Moshi
[INFO] moshi-adapters
[INFO] moshi-examples
[INFO]                                                                         
[INFO] ------------------------------------------------------------------------
[INFO] Building Moshi (Parent) 1.5.0-SNAPSHOT
[INFO] ------------------------------------------------------------------------
[INFO] 
[INFO] --- maven-clean-plugin:2.5:clean (default-clean) @ moshi-parent ---
[INFO] 
[INFO] --- maven-enforcer-plugin:1.0:enforce (enforce-maven) @ moshi-parent ---
[INFO] 
[INFO] --- maven-install-plugin:2.5.2:install (default-install) @ moshi-parent ---
[INFO] Installing /builds/workspace/Moshi/pom.xml to /builds/.m2/repository/com/squareup/moshi/moshi-parent/1.5.0-SNAPSHOT/moshi-parent-1.5.0-SNAPSHOT.pom
[INFO]                                                                         
[INFO] ------------------------------------------------------------------------
[INFO] Building Moshi 1.5.0-SNAPSHOT
[INFO] ------------------------------------------------------------------------
[INFO] 
[INFO] --- maven-clean-plugin:2.5:clean (default-clean) @ moshi ---
[INFO] Deleting /builds/workspace/Moshi/moshi/target
[INFO] 
[INFO] --- maven-enforcer-plugin:1.0:enforce (enforce-maven) @ moshi ---
[INFO] 
[INFO] --- maven-resources-plugin:2.6:resources (default-resources) @ moshi ---
[INFO] Using 'UTF-8' encoding to copy filtered resources.
[INFO] skip non existing resourceDirectory /builds/workspace/Moshi/moshi/src/main/resources
[INFO] 
[INFO] --- maven-compiler-plugin:3.3:compile (default-compile) @ moshi ---
[INFO] Changes detected - recompiling the module!
[INFO] Compiling 26 source files to /builds/workspace/Moshi/moshi/target/classes
Note: /builds/workspace/Moshi/moshi/src/main/java/com/squareup/moshi/StandardJsonAdapters.java uses unchecked or unsafe operations.
Note: Recompile with -Xlint:unchecked for details.
[INFO] 
[INFO] --- maven-resources-plugin:2.6:testResources (default-testResources) @ moshi ---
[INFO] Using 'UTF-8' encoding to copy filtered resources.
[INFO] skip non existing resourceDirectory /builds/workspace/Moshi/moshi/src/test/resources
[INFO] 
[INFO] --- maven-compiler-plugin:3.3:testCompile (default-testCompile) @ moshi ---
[INFO] Changes detected - recompiling the module!
[INFO] Compiling 22 source files to /builds/workspace/Moshi/moshi/target/test-classes
[INFO] 
[INFO] --- maven-surefire-plugin:2.17:test (default-test) @ moshi ---
[INFO] Surefire report directory: /builds/workspace/Moshi/moshi/target/surefire-reports

-------------------------------------------------------
 T E S T S
-------------------------------------------------------
Picked up JAVA_TOOL_OPTIONS: -Dfile.encoding=UTF8
Running com.squareup.moshi.JsonUtf8ReaderTest
Tests run: 89, Failures: 0, Errors: 0, Skipped: 5, Time elapsed: 0.239 sec - in com.squareup.moshi.JsonUtf8ReaderTest
Running com.squareup.moshi.JsonWriterTest
Tests run: 82, Failures: 0, Errors: 0, Skipped: 2, Time elapsed: 0.086 sec - in com.squareup.moshi.JsonWriterTest
Running com.squareup.moshi.MapJsonAdapterTest
Tests run: 8, Failures: 0, Errors: 0, Skipped: 0, Time elapsed: 0.022 sec - in com.squareup.moshi.MapJsonAdapterTest
Running com.squareup.moshi.JsonWriterPathTest
Tests run: 18, Failures: 0, Errors: 0, Skipped: 1, Time elapsed: 0.023 sec - in com.squareup.moshi.JsonWriterPathTest
Running com.squareup.moshi.ClassJsonAdapterTest
Tests run: 24, Failures: 0, Errors: 0, Skipped: 0, Time elapsed: 0.049 sec - in com.squareup.moshi.ClassJsonAdapterTest
Running com.squareup.moshi.JsonReaderPathTest
Tests run: 20, Failures: 0, Errors: 0, Skipped: 1, Time elapsed: 0.025 sec - in com.squareup.moshi.JsonReaderPathTest
Running com.squareup.moshi.JsonValueReaderTest
Tests run: 23, Failures: 0, Errors: 0, Skipped: 0, Time elapsed: 0.017 sec - in com.squareup.moshi.JsonValueReaderTest
Running com.squareup.moshi.MoshiTest
Tests run: 50, Failures: 0, Errors: 0, Skipped: 0, Time elapsed: 0.214 sec - in com.squareup.moshi.MoshiTest
Running com.squareup.moshi.LinkedHashTreeMapTest
Tests run: 15, Failures: 0, Errors: 0, Skipped: 0, Time elapsed: 0.013 sec - in com.squareup.moshi.LinkedHashTreeMapTest
Running com.squareup.moshi.CircularAdaptersTest
Tests run: 2, Failures: 0, Errors: 0, Skipped: 0, Time elapsed: 0.005 sec - in com.squareup.moshi.CircularAdaptersTest
Running com.squareup.moshi.AdapterMethodsTest
Tests run: 27, Failures: 0, Errors: 0, Skipped: 0, Time elapsed: 0.032 sec - in com.squareup.moshi.AdapterMethodsTest
Running com.squareup.moshi.JsonAdapterTest
Tests run: 10, Failures: 0, Errors: 0, Skipped: 1, Time elapsed: 0.01 sec - in com.squareup.moshi.JsonAdapterTest
Running com.squareup.moshi.JsonQualifiersTest
Tests run: 13, Failures: 0, Errors: 0, Skipped: 0, Time elapsed: 0.053 sec - in com.squareup.moshi.JsonQualifiersTest
Running com.squareup.moshi.PromoteNameToValueTest
Tests run: 42, Failures: 0, Errors: 0, Skipped: 0, Time elapsed: 0.022 sec - in com.squareup.moshi.PromoteNameToValueTest
Running com.squareup.moshi.JsonReaderTest
Tests run: 130, Failures: 0, Errors: 0, Skipped: 4, Time elapsed: 0.049 sec - in com.squareup.moshi.JsonReaderTest
Running com.squareup.moshi.TypesTest
Tests run: 17, Failures: 0, Errors: 0, Skipped: 0, Time elapsed: 0.023 sec - in com.squareup.moshi.TypesTest
Running com.squareup.moshi.JsonValueWriterTest
Tests run: 9, Failures: 0, Errors: 0, Skipped: 0, Time elapsed: 0 sec - in com.squareup.moshi.JsonValueWriterTest
Running com.squareup.moshi.ObjectAdapterTest
Tests run: 10, Failures: 0, Errors: 0, Skipped: 1, Time elapsed: 0.006 sec - in com.squareup.moshi.ObjectAdapterTest
Running com.squareup.moshi.JsonUtf8WriterTest
Tests run: 3, Failures: 0, Errors: 0, Skipped: 0, Time elapsed: 0.002 sec - in com.squareup.moshi.JsonUtf8WriterTest

Results :

Tests run: 592, Failures: 0, Errors: 0, Skipped: 15

[INFO] 
[INFO] --- maven-jar-plugin:2.4:jar (default-jar) @ moshi ---
[INFO] Building jar: /builds/workspace/Moshi/moshi/target/moshi-1.5.0-SNAPSHOT.jar
[INFO] 
[INFO] --- maven-install-plugin:2.5.2:install (default-install) @ moshi ---
[INFO] Installing /builds/workspace/Moshi/moshi/target/moshi-1.5.0-SNAPSHOT.jar to /builds/.m2/repository/com/squareup/moshi/moshi/1.5.0-SNAPSHOT/moshi-1.5.0-SNAPSHOT.jar
[INFO] Installing /builds/workspace/Moshi/moshi/pom.xml to /builds/.m2/repository/com/squareup/moshi/moshi/1.5.0-SNAPSHOT/moshi-1.5.0-SNAPSHOT.pom
[INFO]                                                                         
[INFO] ------------------------------------------------------------------------
[INFO] Building moshi-adapters 1.5.0-SNAPSHOT
[INFO] ------------------------------------------------------------------------
[INFO] 
[INFO] --- maven-clean-plugin:2.5:clean (default-clean) @ moshi-adapters ---
[INFO] Deleting /builds/workspace/Moshi/adapters/target
[INFO] 
[INFO] --- maven-enforcer-plugin:1.0:enforce (enforce-maven) @ moshi-adapters ---
[INFO] 
[INFO] --- maven-resources-plugin:2.6:resources (default-resources) @ moshi-adapters ---
[INFO] Using 'UTF-8' encoding to copy filtered resources.
[INFO] skip non existing resourceDirectory /builds/workspace/Moshi/adapters/src/main/resources
[INFO] 
[INFO] --- maven-compiler-plugin:3.3:compile (default-compile) @ moshi-adapters ---
[INFO] Changes detected - recompiling the module!
[INFO] Compiling 3 source files to /builds/workspace/Moshi/adapters/target/classes
[INFO] 
[INFO] --- maven-resources-plugin:2.6:testResources (default-testResources) @ moshi-adapters ---
[INFO] Using 'UTF-8' encoding to copy filtered resources.
[INFO] skip non existing resourceDirectory /builds/workspace/Moshi/adapters/src/test/resources
[INFO] 
[INFO] --- maven-compiler-plugin:3.3:testCompile (default-testCompile) @ moshi-adapters ---
[INFO] Changes detected - recompiling the module!
[INFO] Compiling 1 source file to /builds/workspace/Moshi/adapters/target/test-classes
[INFO] 
[INFO] --- maven-surefire-plugin:2.17:test (default-test) @ moshi-adapters ---
[INFO] Surefire report directory: /builds/workspace/Moshi/adapters/target/surefire-reports

-------------------------------------------------------
 T E S T S
-------------------------------------------------------
Picked up JAVA_TOOL_OPTIONS: -Dfile.encoding=UTF8
Running com.squareup.moshi.Rfc3339DateJsonAdapterTest
Tests run: 3, Failures: 0, Errors: 0, Skipped: 0, Time elapsed: 0.153 sec - in com.squareup.moshi.Rfc3339DateJsonAdapterTest

Results :

Tests run: 3, Failures: 0, Errors: 0, Skipped: 0

[INFO] 
[INFO] --- maven-jar-plugin:2.4:jar (default-jar) @ moshi-adapters ---
[INFO] Building jar: /builds/workspace/Moshi/adapters/target/moshi-adapters-1.5.0-SNAPSHOT.jar
[INFO] 
[INFO] --- maven-install-plugin:2.5.2:install (default-install) @ moshi-adapters ---
[INFO] Installing /builds/workspace/Moshi/adapters/target/moshi-adapters-1.5.0-SNAPSHOT.jar to /builds/.m2/repository/com/squareup/moshi/moshi-adapters/1.5.0-SNAPSHOT/moshi-adapters-1.5.0-SNAPSHOT.jar
[INFO] Installing /builds/workspace/Moshi/adapters/pom.xml to /builds/.m2/repository/com/squareup/moshi/moshi-adapters/1.5.0-SNAPSHOT/moshi-adapters-1.5.0-SNAPSHOT.pom
[INFO]                                                                         
[INFO] ------------------------------------------------------------------------
[INFO] Building moshi-examples 1.5.0-SNAPSHOT
[INFO] ------------------------------------------------------------------------
[INFO] 
[INFO] --- maven-clean-plugin:2.5:clean (default-clean) @ moshi-examples ---
[INFO] Deleting /builds/workspace/Moshi/examples/target
[INFO] 
[INFO] --- maven-enforcer-plugin:1.0:enforce (enforce-maven) @ moshi-examples ---
[INFO] 
[INFO] --- maven-resources-plugin:2.6:resources (default-resources) @ moshi-examples ---
[INFO] Using 'UTF-8' encoding to copy filtered resources.
[INFO] skip non existing resourceDirectory /builds/workspace/Moshi/examples/src/main/resources
[INFO] 
[INFO] --- maven-compiler-plugin:3.3:compile (default-compile) @ moshi-examples ---
[INFO] Changes detected - recompiling the module!
[INFO] Compiling 18 source files to /builds/workspace/Moshi/examples/target/classes
[INFO] 
[INFO] --- maven-resources-plugin:2.6:testResources (default-testResources) @ moshi-examples ---
[INFO] Using 'UTF-8' encoding to copy filtered resources.
[INFO] skip non existing resourceDirectory /builds/workspace/Moshi/examples/src/test/resources
[INFO] 
[INFO] --- maven-compiler-plugin:3.3:testCompile (default-testCompile) @ moshi-examples ---
[INFO] No sources to compile
[INFO] 
[INFO] --- maven-surefire-plugin:2.17:test (default-test) @ moshi-examples ---
[INFO] No tests to run.
[INFO] 
[INFO] --- maven-jar-plugin:2.4:jar (default-jar) @ moshi-examples ---
[INFO] Building jar: /builds/workspace/Moshi/examples/target/moshi-examples-1.5.0-SNAPSHOT.jar
[INFO] 
[INFO] --- maven-install-plugin:2.5.2:install (default-install) @ moshi-examples ---
[INFO] Installing /builds/workspace/Moshi/examples/target/moshi-examples-1.5.0-SNAPSHOT.jar to /builds/.m2/repository/com/squareup/moshi/moshi-examples/1.5.0-SNAPSHOT/moshi-examples-1.5.0-SNAPSHOT.jar
[INFO] Installing /builds/workspace/Moshi/examples/pom.xml to /builds/.m2/repository/com/squareup/moshi/moshi-examples/1.5.0-SNAPSHOT/moshi-examples-1.5.0-SNAPSHOT.pom
[INFO] ------------------------------------------------------------------------
[INFO] Reactor Summary:
[INFO] 
[INFO] Moshi (Parent) ..................................... SUCCESS [  0.657 s]
[INFO] Moshi .............................................. SUCCESS [  9.133 s]
[INFO] moshi-adapters ..................................... SUCCESS [  0.596 s]
[INFO] moshi-examples ..................................... SUCCESS [  0.277 s]
[INFO] ------------------------------------------------------------------------
[INFO] BUILD SUCCESS
[INFO] ------------------------------------------------------------------------
[INFO] Total time: 10.868 s
[INFO] Finished at: 2019-10-06T17:52:17+02:00
[INFO] Final Memory: 28M/204M
[INFO] ------------------------------------------------------------------------
bash: line 96: bc: command not found
 
--- Displays results of the maven compile ---
Time to compile: 
Number of tests: 3
Number of tests skipped: 0
Number of failures in tests: 0
Number of errors in tests: 0
 
-------------------------------------------------------
Inserts the maven plugin to spoon the project
-------------------------------------------------------
 
Picked up JAVA_TOOL_OPTIONS: -Dfile.encoding=UTF8
[INFO] Scanning for projects...
[INFO] ------------------------------------------------------------------------
[INFO] Reactor Build Order:
[INFO] 
[INFO] Moshi (Parent)
[INFO] Moshi
[INFO] moshi-adapters
[INFO] moshi-examples
[INFO]                                                                         
[INFO] ------------------------------------------------------------------------
[INFO] Building Moshi (Parent) 1.5.0-SNAPSHOT
[INFO] ------------------------------------------------------------------------
[INFO] 
[INFO] --- maven-dependency-plugin:2.8:purge-local-repository (default-cli) @ moshi-parent ---
[INFO]                                                                         
[INFO] ------------------------------------------------------------------------
[INFO] Building Moshi 1.5.0-SNAPSHOT
[INFO] ------------------------------------------------------------------------
[INFO] 
[INFO] --- maven-dependency-plugin:2.8:purge-local-repository (default-cli) @ moshi ---
[INFO]                                                                         
[INFO] ------------------------------------------------------------------------
[INFO] Building moshi-adapters 1.5.0-SNAPSHOT
[INFO] ------------------------------------------------------------------------
[INFO] 
[INFO] --- maven-dependency-plugin:2.8:purge-local-repository (default-cli) @ moshi-adapters ---
[INFO]                                                                         
[INFO] ------------------------------------------------------------------------
[INFO] Building moshi-examples 1.5.0-SNAPSHOT
[INFO] ------------------------------------------------------------------------
[INFO] 
[INFO] --- maven-dependency-plugin:2.8:purge-local-repository (default-cli) @ moshi-examples ---
[INFO] ------------------------------------------------------------------------
[INFO] Reactor Summary:
[INFO] 
[INFO] Moshi (Parent) ..................................... SUCCESS [  0.577 s]
[INFO] Moshi .............................................. SUCCESS [  0.025 s]
[INFO] moshi-adapters ..................................... SUCCESS [  0.004 s]
[INFO] moshi-examples ..................................... SUCCESS [  0.002 s]
[INFO] ------------------------------------------------------------------------
[INFO] BUILD SUCCESS
[INFO] ------------------------------------------------------------------------
[INFO] Total time: 0.992 s
[INFO] Finished at: 2019-10-06T17:52:20+02:00
[INFO] Final Memory: 18M/161M
[INFO] ------------------------------------------------------------------------
Picked up JAVA_TOOL_OPTIONS: -Dfile.encoding=UTF8
[INFO] Scanning for projects...
[INFO] ------------------------------------------------------------------------
[INFO] Reactor Build Order:
[INFO] 
[INFO] Moshi (Parent)
[INFO] Moshi
[INFO] moshi-adapters
[INFO] moshi-examples
[INFO]                                                                         
[INFO] ------------------------------------------------------------------------
[INFO] Building Moshi (Parent) 1.5.0-SNAPSHOT
[INFO] ------------------------------------------------------------------------
[INFO] 
[INFO] --- maven-clean-plugin:2.5:clean (default-clean) @ moshi-parent ---
[INFO] 
[INFO] --- maven-enforcer-plugin:1.0:enforce (enforce-maven) @ moshi-parent ---
[INFO] 
[INFO] --- spoon-maven-plugin:3.1:generate (default) @ moshi-parent ---
Downloading: https://oss.sonatype.org/content/repositories/snapshots/fr/inria/gforge/spoon/spoon-core/maven-metadata.xml
Downloading: https://repo.maven.apache.org/maven2/fr/inria/gforge/spoon/spoon-core/maven-metadata.xml
Downloading: http://maven.inria.fr/artifactory/spoon-public-snapshot/fr/inria/gforge/spoon/spoon-core/maven-metadata.xml
567/567 B   
            
Downloaded: http://maven.inria.fr/artifactory/spoon-public-snapshot/fr/inria/gforge/spoon/spoon-core/maven-metadata.xml (567 B at 4.3 KB/sec)
3/3 KB      
3/3 KB   
         
Downloaded: https://repo.maven.apache.org/maven2/fr/inria/gforge/spoon/spoon-core/maven-metadata.xml (3 KB at 9.1 KB/sec)
         
Downloading: https://repo.maven.apache.org/maven2/fr/inria/gforge/spoon/spoon-core/7.0.0/spoon-core-7.0.0.pom
3/22 KB   
5/22 KB   
8/22 KB   
11/22 KB   
13/22 KB   
16/22 KB   
19/22 KB   
21/22 KB   
22/22 KB   
           
Downloaded: https://repo.maven.apache.org/maven2/fr/inria/gforge/spoon/spoon-core/7.0.0/spoon-core-7.0.0.pom (22 KB at 849.8 KB/sec)
Downloading: http://maven.inria.fr/artifactory/spoon-public-snapshot/fr/inria/gforge/spoon/spoon-core/7.1.0-SNAPSHOT/maven-metadata.xml
Downloading: https://oss.sonatype.org/content/repositories/snapshots/fr/inria/gforge/spoon/spoon-core/7.1.0-SNAPSHOT/maven-metadata.xml
1017/1017 B   
              
Downloaded: http://maven.inria.fr/artifactory/spoon-public-snapshot/fr/inria/gforge/spoon/spoon-core/7.1.0-SNAPSHOT/maven-metadata.xml (1017 B at 33.1 KB/sec)
              
Downloading: http://maven.inria.fr/artifactory/spoon-public-snapshot/fr/inria/gforge/spoon/spoon-core/7.1.0-SNAPSHOT/spoon-core-7.1.0-20181011.225349-264.pom
4/23 KB       
8/23 KB   
12/23 KB   
13/23 KB   
17/23 KB   
21/23 KB   
23/23 KB   
           
Downloaded: http://maven.inria.fr/artifactory/spoon-public-snapshot/fr/inria/gforge/spoon/spoon-core/7.1.0-SNAPSHOT/spoon-core-7.1.0-20181011.225349-264.pom (23 KB at 647.5 KB/sec)
Downloading: https://repo.maven.apache.org/maven2/fr/inria/gforge/spoon/spoon-core/7.1.0/spoon-core-7.1.0.pom
3/23 KB    
5/23 KB   
8/23 KB   
11/23 KB   
13/23 KB   
16/23 KB   
19/23 KB   
21/23 KB   
23/23 KB   
           
Downloaded: https://repo.maven.apache.org/maven2/fr/inria/gforge/spoon/spoon-core/7.1.0/spoon-core-7.1.0.pom (23 KB at 1158.2 KB/sec)
Downloading: http://maven.inria.fr/artifactory/spoon-public-snapshot/fr/inria/gforge/spoon/spoon-core/7.2.0-SNAPSHOT/maven-metadata.xml
Downloading: https://oss.sonatype.org/content/repositories/snapshots/fr/inria/gforge/spoon/spoon-core/7.2.0-SNAPSHOT/maven-metadata.xml
1017/1017 B   
              
Downloaded: http://maven.inria.fr/artifactory/spoon-public-snapshot/fr/inria/gforge/spoon/spoon-core/7.2.0-SNAPSHOT/maven-metadata.xml (1017 B at 30.1 KB/sec)
              
Downloading: http://maven.inria.fr/artifactory/spoon-public-snapshot/fr/inria/gforge/spoon/spoon-core/7.2.0-SNAPSHOT/spoon-core-7.2.0-20181204.080422-141.pom
4/7 KB        
7/7 KB   
         
Downloaded: http://maven.inria.fr/artifactory/spoon-public-snapshot/fr/inria/gforge/spoon/spoon-core/7.2.0-SNAPSHOT/spoon-core-7.2.0-20181204.080422-141.pom (7 KB at 198.9 KB/sec)
Downloading: https://repo.maven.apache.org/maven2/fr/inria/gforge/spoon/spoon-core/7.2.0/spoon-core-7.2.0.pom
3/7 KB   
5/7 KB   
7/7 KB   
         
Downloaded: https://repo.maven.apache.org/maven2/fr/inria/gforge/spoon/spoon-core/7.2.0/spoon-core-7.2.0.pom (7 KB at 675.4 KB/sec)
Downloading: http://maven.inria.fr/artifactory/spoon-public-snapshot/fr/inria/gforge/spoon/spoon-core/7.3.0-SNAPSHOT/maven-metadata.xml
Downloading: https://oss.sonatype.org/content/repositories/snapshots/fr/inria/gforge/spoon/spoon-core/7.3.0-SNAPSHOT/maven-metadata.xml
1013/1013 B   
              
Downloaded: http://maven.inria.fr/artifactory/spoon-public-snapshot/fr/inria/gforge/spoon/spoon-core/7.3.0-SNAPSHOT/maven-metadata.xml (1013 B at 41.2 KB/sec)
              
Downloading: http://maven.inria.fr/artifactory/spoon-public-snapshot/fr/inria/gforge/spoon/spoon-core/7.3.0-SNAPSHOT/spoon-core-7.3.0-20190210.234149-97.pom
3/7 KB        
7/7 KB   
7/7 KB   
         
Downloaded: http://maven.inria.fr/artifactory/spoon-public-snapshot/fr/inria/gforge/spoon/spoon-core/7.3.0-SNAPSHOT/spoon-core-7.3.0-20190210.234149-97.pom (7 KB at 253.6 KB/sec)
Downloading: https://repo.maven.apache.org/maven2/fr/inria/gforge/spoon/spoon-core/7.3.0/spoon-core-7.3.0.pom
3/7 KB   
5/7 KB   
7/7 KB   
         
Downloaded: https://repo.maven.apache.org/maven2/fr/inria/gforge/spoon/spoon-core/7.3.0/spoon-core-7.3.0.pom (7 KB at 470.4 KB/sec)
Downloading: https://repo.maven.apache.org/maven2/fr/inria/gforge/spoon/spoon-core/7.4.0-beta-09/spoon-core-7.4.0-beta-09.pom
3/7 KB   
5/7 KB   
7/7 KB   
         
Downloaded: https://repo.maven.apache.org/maven2/fr/inria/gforge/spoon/spoon-core/7.4.0-beta-09/spoon-core-7.4.0-beta-09.pom (7 KB at 379.0 KB/sec)
Downloading: https://repo.maven.apache.org/maven2/fr/inria/gforge/spoon/spoon-core/7.4.0-beta-10/spoon-core-7.4.0-beta-10.pom
3/7 KB   
5/7 KB   
7/7 KB   
         
Downloaded: https://repo.maven.apache.org/maven2/fr/inria/gforge/spoon/spoon-core/7.4.0-beta-10/spoon-core-7.4.0-beta-10.pom (7 KB at 585.8 KB/sec)
Downloading: https://repo.maven.apache.org/maven2/fr/inria/gforge/spoon/spoon-core/7.4.0-beta-11/spoon-core-7.4.0-beta-11.pom
3/7 KB   
5/7 KB   
7/7 KB   
         
Downloaded: https://repo.maven.apache.org/maven2/fr/inria/gforge/spoon/spoon-core/7.4.0-beta-11/spoon-core-7.4.0-beta-11.pom (7 KB at 715.9 KB/sec)
Downloading: https://repo.maven.apache.org/maven2/fr/inria/gforge/spoon/spoon-core/7.4.0-beta-12/spoon-core-7.4.0-beta-12.pom
3/7 KB   
5/7 KB   
7/7 KB   
         
Downloaded: https://repo.maven.apache.org/maven2/fr/inria/gforge/spoon/spoon-core/7.4.0-beta-12/spoon-core-7.4.0-beta-12.pom (7 KB at 460.2 KB/sec)
Downloading: https://repo.maven.apache.org/maven2/fr/inria/gforge/spoon/spoon-core/7.4.0-beta-13/spoon-core-7.4.0-beta-13.pom
3/7 KB   
5/7 KB   
7/7 KB   
         
Downloaded: https://repo.maven.apache.org/maven2/fr/inria/gforge/spoon/spoon-core/7.4.0-beta-13/spoon-core-7.4.0-beta-13.pom (7 KB at 495.6 KB/sec)
Downloading: https://repo.maven.apache.org/maven2/fr/inria/gforge/spoon/spoon-core/7.4.0-beta-14/spoon-core-7.4.0-beta-14.pom
3/7 KB   
5/7 KB   
7/7 KB   
         
Downloaded: https://repo.maven.apache.org/maven2/fr/inria/gforge/spoon/spoon-core/7.4.0-beta-14/spoon-core-7.4.0-beta-14.pom (7 KB at 585.8 KB/sec)
Downloading: https://repo.maven.apache.org/maven2/fr/inria/gforge/spoon/spoon-core/7.4.0-beta-15/spoon-core-7.4.0-beta-15.pom
3/7 KB   
5/7 KB   
7/7 KB   
         
Downloaded: https://repo.maven.apache.org/maven2/fr/inria/gforge/spoon/spoon-core/7.4.0-beta-15/spoon-core-7.4.0-beta-15.pom (7 KB at 585.8 KB/sec)
Downloading: https://repo.maven.apache.org/maven2/fr/inria/gforge/spoon/spoon-core/7.4.0-beta-16/spoon-core-7.4.0-beta-16.pom
3/7 KB   
5/7 KB   
7/7 KB   
         
Downloaded: https://repo.maven.apache.org/maven2/fr/inria/gforge/spoon/spoon-core/7.4.0-beta-16/spoon-core-7.4.0-beta-16.pom (7 KB at 585.8 KB/sec)
Downloading: https://repo.maven.apache.org/maven2/fr/inria/gforge/spoon/spoon-core/7.4.0-beta-17/spoon-core-7.4.0-beta-17.pom
3/7 KB   
5/7 KB   
7/7 KB   
         
Downloaded: https://repo.maven.apache.org/maven2/fr/inria/gforge/spoon/spoon-core/7.4.0-beta-17/spoon-core-7.4.0-beta-17.pom (7 KB at 644.3 KB/sec)
Downloading: https://repo.maven.apache.org/maven2/fr/inria/gforge/spoon/spoon-core/7.4.0-beta-18/spoon-core-7.4.0-beta-18.pom
3/7 KB   
5/7 KB   
7/7 KB   
         
Downloaded: https://repo.maven.apache.org/maven2/fr/inria/gforge/spoon/spoon-core/7.4.0-beta-18/spoon-core-7.4.0-beta-18.pom (7 KB at 536.9 KB/sec)
Downloading: https://repo.maven.apache.org/maven2/fr/inria/gforge/spoon/spoon-core/7.4.0-beta-19/spoon-core-7.4.0-beta-19.pom
3/7 KB   
5/7 KB   
7/7 KB   
         
Downloaded: https://repo.maven.apache.org/maven2/fr/inria/gforge/spoon/spoon-core/7.4.0-beta-19/spoon-core-7.4.0-beta-19.pom (7 KB at 585.8 KB/sec)
Downloading: http://maven.inria.fr/artifactory/spoon-public-snapshot/fr/inria/gforge/spoon/spoon-core/7.4.0-SNAPSHOT/maven-metadata.xml
Downloading: https://oss.sonatype.org/content/repositories/snapshots/fr/inria/gforge/spoon/spoon-core/7.4.0-SNAPSHOT/maven-metadata.xml
1017/1017 B   
              
Downloaded: http://maven.inria.fr/artifactory/spoon-public-snapshot/fr/inria/gforge/spoon/spoon-core/7.4.0-SNAPSHOT/maven-metadata.xml (1017 B at 35.5 KB/sec)
              
Downloading: http://maven.inria.fr/artifactory/spoon-public-snapshot/fr/inria/gforge/spoon/spoon-core/7.4.0-SNAPSHOT/spoon-core-7.4.0-20190510.045100-130.pom
4/7 KB        
7/7 KB   
         
Downloaded: http://maven.inria.fr/artifactory/spoon-public-snapshot/fr/inria/gforge/spoon/spoon-core/7.4.0-SNAPSHOT/spoon-core-7.4.0-20190510.045100-130.pom (7 KB at 253.6 KB/sec)
Downloading: https://repo.maven.apache.org/maven2/fr/inria/gforge/spoon/spoon-core/7.4.0/spoon-core-7.4.0.pom
3/7 KB   
5/7 KB   
7/7 KB   
         
Downloaded: https://repo.maven.apache.org/maven2/fr/inria/gforge/spoon/spoon-core/7.4.0/spoon-core-7.4.0.pom (7 KB at 495.0 KB/sec)
Downloading: https://repo.maven.apache.org/maven2/fr/inria/gforge/spoon/spoon-core/7.5.0-beta-1/spoon-core-7.5.0-beta-1.pom
3/7 KB   
5/7 KB   
7/7 KB   
         
Downloaded: https://repo.maven.apache.org/maven2/fr/inria/gforge/spoon/spoon-core/7.5.0-beta-1/spoon-core-7.5.0-beta-1.pom (7 KB at 460.2 KB/sec)
Downloading: https://repo.maven.apache.org/maven2/fr/inria/gforge/spoon/spoon-core/7.5.0-beta-2/spoon-core-7.5.0-beta-2.pom
3/7 KB   
5/7 KB   
7/7 KB   
         
Downloaded: https://repo.maven.apache.org/maven2/fr/inria/gforge/spoon/spoon-core/7.5.0-beta-2/spoon-core-7.5.0-beta-2.pom (7 KB at 495.6 KB/sec)
Downloading: https://repo.maven.apache.org/maven2/fr/inria/gforge/spoon/spoon-core/7.5.0-beta-3/spoon-core-7.5.0-beta-3.pom
3/7 KB   
5/7 KB   
7/7 KB   
         
Downloaded: https://repo.maven.apache.org/maven2/fr/inria/gforge/spoon/spoon-core/7.5.0-beta-3/spoon-core-7.5.0-beta-3.pom (7 KB at 429.5 KB/sec)
Downloading: https://repo.maven.apache.org/maven2/fr/inria/gforge/spoon/spoon-core/7.5.0-beta-4/spoon-core-7.5.0-beta-4.pom
3/7 KB   
5/7 KB   
7/7 KB   
         
Downloaded: https://repo.maven.apache.org/maven2/fr/inria/gforge/spoon/spoon-core/7.5.0-beta-4/spoon-core-7.5.0-beta-4.pom (7 KB at 322.1 KB/sec)
Downloading: https://repo.maven.apache.org/maven2/fr/inria/gforge/spoon/spoon-core/7.5.0-beta-5/spoon-core-7.5.0-beta-5.pom
3/7 KB   
5/7 KB   
7/7 KB   
         
Downloaded: https://repo.maven.apache.org/maven2/fr/inria/gforge/spoon/spoon-core/7.5.0-beta-5/spoon-core-7.5.0-beta-5.pom (7 KB at 357.9 KB/sec)
Downloading: https://repo.maven.apache.org/maven2/fr/inria/gforge/spoon/spoon-core/7.5.0-beta-6/spoon-core-7.5.0-beta-6.pom
3/7 KB   
5/7 KB   
7/7 KB   
         
Downloaded: https://repo.maven.apache.org/maven2/fr/inria/gforge/spoon/spoon-core/7.5.0-beta-6/spoon-core-7.5.0-beta-6.pom (7 KB at 536.9 KB/sec)
Downloading: https://repo.maven.apache.org/maven2/fr/inria/gforge/spoon/spoon-core/7.5.0-beta-7/spoon-core-7.5.0-beta-7.pom
3/7 KB   
5/7 KB   
7/7 KB   
         
Downloaded: https://repo.maven.apache.org/maven2/fr/inria/gforge/spoon/spoon-core/7.5.0-beta-7/spoon-core-7.5.0-beta-7.pom (7 KB at 805.3 KB/sec)
Downloading: https://repo.maven.apache.org/maven2/fr/inria/gforge/spoon/spoon-core/7.5.0-beta-8/spoon-core-7.5.0-beta-8.pom
3/7 KB   
5/7 KB   
7/7 KB   
         
Downloaded: https://repo.maven.apache.org/maven2/fr/inria/gforge/spoon/spoon-core/7.5.0-beta-8/spoon-core-7.5.0-beta-8.pom (7 KB at 715.8 KB/sec)
Downloading: https://repo.maven.apache.org/maven2/fr/inria/gforge/spoon/spoon-core/7.5.0-beta-9/spoon-core-7.5.0-beta-9.pom
3/7 KB   
5/7 KB   
7/7 KB   
         
Downloaded: https://repo.maven.apache.org/maven2/fr/inria/gforge/spoon/spoon-core/7.5.0-beta-9/spoon-core-7.5.0-beta-9.pom (7 KB at 379.0 KB/sec)
Downloading: https://repo.maven.apache.org/maven2/fr/inria/gforge/spoon/spoon-core/7.5.0-beta-20/spoon-core-7.5.0-beta-20.pom
3/7 KB   
5/7 KB   
7/7 KB   
         
Downloaded: https://repo.maven.apache.org/maven2/fr/inria/gforge/spoon/spoon-core/7.5.0-beta-20/spoon-core-7.5.0-beta-20.pom (7 KB at 402.7 KB/sec)
Downloading: https://repo.maven.apache.org/maven2/fr/inria/gforge/spoon/spoon-core/7.5.0-beta-21/spoon-core-7.5.0-beta-21.pom
3/7 KB   
5/7 KB   
7/7 KB   
         
Downloaded: https://repo.maven.apache.org/maven2/fr/inria/gforge/spoon/spoon-core/7.5.0-beta-21/spoon-core-7.5.0-beta-21.pom (7 KB at 402.7 KB/sec)
Downloading: http://maven.inria.fr/artifactory/spoon-public-snapshot/fr/inria/gforge/spoon/spoon-core/7.5.0-SNAPSHOT/maven-metadata.xml
Downloading: https://oss.sonatype.org/content/repositories/snapshots/fr/inria/gforge/spoon/spoon-core/7.5.0-SNAPSHOT/maven-metadata.xml
1017/1017 B   
              
Downloaded: http://maven.inria.fr/artifactory/spoon-public-snapshot/fr/inria/gforge/spoon/spoon-core/7.5.0-SNAPSHOT/maven-metadata.xml (1017 B at 39.7 KB/sec)
              
Downloading: http://maven.inria.fr/artifactory/spoon-public-snapshot/fr/inria/gforge/spoon/spoon-core/7.5.0-SNAPSHOT/spoon-core-7.5.0-20190727.224133-116.pom
4/7 KB        
5/7 KB   
7/7 KB   
         
Downloaded: http://maven.inria.fr/artifactory/spoon-public-snapshot/fr/inria/gforge/spoon/spoon-core/7.5.0-SNAPSHOT/spoon-core-7.5.0-20190727.224133-116.pom (7 KB at 263.8 KB/sec)
Downloading: https://repo.maven.apache.org/maven2/fr/inria/gforge/spoon/spoon-core/7.5.0/spoon-core-7.5.0.pom
3/7 KB   
5/7 KB   
7/7 KB   
         
Downloaded: https://repo.maven.apache.org/maven2/fr/inria/gforge/spoon/spoon-core/7.5.0/spoon-core-7.5.0.pom (7 KB at 715.1 KB/sec)
Downloading: https://repo.maven.apache.org/maven2/fr/inria/gforge/spoon/spoon-core/7.6.0-beta-1/spoon-core-7.6.0-beta-1.pom
3/7 KB   
5/7 KB   
7/7 KB   
         
Downloaded: https://repo.maven.apache.org/maven2/fr/inria/gforge/spoon/spoon-core/7.6.0-beta-1/spoon-core-7.6.0-beta-1.pom (7 KB at 805.3 KB/sec)
Downloading: https://repo.maven.apache.org/maven2/fr/inria/gforge/spoon/spoon-core/7.6.0-beta-2/spoon-core-7.6.0-beta-2.pom
3/7 KB   
5/7 KB   
7/7 KB   
         
Downloaded: https://repo.maven.apache.org/maven2/fr/inria/gforge/spoon/spoon-core/7.6.0-beta-2/spoon-core-7.6.0-beta-2.pom (7 KB at 585.7 KB/sec)
Downloading: https://repo.maven.apache.org/maven2/fr/inria/gforge/spoon/spoon-core/7.6.0-beta-3/spoon-core-7.6.0-beta-3.pom
3/7 KB   
5/7 KB   
7/7 KB   
         
Downloaded: https://repo.maven.apache.org/maven2/fr/inria/gforge/spoon/spoon-core/7.6.0-beta-3/spoon-core-7.6.0-beta-3.pom (7 KB at 805.3 KB/sec)
Downloading: https://repo.maven.apache.org/maven2/fr/inria/gforge/spoon/spoon-core/7.6.0-beta-4/spoon-core-7.6.0-beta-4.pom
3/7 KB   
5/7 KB   
7/7 KB   
         
Downloaded: https://repo.maven.apache.org/maven2/fr/inria/gforge/spoon/spoon-core/7.6.0-beta-4/spoon-core-7.6.0-beta-4.pom (7 KB at 644.2 KB/sec)
Downloading: https://oss.sonatype.org/content/repositories/snapshots/fr/inria/gforge/spoon/spoon-core/7.6.0-SNAPSHOT/maven-metadata.xml
Downloading: http://maven.inria.fr/artifactory/spoon-public-snapshot/fr/inria/gforge/spoon/spoon-core/7.6.0-SNAPSHOT/maven-metadata.xml
1017/1017 B   
              
Downloaded: http://maven.inria.fr/artifactory/spoon-public-snapshot/fr/inria/gforge/spoon/spoon-core/7.6.0-SNAPSHOT/maven-metadata.xml (1017 B at 31.0 KB/sec)
              
Downloading: http://maven.inria.fr/artifactory/spoon-public-snapshot/fr/inria/gforge/spoon/spoon-core/7.6.0-SNAPSHOT/spoon-core-7.6.0-20191005.224138-117.pom
4/7 KB        
7/7 KB   
         
Downloaded: http://maven.inria.fr/artifactory/spoon-public-snapshot/fr/inria/gforge/spoon/spoon-core/7.6.0-SNAPSHOT/spoon-core-7.6.0-20191005.224138-117.pom (7 KB at 274.8 KB/sec)
Downloading: http://maven.inria.fr/artifactory/spoon-public-snapshot/fr/inria/gforge/spoon/spoon-core/7.6.0-SNAPSHOT/spoon-core-7.6.0-20191005.224138-117.jar
4/1704 KB   
5/1704 KB   
9/1704 KB   
13/1704 KB   
17/1704 KB   
21/1704 KB   
25/1704 KB   
29/1704 KB   
33/1704 KB   
37/1704 KB   
41/1704 KB   
45/1704 KB   
49/1704 KB   
53/1704 KB   
54/1704 KB   
58/1704 KB   
62/1704 KB   
66/1704 KB   
70/1704 KB   
74/1704 KB   
78/1704 KB   
82/1704 KB   
86/1704 KB   
90/1704 KB   
94/1704 KB   
98/1704 KB   
102/1704 KB   
106/1704 KB   
110/1704 KB   
114/1704 KB   
118/1704 KB   
122/1704 KB   
126/1704 KB   
130/1704 KB   
134/1704 KB   
138/1704 KB   
142/1704 KB   
146/1704 KB   
150/1704 KB   
154/1704 KB   
158/1704 KB   
162/1704 KB   
166/1704 KB   
170/1704 KB   
174/1704 KB   
178/1704 KB   
182/1704 KB   
186/1704 KB   
190/1704 KB   
194/1704 KB   
198/1704 KB   
202/1704 KB   
206/1704 KB   
210/1704 KB   
214/1704 KB   
218/1704 KB   
222/1704 KB   
226/1704 KB   
230/1704 KB   
234/1704 KB   
238/1704 KB   
242/1704 KB   
246/1704 KB   
250/1704 KB   
254/1704 KB   
258/1704 KB   
262/1704 KB   
266/1704 KB   
270/1704 KB   
274/1704 KB   
278/1704 KB   
282/1704 KB   
286/1704 KB   
290/1704 KB   
294/1704 KB   
298/1704 KB   
302/1704 KB   
306/1704 KB   
310/1704 KB   
314/1704 KB   
318/1704 KB   
322/1704 KB   
326/1704 KB   
330/1704 KB   
334/1704 KB   
338/1704 KB   
342/1704 KB   
346/1704 KB   
350/1704 KB   
354/1704 KB   
358/1704 KB   
362/1704 KB   
366/1704 KB   
370/1704 KB   
374/1704 KB   
378/1704 KB   
382/1704 KB   
386/1704 KB   
390/1704 KB   
394/1704 KB   
398/1704 KB   
402/1704 KB   
406/1704 KB   
410/1704 KB   
414/1704 KB   
418/1704 KB   
422/1704 KB   
426/1704 KB   
430/1704 KB   
434/1704 KB   
438/1704 KB   
442/1704 KB   
446/1704 KB   
450/1704 KB   
454/1704 KB   
458/1704 KB   
462/1704 KB   
466/1704 KB   
470/1704 KB   
474/1704 KB   
478/1704 KB   
482/1704 KB   
486/1704 KB   
490/1704 KB   
494/1704 KB   
498/1704 KB   
502/1704 KB   
506/1704 KB   
510/1704 KB   
514/1704 KB   
518/1704 KB   
522/1704 KB   
526/1704 KB   
530/1704 KB   
534/1704 KB   
538/1704 KB   
542/1704 KB   
546/1704 KB   
550/1704 KB   
554/1704 KB   
558/1704 KB   
562/1704 KB   
566/1704 KB   
570/1704 KB   
574/1704 KB   
578/1704 KB   
582/1704 KB   
586/1704 KB   
590/1704 KB   
594/1704 KB   
598/1704 KB   
602/1704 KB   
606/1704 KB   
610/1704 KB   
614/1704 KB   
618/1704 KB   
622/1704 KB   
626/1704 KB   
630/1704 KB   
634/1704 KB   
638/1704 KB   
642/1704 KB   
646/1704 KB   
650/1704 KB   
654/1704 KB   
658/1704 KB   
662/1704 KB   
666/1704 KB   
670/1704 KB   
674/1704 KB   
678/1704 KB   
682/1704 KB   
686/1704 KB   
690/1704 KB   
694/1704 KB   
698/1704 KB   
702/1704 KB   
706/1704 KB   
710/1704 KB   
714/1704 KB   
718/1704 KB   
722/1704 KB   
726/1704 KB   
730/1704 KB   
734/1704 KB   
738/1704 KB   
742/1704 KB   
746/1704 KB   
750/1704 KB   
754/1704 KB   
758/1704 KB   
762/1704 KB   
766/1704 KB   
770/1704 KB   
774/1704 KB   
778/1704 KB   
782/1704 KB   
786/1704 KB   
790/1704 KB   
794/1704 KB   
798/1704 KB   
802/1704 KB   
806/1704 KB   
810/1704 KB   
814/1704 KB   
818/1704 KB   
822/1704 KB   
826/1704 KB   
830/1704 KB   
834/1704 KB   
838/1704 KB   
842/1704 KB   
846/1704 KB   
850/1704 KB   
854/1704 KB   
858/1704 KB   
862/1704 KB   
866/1704 KB   
870/1704 KB   
874/1704 KB   
878/1704 KB   
882/1704 KB   
886/1704 KB   
890/1704 KB   
894/1704 KB   
898/1704 KB   
902/1704 KB   
906/1704 KB   
910/1704 KB   
914/1704 KB   
918/1704 KB   
922/1704 KB   
926/1704 KB   
930/1704 KB   
934/1704 KB   
938/1704 KB   
942/1704 KB   
946/1704 KB   
950/1704 KB   
954/1704 KB   
958/1704 KB   
962/1704 KB   
966/1704 KB   
970/1704 KB   
974/1704 KB   
978/1704 KB   
982/1704 KB   
986/1704 KB   
990/1704 KB   
994/1704 KB   
998/1704 KB   
1002/1704 KB   
1006/1704 KB   
1010/1704 KB   
1014/1704 KB   
1018/1704 KB   
1022/1704 KB   
1026/1704 KB   
1030/1704 KB   
1034/1704 KB   
1038/1704 KB   
1042/1704 KB   
1046/1704 KB   
1050/1704 KB   
1054/1704 KB   
1058/1704 KB   
1062/1704 KB   
1066/1704 KB   
1070/1704 KB   
1074/1704 KB   
1078/1704 KB   
1082/1704 KB   
1086/1704 KB   
1090/1704 KB   
1094/1704 KB   
1098/1704 KB   
1102/1704 KB   
1106/1704 KB   
1110/1704 KB   
1114/1704 KB   
1118/1704 KB   
1122/1704 KB   
1126/1704 KB   
1130/1704 KB   
1134/1704 KB   
1138/1704 KB   
1142/1704 KB   
1146/1704 KB   
1150/1704 KB   
1154/1704 KB   
1158/1704 KB   
1162/1704 KB   
1166/1704 KB   
1170/1704 KB   
1174/1704 KB   
1178/1704 KB   
1182/1704 KB   
1186/1704 KB   
1190/1704 KB   
1194/1704 KB   
1198/1704 KB   
1202/1704 KB   
1206/1704 KB   
1210/1704 KB   
1214/1704 KB   
1218/1704 KB   
1222/1704 KB   
1226/1704 KB   
1230/1704 KB   
1234/1704 KB   
1238/1704 KB   
1242/1704 KB   
1246/1704 KB   
1250/1704 KB   
1254/1704 KB   
1258/1704 KB   
1262/1704 KB   
1266/1704 KB   
1270/1704 KB   
1274/1704 KB   
1278/1704 KB   
1282/1704 KB   
1286/1704 KB   
1290/1704 KB   
1294/1704 KB   
1298/1704 KB   
1302/1704 KB   
1306/1704 KB   
1310/1704 KB   
1314/1704 KB   
1318/1704 KB   
1322/1704 KB   
1326/1704 KB   
1330/1704 KB   
1334/1704 KB   
1338/1704 KB   
1342/1704 KB   
1346/1704 KB   
1350/1704 KB   
1354/1704 KB   
1358/1704 KB   
1362/1704 KB   
1366/1704 KB   
1370/1704 KB   
1374/1704 KB   
1378/1704 KB   
1382/1704 KB   
1386/1704 KB   
1390/1704 KB   
1394/1704 KB   
1398/1704 KB   
1402/1704 KB   
1406/1704 KB   
1410/1704 KB   
1414/1704 KB   
1418/1704 KB   
1422/1704 KB   
1426/1704 KB   
1430/1704 KB   
1434/1704 KB   
1438/1704 KB   
1442/1704 KB   
1446/1704 KB   
1450/1704 KB   
1454/1704 KB   
1458/1704 KB   
1462/1704 KB   
1466/1704 KB   
1470/1704 KB   
1474/1704 KB   
1478/1704 KB   
1482/1704 KB   
1486/1704 KB   
1490/1704 KB   
1494/1704 KB   
1498/1704 KB   
1502/1704 KB   
1506/1704 KB   
1510/1704 KB   
1514/1704 KB   
1518/1704 KB   
1522/1704 KB   
1526/1704 KB   
1530/1704 KB   
1534/1704 KB   
1538/1704 KB   
1542/1704 KB   
1546/1704 KB   
1550/1704 KB   
1554/1704 KB   
1558/1704 KB   
1562/1704 KB   
1566/1704 KB   
1570/1704 KB   
1574/1704 KB   
1578/1704 KB   
1582/1704 KB   
1586/1704 KB   
1590/1704 KB   
1594/1704 KB   
1598/1704 KB   
1602/1704 KB   
1606/1704 KB   
1610/1704 KB   
1614/1704 KB   
1618/1704 KB   
1622/1704 KB   
1626/1704 KB   
1630/1704 KB   
1634/1704 KB   
1638/1704 KB   
1642/1704 KB   
1646/1704 KB   
1650/1704 KB   
1654/1704 KB   
1658/1704 KB   
1662/1704 KB   
1666/1704 KB   
1670/1704 KB   
1674/1704 KB   
1678/1704 KB   
1682/1704 KB   
1686/1704 KB   
1690/1704 KB   
1694/1704 KB   
1698/1704 KB   
1702/1704 KB   
1704/1704 KB   
               
Downloaded: http://maven.inria.fr/artifactory/spoon-public-snapshot/fr/inria/gforge/spoon/spoon-core/7.6.0-SNAPSHOT/spoon-core-7.6.0-20191005.224138-117.jar (1704 KB at 7247.0 KB/sec)
[INFO] 
[INFO] --- maven-install-plugin:2.5.2:install (default-install) @ moshi-parent ---
[INFO] Installing /builds/workspace/Moshi/pom.xml to /builds/.m2/repository/com/squareup/moshi/moshi-parent/1.5.0-SNAPSHOT/moshi-parent-1.5.0-SNAPSHOT.pom
[INFO]                                                                         
[INFO] ------------------------------------------------------------------------
[INFO] Building Moshi 1.5.0-SNAPSHOT
[INFO] ------------------------------------------------------------------------
[INFO] 
[INFO] --- maven-clean-plugin:2.5:clean (default-clean) @ moshi ---
[INFO] Deleting /builds/workspace/Moshi/moshi/target
[INFO] 
[INFO] --- maven-enforcer-plugin:1.0:enforce (enforce-maven) @ moshi ---
[INFO] 
[INFO] --- spoon-maven-plugin:3.1:generate (default) @ moshi ---
2019-10-06 17:52:27,247 WARN spoon.Launcher - Spoon is now using the 'no classpath mode' by default. If you want to ensure using Spoon in full classpath mode, please use the new flag: --cpmode fullclasspath.
2019-10-06 17:52:27,247 WARN spoon.Launcher - Spoon now parses by default the comments. Consider using the option --disable-comments if you want the old behaviour.
2019-10-06 17:52:27,253 INFO spoon.Launcher - Spoon version 7.6.0-SNAPSHOT
2019-10-06 17:52:27,253 INFO spoon.Launcher - running Spoon...
2019-10-06 17:52:27,253 INFO spoon.Launcher - start processing...
2019-10-06 17:52:29,230 INFO spoon.Launcher - spoon.processing.SpoonTagger
2019-10-06 17:52:29,274 INFO spoon.Launcher - spoon.support.JavaOutputProcessor
2019-10-06 17:52:30,382 INFO spoon.Launcher - end of processing: 
2019-10-06 17:52:30,382 INFO spoon.Launcher - no errors, no warnings
[INFO] 
[INFO] --- maven-resources-plugin:2.6:resources (default-resources) @ moshi ---
[INFO] Using 'UTF-8' encoding to copy filtered resources.
[INFO] skip non existing resourceDirectory /builds/workspace/Moshi/moshi/src/main/resources
[INFO] 
[INFO] --- maven-compiler-plugin:3.3:compile (default-compile) @ moshi ---
[INFO] Changes detected - recompiling the module!
[INFO] Compiling 26 source files to /builds/workspace/Moshi/moshi/target/classes
/builds/workspace/Moshi/moshi/target/generated-sources/spoon/com/squareup/moshi/JsonUtf8Writer.java:29: error: cannot assign a value to final variable REPLACEMENT_CHARS
        com.squareup.moshi.JsonUtf8Writer.REPLACEMENT_CHARS = new java.lang.String[128];
                                         ^
1 error
[INFO] ------------------------------------------------------------------------
[INFO] Reactor Summary:
[INFO] 
[INFO] Moshi (Parent) ..................................... SUCCESS [  4.602 s]
[INFO] Moshi .............................................. FAILURE [  5.859 s]
[INFO] moshi-adapters ..................................... SKIPPED
[INFO] moshi-examples ..................................... SKIPPED
[INFO] ------------------------------------------------------------------------
[INFO] BUILD FAILURE
[INFO] ------------------------------------------------------------------------
[INFO] Total time: 10.587 s
[INFO] Finished at: 2019-10-06T17:52:32+02:00
[INFO] Final Memory: 46M/198M
[INFO] ------------------------------------------------------------------------
[ERROR] Failed to execute goal org.apache.maven.plugins:maven-compiler-plugin:3.3:compile (default-compile) on project moshi: Compilation failure -> [Help 1]
[ERROR] 
[ERROR] To see the full stack trace of the errors, re-run Maven with the -e switch.
[ERROR] Re-run Maven using the -X switch to enable full debug logging.
[ERROR] 
[ERROR] For more information about the errors and possible solutions, please read the following articles:
[ERROR] [Help 1] http://cwiki.apache.org/confluence/display/MAVEN/MojoFailureException
[ERROR] 
[ERROR] After correcting the problems, you can resume the build with the command
[ERROR]   mvn <goals> -rf :moshi
Error: Maven compile with spoon unsuccessful!
Build step 'Execute shell' marked build as failure
Archiving artifacts
/net/www/ci/sos/jobs/Moshi/builds/1111/archive does not exist.
ERROR: Step ‘Publish XML Summary Reports’ failed: /net/www/ci/sos/jobs/Moshi/builds/1111/archive does not exist.
Sending e-mails to: spoon-devel@lists.gforge.inria.fr
Finished: FAILURE