FailedConsole Output

Started by timer
Running as SYSTEM
[EnvInject] - Loading node environment variables.
Building remotely on sos-builder01 (lin) in workspace /builds/workspace/astor
No credentials specified
Cloning the remote Git repository
Cloning repository https://github.com/SpoonLabs/astor.git
 > git init /builds/workspace/astor # timeout=10
Fetching upstream changes from https://github.com/SpoonLabs/astor.git
 > git --version # timeout=10
 > git fetch --tags --progress https://github.com/SpoonLabs/astor.git +refs/heads/*:refs/remotes/origin/* # timeout=10
 > git config remote.origin.url https://github.com/SpoonLabs/astor.git # timeout=10
 > git config --add remote.origin.fetch +refs/heads/*:refs/remotes/origin/* # timeout=10
 > git config remote.origin.url https://github.com/SpoonLabs/astor.git # timeout=10
Fetching upstream changes from https://github.com/SpoonLabs/astor.git
 > git fetch --tags --progress https://github.com/SpoonLabs/astor.git +refs/heads/*:refs/remotes/origin/* # timeout=10
 > git rev-parse refs/remotes/origin/master^{commit} # timeout=10
 > git rev-parse refs/remotes/origin/origin/master^{commit} # timeout=10
Checking out Revision 8581b1c686103352e7f6189f54437ea1e46f0c36 (refs/remotes/origin/master)
 > git config core.sparsecheckout # timeout=10
 > git checkout -f 8581b1c686103352e7f6189f54437ea1e46f0c36 # timeout=10
Commit message: "Disable `forcesubprocesskilling` as it is buggy. The workarrond to kill the JUnit subprocesses implemented [here](https://github.com/SpoonLabs/astor/blob/7a148596edc683871d4fd97a82bebbf39f079240/src/main/java/fr/inria/astor/core/validation/junit/LaucherJUnitProcess.java#L184) kills the process with a pid=pid+1 which could be a non-related process. (#220)"
 > git rev-list --no-walk 8581b1c686103352e7f6189f54437ea1e46f0c36 # timeout=10
[astor] $ /bin/sh -xe /tmp/jenkins7599271605404210928.sh
+ ./.travis_install.sh
calling compile maven
compiling ls
compiling examples/testMultiMet/testBinaryExprReduceVM1
in dir /builds/workspace/astor/examples/testMultiMet/testBinaryExprReduceVM1
Picked up JAVA_TOOL_OPTIONS: -Dfile.encoding=UTF8
after claning examples/testMultiMet/testBinaryExprReduceVM1
Picked up JAVA_TOOL_OPTIONS: -Dfile.encoding=UTF8
compiling examples/testMultiMet/testBinaryExprReduceVM2
in dir /builds/workspace/astor/examples/testMultiMet/testBinaryExprReduceVM2
Picked up JAVA_TOOL_OPTIONS: -Dfile.encoding=UTF8
after claning examples/testMultiMet/testBinaryExprReduceVM2
Picked up JAVA_TOOL_OPTIONS: -Dfile.encoding=UTF8
compiling examples/testMultiMet/testBinaryExprReduceVM2b
in dir /builds/workspace/astor/examples/testMultiMet/testBinaryExprReduceVM2b
Picked up JAVA_TOOL_OPTIONS: -Dfile.encoding=UTF8
after claning examples/testMultiMet/testBinaryExprReduceVM2b
Picked up JAVA_TOOL_OPTIONS: -Dfile.encoding=UTF8
compiling examples/testMultiMet/testIfNullCheckVR
in dir /builds/workspace/astor/examples/testMultiMet/testIfNullCheckVR
Picked up JAVA_TOOL_OPTIONS: -Dfile.encoding=UTF8
after claning examples/testMultiMet/testIfNullCheckVR
Picked up JAVA_TOOL_OPTIONS: -Dfile.encoding=UTF8
compiling examples/testMultiMet/testMulti1
in dir /builds/workspace/astor/examples/testMultiMet/testMulti1
Picked up JAVA_TOOL_OPTIONS: -Dfile.encoding=UTF8
after claning examples/testMultiMet/testMulti1
Picked up JAVA_TOOL_OPTIONS: -Dfile.encoding=UTF8
compiling examples/testMultiMet/testMulti2
in dir /builds/workspace/astor/examples/testMultiMet/testMulti2
Picked up JAVA_TOOL_OPTIONS: -Dfile.encoding=UTF8
after claning examples/testMultiMet/testMulti2
Picked up JAVA_TOOL_OPTIONS: -Dfile.encoding=UTF8
compiling examples/testMultiMet/testMulti3
in dir /builds/workspace/astor/examples/testMultiMet/testMulti3
Picked up JAVA_TOOL_OPTIONS: -Dfile.encoding=UTF8
after claning examples/testMultiMet/testMulti3
Picked up JAVA_TOOL_OPTIONS: -Dfile.encoding=UTF8
compiling examples/testMultiMet/testOperatorBinary1WrongVar
in dir /builds/workspace/astor/examples/testMultiMet/testOperatorBinary1WrongVar
Picked up JAVA_TOOL_OPTIONS: -Dfile.encoding=UTF8
after claning examples/testMultiMet/testOperatorBinary1WrongVar
Picked up JAVA_TOOL_OPTIONS: -Dfile.encoding=UTF8
compiling examples/testMultiMet/testTryVR
in dir /builds/workspace/astor/examples/testMultiMet/testTryVR
Picked up JAVA_TOOL_OPTIONS: -Dfile.encoding=UTF8
after claning examples/testMultiMet/testTryVR
Picked up JAVA_TOOL_OPTIONS: -Dfile.encoding=UTF8
compiling examples/testMultiMet/testUnwrapIfVR1
in dir /builds/workspace/astor/examples/testMultiMet/testUnwrapIfVR1
Picked up JAVA_TOOL_OPTIONS: -Dfile.encoding=UTF8
after claning examples/testMultiMet/testUnwrapIfVR1
Picked up JAVA_TOOL_OPTIONS: -Dfile.encoding=UTF8
compiling examples/testMultiMet/testWMVMRcase3
in dir /builds/workspace/astor/examples/testMultiMet/testWMVMRcase3
Picked up JAVA_TOOL_OPTIONS: -Dfile.encoding=UTF8
after claning examples/testMultiMet/testWMVMRcase3
Picked up JAVA_TOOL_OPTIONS: -Dfile.encoding=UTF8
compiling ls
compiling examples/testMet/testBinaryExprReduce1
in dir /builds/workspace/astor/examples/testMet/testBinaryExprReduce1
Picked up JAVA_TOOL_OPTIONS: -Dfile.encoding=UTF8
after claning examples/testMet/testBinaryExprReduce1
Picked up JAVA_TOOL_OPTIONS: -Dfile.encoding=UTF8
compiling examples/testMet/testBinaryExprReduce2
in dir /builds/workspace/astor/examples/testMet/testBinaryExprReduce2
Picked up JAVA_TOOL_OPTIONS: -Dfile.encoding=UTF8
after claning examples/testMet/testBinaryExprReduce2
Picked up JAVA_TOOL_OPTIONS: -Dfile.encoding=UTF8
compiling examples/testMet/testConstantPerVar1
in dir /builds/workspace/astor/examples/testMet/testConstantPerVar1
Picked up JAVA_TOOL_OPTIONS: -Dfile.encoding=UTF8
after claning examples/testMet/testConstantPerVar1
Picked up JAVA_TOOL_OPTIONS: -Dfile.encoding=UTF8
compiling examples/testMet/testExprExp1
in dir /builds/workspace/astor/examples/testMet/testExprExp1
Picked up JAVA_TOOL_OPTIONS: -Dfile.encoding=UTF8
after claning examples/testMet/testExprExp1
Picked up JAVA_TOOL_OPTIONS: -Dfile.encoding=UTF8
compiling examples/testMet/testIfNullCheck1
in dir /builds/workspace/astor/examples/testMet/testIfNullCheck1
Picked up JAVA_TOOL_OPTIONS: -Dfile.encoding=UTF8
after claning examples/testMet/testIfNullCheck1
Picked up JAVA_TOOL_OPTIONS: -Dfile.encoding=UTF8
compiling examples/testMet/testIfNullCheck2
in dir /builds/workspace/astor/examples/testMet/testIfNullCheck2
Picked up JAVA_TOOL_OPTIONS: -Dfile.encoding=UTF8
after claning examples/testMet/testIfNullCheck2
Picked up JAVA_TOOL_OPTIONS: -Dfile.encoding=UTF8
compiling examples/testMet/testIfSimple1
in dir /builds/workspace/astor/examples/testMet/testIfSimple1
Picked up JAVA_TOOL_OPTIONS: -Dfile.encoding=UTF8
after claning examples/testMet/testIfSimple1
Picked up JAVA_TOOL_OPTIONS: -Dfile.encoding=UTF8
compiling examples/testMet/testMethodReplaceByVar1
in dir /builds/workspace/astor/examples/testMet/testMethodReplaceByVar1
Picked up JAVA_TOOL_OPTIONS: -Dfile.encoding=UTF8
after claning examples/testMet/testMethodReplaceByVar1
Picked up JAVA_TOOL_OPTIONS: -Dfile.encoding=UTF8
compiling examples/testMet/testOperatorBinary1
in dir /builds/workspace/astor/examples/testMet/testOperatorBinary1
Picked up JAVA_TOOL_OPTIONS: -Dfile.encoding=UTF8
after claning examples/testMet/testOperatorBinary1
Picked up JAVA_TOOL_OPTIONS: -Dfile.encoding=UTF8
compiling examples/testMet/testOperatorBinary2
in dir /builds/workspace/astor/examples/testMet/testOperatorBinary2
Picked up JAVA_TOOL_OPTIONS: -Dfile.encoding=UTF8
after claning examples/testMet/testOperatorBinary2
Picked up JAVA_TOOL_OPTIONS: -Dfile.encoding=UTF8
compiling examples/testMet/testTrySimple1
in dir /builds/workspace/astor/examples/testMet/testTrySimple1
Picked up JAVA_TOOL_OPTIONS: -Dfile.encoding=UTF8
after claning examples/testMet/testTrySimple1
Picked up JAVA_TOOL_OPTIONS: -Dfile.encoding=UTF8
compiling examples/testMet/testUnwrapIf1
in dir /builds/workspace/astor/examples/testMet/testUnwrapIf1
Picked up JAVA_TOOL_OPTIONS: -Dfile.encoding=UTF8
after claning examples/testMet/testUnwrapIf1
Picked up JAVA_TOOL_OPTIONS: -Dfile.encoding=UTF8
compiling examples/testMet/testUnwrapInvocation1
in dir /builds/workspace/astor/examples/testMet/testUnwrapInvocation1
Picked up JAVA_TOOL_OPTIONS: -Dfile.encoding=UTF8
after claning examples/testMet/testUnwrapInvocation1
Picked up JAVA_TOOL_OPTIONS: -Dfile.encoding=UTF8
compiling examples/testMet/testUnwrapTry1
in dir /builds/workspace/astor/examples/testMet/testUnwrapTry1
Picked up JAVA_TOOL_OPTIONS: -Dfile.encoding=UTF8
after claning examples/testMet/testUnwrapTry1
Picked up JAVA_TOOL_OPTIONS: -Dfile.encoding=UTF8
compiling examples/testMet/testVarReplace1
in dir /builds/workspace/astor/examples/testMet/testVarReplace1
Picked up JAVA_TOOL_OPTIONS: -Dfile.encoding=UTF8
after claning examples/testMet/testVarReplace1
Picked up JAVA_TOOL_OPTIONS: -Dfile.encoding=UTF8
compiling examples/testMet/testVarReplaceByMethod1
in dir /builds/workspace/astor/examples/testMet/testVarReplaceByMethod1
Picked up JAVA_TOOL_OPTIONS: -Dfile.encoding=UTF8
after claning examples/testMet/testVarReplaceByMethod1
Picked up JAVA_TOOL_OPTIONS: -Dfile.encoding=UTF8
compiling examples/testMet/testWMRcase1
in dir /builds/workspace/astor/examples/testMet/testWMRcase1
Picked up JAVA_TOOL_OPTIONS: -Dfile.encoding=UTF8
after claning examples/testMet/testWMRcase1
Picked up JAVA_TOOL_OPTIONS: -Dfile.encoding=UTF8
compiling examples/testMet/testWMRcase2a
in dir /builds/workspace/astor/examples/testMet/testWMRcase2a
Picked up JAVA_TOOL_OPTIONS: -Dfile.encoding=UTF8
after claning examples/testMet/testWMRcase2a
Picked up JAVA_TOOL_OPTIONS: -Dfile.encoding=UTF8
compiling examples/testMet/testWMRcase2b
in dir /builds/workspace/astor/examples/testMet/testWMRcase2b
Picked up JAVA_TOOL_OPTIONS: -Dfile.encoding=UTF8
after claning examples/testMet/testWMRcase2b
Picked up JAVA_TOOL_OPTIONS: -Dfile.encoding=UTF8
compiling examples/testMet/testWMRcase2c
in dir /builds/workspace/astor/examples/testMet/testWMRcase2c
Picked up JAVA_TOOL_OPTIONS: -Dfile.encoding=UTF8
after claning examples/testMet/testWMRcase2c
Picked up JAVA_TOOL_OPTIONS: -Dfile.encoding=UTF8
compiling examples/testMet/testWMRcase3
in dir /builds/workspace/astor/examples/testMet/testWMRcase3
Picked up JAVA_TOOL_OPTIONS: -Dfile.encoding=UTF8
after claning examples/testMet/testWMRcase3
Picked up JAVA_TOOL_OPTIONS: -Dfile.encoding=UTF8
compiling examples/math_85/
Picked up JAVA_TOOL_OPTIONS: -Dfile.encoding=UTF8
     [copy] Copying 2 files to /builds/workspace/astor/examples/math_85/target/apidocs/META-INF
compiling examples/math_70/
Picked up JAVA_TOOL_OPTIONS: -Dfile.encoding=UTF8
     [copy] Copying 2 files to /builds/workspace/astor/examples/math_70/target/apidocs/META-INF
compiling examples/Math-issue-280/
Picked up JAVA_TOOL_OPTIONS: -Dfile.encoding=UTF8
     [copy] Copying 2 files to /builds/workspace/astor/examples/Math-issue-280/target/apidocs/META-INF
compiling examples/Math-issue-288/
Picked up JAVA_TOOL_OPTIONS: -Dfile.encoding=UTF8
compiling examples/math_2/
Picked up JAVA_TOOL_OPTIONS: -Dfile.encoding=UTF8
compiling examples/math_5/
Picked up JAVA_TOOL_OPTIONS: -Dfile.encoding=UTF8
compiling examples/jsoup31be24/
Picked up JAVA_TOOL_OPTIONS: -Dfile.encoding=UTF8
compiling examples/introclass/3b2376/003/
Picked up JAVA_TOOL_OPTIONS: -Dfile.encoding=UTF8
compiling examples/math_50/
./.travis_install.sh: line 8: cd: examples/math_50/: No such file or directory
Picked up JAVA_TOOL_OPTIONS: -Dfile.encoding=UTF8
[ERROR] The goal you specified requires a project to execute but there is no POM in this directory (/builds/workspace/astor/examples/introclass). Please verify you invoked Maven from the correct directory. -> [Help 1]
[ERROR] 
[ERROR] To see the full stack trace of the errors, re-run Maven with the -e switch.
[ERROR] Re-run Maven using the -X switch to enable full debug logging.
[ERROR] 
[ERROR] For more information about the errors and possible solutions, please read the following articles:
[ERROR] [Help 1] http://cwiki.apache.org/confluence/display/MAVEN/MissingProjectException
compiling examples/math_74/
Picked up JAVA_TOOL_OPTIONS: -Dfile.encoding=UTF8
compiling examples/math_76/
Picked up JAVA_TOOL_OPTIONS: -Dfile.encoding=UTF8
compiling examples/math_106/
Picked up JAVA_TOOL_OPTIONS: -Dfile.encoding=UTF8
compiling examples/lang_63/
Picked up JAVA_TOOL_OPTIONS: -Dfile.encoding=UTF8
[ERROR] /builds/workspace/astor/examples/lang_63/src/main/java/org/apache/commons/lang/Entities.java:[63,29] unmappable character for encoding UTF-8
[ERROR] /builds/workspace/astor/examples/lang_63/src/main/java/org/apache/commons/lang/Entities.java:[68,28] unmappable character for encoding UTF-8
[ERROR] /builds/workspace/astor/examples/lang_63/src/main/java/org/apache/commons/lang/Entities.java:[86,31] unmappable character for encoding UTF-8
[ERROR] /builds/workspace/astor/examples/lang_63/src/main/java/org/apache/commons/lang/Entities.java:[87,31] unmappable character for encoding UTF-8
[ERROR] /builds/workspace/astor/examples/lang_63/src/main/java/org/apache/commons/lang/Entities.java:[88,30] unmappable character for encoding UTF-8
[ERROR] /builds/workspace/astor/examples/lang_63/src/main/java/org/apache/commons/lang/Entities.java:[89,31] unmappable character for encoding UTF-8
[ERROR] /builds/workspace/astor/examples/lang_63/src/main/java/org/apache/commons/lang/Entities.java:[90,29] unmappable character for encoding UTF-8
[ERROR] /builds/workspace/astor/examples/lang_63/src/main/java/org/apache/commons/lang/Entities.java:[91,30] unmappable character for encoding UTF-8
[ERROR] /builds/workspace/astor/examples/lang_63/src/main/java/org/apache/commons/lang/Entities.java:[92,30] unmappable character for encoding UTF-8
[ERROR] /builds/workspace/astor/examples/lang_63/src/main/java/org/apache/commons/lang/Entities.java:[93,31] unmappable character for encoding UTF-8
[ERROR] /builds/workspace/astor/examples/lang_63/src/main/java/org/apache/commons/lang/Entities.java:[94,31] unmappable character for encoding UTF-8
[ERROR] /builds/workspace/astor/examples/lang_63/src/main/java/org/apache/commons/lang/Entities.java:[95,31] unmappable character for encoding UTF-8
[ERROR] /builds/workspace/astor/examples/lang_63/src/main/java/org/apache/commons/lang/Entities.java:[96,30] unmappable character for encoding UTF-8
[ERROR] /builds/workspace/astor/examples/lang_63/src/main/java/org/apache/commons/lang/Entities.java:[97,29] unmappable character for encoding UTF-8
[ERROR] /builds/workspace/astor/examples/lang_63/src/main/java/org/apache/commons/lang/Entities.java:[98,31] unmappable character for encoding UTF-8
[ERROR] /builds/workspace/astor/examples/lang_63/src/main/java/org/apache/commons/lang/Entities.java:[99,31] unmappable character for encoding UTF-8
[ERROR] /builds/workspace/astor/examples/lang_63/src/main/java/org/apache/commons/lang/Entities.java:[100,30] unmappable character for encoding UTF-8
[ERROR] /builds/workspace/astor/examples/lang_63/src/main/java/org/apache/commons/lang/Entities.java:[101,29] unmappable character for encoding UTF-8
[ERROR] /builds/workspace/astor/examples/lang_63/src/main/java/org/apache/commons/lang/Entities.java:[102,28] unmappable character for encoding UTF-8
[ERROR] /builds/workspace/astor/examples/lang_63/src/main/java/org/apache/commons/lang/Entities.java:[103,31] unmappable character for encoding UTF-8
[ERROR] /builds/workspace/astor/examples/lang_63/src/main/java/org/apache/commons/lang/Entities.java:[104,31] unmappable character for encoding UTF-8
[ERROR] /builds/workspace/astor/examples/lang_63/src/main/java/org/apache/commons/lang/Entities.java:[105,31] unmappable character for encoding UTF-8
[ERROR] /builds/workspace/astor/examples/lang_63/src/main/java/org/apache/commons/lang/Entities.java:[106,30] unmappable character for encoding UTF-8
[ERROR] /builds/workspace/astor/examples/lang_63/src/main/java/org/apache/commons/lang/Entities.java:[107,31] unmappable character for encoding UTF-8
[ERROR] /builds/workspace/astor/examples/lang_63/src/main/java/org/apache/commons/lang/Entities.java:[108,29] unmappable character for encoding UTF-8
[ERROR] /builds/workspace/astor/examples/lang_63/src/main/java/org/apache/commons/lang/Entities.java:[110,31] unmappable character for encoding UTF-8
[ERROR] /builds/workspace/astor/examples/lang_63/src/main/java/org/apache/commons/lang/Entities.java:[111,31] unmappable character for encoding UTF-8
[ERROR] /builds/workspace/astor/examples/lang_63/src/main/java/org/apache/commons/lang/Entities.java:[112,31] unmappable character for encoding UTF-8
[ERROR] /builds/workspace/astor/examples/lang_63/src/main/java/org/apache/commons/lang/Entities.java:[113,30] unmappable character for encoding UTF-8
[ERROR] /builds/workspace/astor/examples/lang_63/src/main/java/org/apache/commons/lang/Entities.java:[114,29] unmappable character for encoding UTF-8
[ERROR] /builds/workspace/astor/examples/lang_63/src/main/java/org/apache/commons/lang/Entities.java:[115,31] unmappable character for encoding UTF-8
[ERROR] /builds/workspace/astor/examples/lang_63/src/main/java/org/apache/commons/lang/Entities.java:[116,30] unmappable character for encoding UTF-8
[ERROR] /builds/workspace/astor/examples/lang_63/src/main/java/org/apache/commons/lang/Entities.java:[117,30] unmappable character for encoding UTF-8
[ERROR] /builds/workspace/astor/examples/lang_63/src/main/java/org/apache/commons/lang/Entities.java:[118,31] unmappable character for encoding UTF-8
[ERROR] /builds/workspace/astor/examples/lang_63/src/main/java/org/apache/commons/lang/Entities.java:[119,31] unmappable character for encoding UTF-8
[ERROR] /builds/workspace/astor/examples/lang_63/src/main/java/org/apache/commons/lang/Entities.java:[120,30] unmappable character for encoding UTF-8
[ERROR] /builds/workspace/astor/examples/lang_63/src/main/java/org/apache/commons/lang/Entities.java:[121,31] unmappable character for encoding UTF-8
[ERROR] /builds/workspace/astor/examples/lang_63/src/main/java/org/apache/commons/lang/Entities.java:[122,29] unmappable character for encoding UTF-8
[ERROR] /builds/workspace/astor/examples/lang_63/src/main/java/org/apache/commons/lang/Entities.java:[123,30] unmappable character for encoding UTF-8
[ERROR] /builds/workspace/astor/examples/lang_63/src/main/java/org/apache/commons/lang/Entities.java:[124,30] unmappable character for encoding UTF-8
[ERROR] /builds/workspace/astor/examples/lang_63/src/main/java/org/apache/commons/lang/Entities.java:[125,31] unmappable character for encoding UTF-8
[ERROR] /builds/workspace/astor/examples/lang_63/src/main/java/org/apache/commons/lang/Entities.java:[126,31] unmappable character for encoding UTF-8
[ERROR] /builds/workspace/astor/examples/lang_63/src/main/java/org/apache/commons/lang/Entities.java:[127,31] unmappable character for encoding UTF-8
[ERROR] /builds/workspace/astor/examples/lang_63/src/main/java/org/apache/commons/lang/Entities.java:[128,30] unmappable character for encoding UTF-8
[ERROR] /builds/workspace/astor/examples/lang_63/src/main/java/org/apache/commons/lang/Entities.java:[129,29] unmappable character for encoding UTF-8
[ERROR] /builds/workspace/astor/examples/lang_63/src/main/java/org/apache/commons/lang/Entities.java:[130,31] unmappable character for encoding UTF-8
[ERROR] /builds/workspace/astor/examples/lang_63/src/main/java/org/apache/commons/lang/Entities.java:[131,31] unmappable character for encoding UTF-8
[ERROR] /builds/workspace/astor/examples/lang_63/src/main/java/org/apache/commons/lang/Entities.java:[132,30] unmappable character for encoding UTF-8
[ERROR] /builds/workspace/astor/examples/lang_63/src/main/java/org/apache/commons/lang/Entities.java:[133,29] unmappable character for encoding UTF-8
[ERROR] /builds/workspace/astor/examples/lang_63/src/main/java/org/apache/commons/lang/Entities.java:[134,28] unmappable character for encoding UTF-8
[ERROR] /builds/workspace/astor/examples/lang_63/src/main/java/org/apache/commons/lang/Entities.java:[135,31] unmappable character for encoding UTF-8
[ERROR] /builds/workspace/astor/examples/lang_63/src/main/java/org/apache/commons/lang/Entities.java:[136,31] unmappable character for encoding UTF-8
[ERROR] /builds/workspace/astor/examples/lang_63/src/main/java/org/apache/commons/lang/Entities.java:[137,31] unmappable character for encoding UTF-8
[ERROR] /builds/workspace/astor/examples/lang_63/src/main/java/org/apache/commons/lang/Entities.java:[138,30] unmappable character for encoding UTF-8
[ERROR] /builds/workspace/astor/examples/lang_63/src/main/java/org/apache/commons/lang/Entities.java:[139,31] unmappable character for encoding UTF-8
[ERROR] /builds/workspace/astor/examples/lang_63/src/main/java/org/apache/commons/lang/Entities.java:[140,29] unmappable character for encoding UTF-8
[ERROR] /builds/workspace/astor/examples/lang_63/src/main/java/org/apache/commons/lang/Entities.java:[142,31] unmappable character for encoding UTF-8
[ERROR] /builds/workspace/astor/examples/lang_63/src/main/java/org/apache/commons/lang/Entities.java:[143,31] unmappable character for encoding UTF-8
[ERROR] /builds/workspace/astor/examples/lang_63/src/main/java/org/apache/commons/lang/Entities.java:[144,31] unmappable character for encoding UTF-8
[ERROR] /builds/workspace/astor/examples/lang_63/src/main/java/org/apache/commons/lang/Entities.java:[145,30] unmappable character for encoding UTF-8
[ERROR] /builds/workspace/astor/examples/lang_63/src/main/java/org/apache/commons/lang/Entities.java:[146,29] unmappable character for encoding UTF-8
[ERROR] /builds/workspace/astor/examples/lang_63/src/main/java/org/apache/commons/lang/Entities.java:[147,31] unmappable character for encoding UTF-8
[ERROR] /builds/workspace/astor/examples/lang_63/src/main/java/org/apache/commons/lang/Entities.java:[148,30] unmappable character for encoding UTF-8
[ERROR] /builds/workspace/astor/examples/lang_63/src/main/java/org/apache/commons/lang/Entities.java:[149,29] unmappable character for encoding UTF-8
compiling examples/lang_39/
Picked up JAVA_TOOL_OPTIONS: -Dfile.encoding=UTF8
compiling examples/lang_1/
Picked up JAVA_TOOL_OPTIONS: -Dfile.encoding=UTF8
[ERROR] COMPILATION ERROR : 
[ERROR] /builds/workspace/astor/examples/lang_1/src/test/java/org/apache/commons/lang3/reflect/TypeUtilsTest.java:[524,47] incompatible types: inferred type does not conform to upper bound(s)
    inferred: G
    upper bound(s): java.lang.Comparable<G>,java.lang.Integer
[ERROR] Failed to execute goal org.apache.maven.plugins:maven-compiler-plugin:3.0:testCompile (default-testCompile) on project commons-lang3: Compilation failure
[ERROR] /builds/workspace/astor/examples/lang_1/src/test/java/org/apache/commons/lang3/reflect/TypeUtilsTest.java:[524,47] incompatible types: inferred type does not conform to upper bound(s)
[ERROR] inferred: G
[ERROR] upper bound(s): java.lang.Comparable<G>,java.lang.Integer
[ERROR] -> [Help 1]
[ERROR] 
[ERROR] To see the full stack trace of the errors, re-run Maven with the -e switch.
[ERROR] Re-run Maven using the -X switch to enable full debug logging.
[ERROR] 
[ERROR] For more information about the errors and possible solutions, please read the following articles:
[ERROR] [Help 1] http://cwiki.apache.org/confluence/display/MAVEN/MojoFailureException
compiling examples/lang_55/
Picked up JAVA_TOOL_OPTIONS: -Dfile.encoding=UTF8
[ERROR] COMPILATION ERROR : 
[ERROR] /builds/workspace/astor/examples/lang_55/src/java/org/apache/commons/lang/enum/Enum.java:[17,33] as of release 5, 'enum' is a keyword, and may not be used as an identifier
  (use -source 1.4 or lower to use 'enum' as an identifier)
[ERROR] /builds/workspace/astor/examples/lang_55/src/java/org/apache/commons/lang/enum/ValuedEnum.java:[17,33] as of release 5, 'enum' is a keyword, and may not be used as an identifier
  (use -source 1.4 or lower to use 'enum' as an identifier)
[ERROR] /builds/workspace/astor/examples/lang_55/src/java/org/apache/commons/lang/enum/EnumUtils.java:[17,33] as of release 5, 'enum' is a keyword, and may not be used as an identifier
  (use -source 1.4 or lower to use 'enum' as an identifier)
[ERROR] /builds/workspace/astor/examples/lang_55/src/java/org/apache/commons/lang/Entities.java:[64,29] unmappable character for encoding UTF8
[ERROR] /builds/workspace/astor/examples/lang_55/src/java/org/apache/commons/lang/Entities.java:[69,28] unmappable character for encoding UTF8
[ERROR] /builds/workspace/astor/examples/lang_55/src/java/org/apache/commons/lang/Entities.java:[87,31] unmappable character for encoding UTF8
[ERROR] /builds/workspace/astor/examples/lang_55/src/java/org/apache/commons/lang/Entities.java:[88,31] unmappable character for encoding UTF8
[ERROR] /builds/workspace/astor/examples/lang_55/src/java/org/apache/commons/lang/Entities.java:[89,30] unmappable character for encoding UTF8
[ERROR] /builds/workspace/astor/examples/lang_55/src/java/org/apache/commons/lang/Entities.java:[90,31] unmappable character for encoding UTF8
[ERROR] /builds/workspace/astor/examples/lang_55/src/java/org/apache/commons/lang/Entities.java:[91,29] unmappable character for encoding UTF8
[ERROR] /builds/workspace/astor/examples/lang_55/src/java/org/apache/commons/lang/Entities.java:[92,30] unmappable character for encoding UTF8
[ERROR] /builds/workspace/astor/examples/lang_55/src/java/org/apache/commons/lang/Entities.java:[93,30] unmappable character for encoding UTF8
[ERROR] /builds/workspace/astor/examples/lang_55/src/java/org/apache/commons/lang/Entities.java:[94,31] unmappable character for encoding UTF8
[ERROR] /builds/workspace/astor/examples/lang_55/src/java/org/apache/commons/lang/Entities.java:[95,31] unmappable character for encoding UTF8
[ERROR] /builds/workspace/astor/examples/lang_55/src/java/org/apache/commons/lang/Entities.java:[96,31] unmappable character for encoding UTF8
[ERROR] /builds/workspace/astor/examples/lang_55/src/java/org/apache/commons/lang/Entities.java:[97,30] unmappable character for encoding UTF8
[ERROR] /builds/workspace/astor/examples/lang_55/src/java/org/apache/commons/lang/Entities.java:[98,29] unmappable character for encoding UTF8
[ERROR] /builds/workspace/astor/examples/lang_55/src/java/org/apache/commons/lang/Entities.java:[99,31] unmappable character for encoding UTF8
[ERROR] /builds/workspace/astor/examples/lang_55/src/java/org/apache/commons/lang/Entities.java:[100,31] unmappable character for encoding UTF8
[ERROR] /builds/workspace/astor/examples/lang_55/src/java/org/apache/commons/lang/Entities.java:[101,30] unmappable character for encoding UTF8
[ERROR] /builds/workspace/astor/examples/lang_55/src/java/org/apache/commons/lang/Entities.java:[102,29] unmappable character for encoding UTF8
[ERROR] /builds/workspace/astor/examples/lang_55/src/java/org/apache/commons/lang/Entities.java:[103,28] unmappable character for encoding UTF8
[ERROR] /builds/workspace/astor/examples/lang_55/src/java/org/apache/commons/lang/Entities.java:[104,31] unmappable character for encoding UTF8
[ERROR] /builds/workspace/astor/examples/lang_55/src/java/org/apache/commons/lang/Entities.java:[105,31] unmappable character for encoding UTF8
[ERROR] /builds/workspace/astor/examples/lang_55/src/java/org/apache/commons/lang/Entities.java:[106,31] unmappable character for encoding UTF8
[ERROR] /builds/workspace/astor/examples/lang_55/src/java/org/apache/commons/lang/Entities.java:[107,30] unmappable character for encoding UTF8
[ERROR] /builds/workspace/astor/examples/lang_55/src/java/org/apache/commons/lang/Entities.java:[108,31] unmappable character for encoding UTF8
[ERROR] /builds/workspace/astor/examples/lang_55/src/java/org/apache/commons/lang/Entities.java:[109,29] unmappable character for encoding UTF8
[ERROR] /builds/workspace/astor/examples/lang_55/src/java/org/apache/commons/lang/Entities.java:[111,31] unmappable character for encoding UTF8
[ERROR] /builds/workspace/astor/examples/lang_55/src/java/org/apache/commons/lang/Entities.java:[112,31] unmappable character for encoding UTF8
[ERROR] /builds/workspace/astor/examples/lang_55/src/java/org/apache/commons/lang/Entities.java:[113,31] unmappable character for encoding UTF8
[ERROR] /builds/workspace/astor/examples/lang_55/src/java/org/apache/commons/lang/Entities.java:[114,30] unmappable character for encoding UTF8
[ERROR] /builds/workspace/astor/examples/lang_55/src/java/org/apache/commons/lang/Entities.java:[115,29] unmappable character for encoding UTF8
[ERROR] /builds/workspace/astor/examples/lang_55/src/java/org/apache/commons/lang/Entities.java:[116,31] unmappable character for encoding UTF8
[ERROR] /builds/workspace/astor/examples/lang_55/src/java/org/apache/commons/lang/Entities.java:[117,30] unmappable character for encoding UTF8
[ERROR] /builds/workspace/astor/examples/lang_55/src/java/org/apache/commons/lang/Entities.java:[118,30] unmappable character for encoding UTF8
[ERROR] /builds/workspace/astor/examples/lang_55/src/java/org/apache/commons/lang/Entities.java:[119,31] unmappable character for encoding UTF8
[ERROR] /builds/workspace/astor/examples/lang_55/src/java/org/apache/commons/lang/Entities.java:[120,31] unmappable character for encoding UTF8
[ERROR] /builds/workspace/astor/examples/lang_55/src/java/org/apache/commons/lang/Entities.java:[121,30] unmappable character for encoding UTF8
[ERROR] /builds/workspace/astor/examples/lang_55/src/java/org/apache/commons/lang/Entities.java:[122,31] unmappable character for encoding UTF8
[ERROR] /builds/workspace/astor/examples/lang_55/src/java/org/apache/commons/lang/Entities.java:[123,29] unmappable character for encoding UTF8
[ERROR] /builds/workspace/astor/examples/lang_55/src/java/org/apache/commons/lang/Entities.java:[124,30] unmappable character for encoding UTF8
[ERROR] /builds/workspace/astor/examples/lang_55/src/java/org/apache/commons/lang/Entities.java:[125,30] unmappable character for encoding UTF8
[ERROR] /builds/workspace/astor/examples/lang_55/src/java/org/apache/commons/lang/Entities.java:[126,31] unmappable character for encoding UTF8
[ERROR] /builds/workspace/astor/examples/lang_55/src/java/org/apache/commons/lang/Entities.java:[127,31] unmappable character for encoding UTF8
[ERROR] /builds/workspace/astor/examples/lang_55/src/java/org/apache/commons/lang/Entities.java:[128,31] unmappable character for encoding UTF8
[ERROR] /builds/workspace/astor/examples/lang_55/src/java/org/apache/commons/lang/Entities.java:[129,30] unmappable character for encoding UTF8
[ERROR] /builds/workspace/astor/examples/lang_55/src/java/org/apache/commons/lang/Entities.java:[130,29] unmappable character for encoding UTF8
[ERROR] /builds/workspace/astor/examples/lang_55/src/java/org/apache/commons/lang/Entities.java:[131,31] unmappable character for encoding UTF8
[ERROR] /builds/workspace/astor/examples/lang_55/src/java/org/apache/commons/lang/Entities.java:[132,31] unmappable character for encoding UTF8
[ERROR] /builds/workspace/astor/examples/lang_55/src/java/org/apache/commons/lang/Entities.java:[133,30] unmappable character for encoding UTF8
[ERROR] /builds/workspace/astor/examples/lang_55/src/java/org/apache/commons/lang/Entities.java:[134,29] unmappable character for encoding UTF8
[ERROR] /builds/workspace/astor/examples/lang_55/src/java/org/apache/commons/lang/Entities.java:[135,28] unmappable character for encoding UTF8
[ERROR] /builds/workspace/astor/examples/lang_55/src/java/org/apache/commons/lang/Entities.java:[136,31] unmappable character for encoding UTF8
[ERROR] /builds/workspace/astor/examples/lang_55/src/java/org/apache/commons/lang/Entities.java:[137,31] unmappable character for encoding UTF8
[ERROR] /builds/workspace/astor/examples/lang_55/src/java/org/apache/commons/lang/Entities.java:[138,31] unmappable character for encoding UTF8
[ERROR] /builds/workspace/astor/examples/lang_55/src/java/org/apache/commons/lang/Entities.java:[139,30] unmappable character for encoding UTF8
[ERROR] /builds/workspace/astor/examples/lang_55/src/java/org/apache/commons/lang/Entities.java:[140,31] unmappable character for encoding UTF8
[ERROR] /builds/workspace/astor/examples/lang_55/src/java/org/apache/commons/lang/Entities.java:[141,29] unmappable character for encoding UTF8
[ERROR] /builds/workspace/astor/examples/lang_55/src/java/org/apache/commons/lang/Entities.java:[143,31] unmappable character for encoding UTF8
[ERROR] /builds/workspace/astor/examples/lang_55/src/java/org/apache/commons/lang/Entities.java:[144,31] unmappable character for encoding UTF8
[ERROR] /builds/workspace/astor/examples/lang_55/src/java/org/apache/commons/lang/Entities.java:[145,31] unmappable character for encoding UTF8
[ERROR] /builds/workspace/astor/examples/lang_55/src/java/org/apache/commons/lang/Entities.java:[146,30] unmappable character for encoding UTF8
[ERROR] /builds/workspace/astor/examples/lang_55/src/java/org/apache/commons/lang/Entities.java:[147,29] unmappable character for encoding UTF8
[ERROR] /builds/workspace/astor/examples/lang_55/src/java/org/apache/commons/lang/Entities.java:[148,31] unmappable character for encoding UTF8
[ERROR] /builds/workspace/astor/examples/lang_55/src/java/org/apache/commons/lang/Entities.java:[149,30] unmappable character for encoding UTF8
[ERROR] /builds/workspace/astor/examples/lang_55/src/java/org/apache/commons/lang/Entities.java:[150,29] unmappable character for encoding UTF8
[ERROR] Failed to execute goal org.apache.maven.plugins:maven-compiler-plugin:3.2:compile (default-compile) on project commons-lang: Compilation failure: Compilation failure:
[ERROR] /builds/workspace/astor/examples/lang_55/src/java/org/apache/commons/lang/enum/Enum.java:[17,33] as of release 5, 'enum' is a keyword, and may not be used as an identifier
[ERROR] (use -source 1.4 or lower to use 'enum' as an identifier)
[ERROR] /builds/workspace/astor/examples/lang_55/src/java/org/apache/commons/lang/enum/ValuedEnum.java:[17,33] as of release 5, 'enum' is a keyword, and may not be used as an identifier
[ERROR] (use -source 1.4 or lower to use 'enum' as an identifier)
[ERROR] /builds/workspace/astor/examples/lang_55/src/java/org/apache/commons/lang/enum/EnumUtils.java:[17,33] as of release 5, 'enum' is a keyword, and may not be used as an identifier
[ERROR] (use -source 1.4 or lower to use 'enum' as an identifier)
[ERROR] /builds/workspace/astor/examples/lang_55/src/java/org/apache/commons/lang/Entities.java:[64,29] unmappable character for encoding UTF8
[ERROR] /builds/workspace/astor/examples/lang_55/src/java/org/apache/commons/lang/Entities.java:[69,28] unmappable character for encoding UTF8
[ERROR] /builds/workspace/astor/examples/lang_55/src/java/org/apache/commons/lang/Entities.java:[87,31] unmappable character for encoding UTF8
[ERROR] /builds/workspace/astor/examples/lang_55/src/java/org/apache/commons/lang/Entities.java:[88,31] unmappable character for encoding UTF8
[ERROR] /builds/workspace/astor/examples/lang_55/src/java/org/apache/commons/lang/Entities.java:[89,30] unmappable character for encoding UTF8
[ERROR] /builds/workspace/astor/examples/lang_55/src/java/org/apache/commons/lang/Entities.java:[90,31] unmappable character for encoding UTF8
[ERROR] /builds/workspace/astor/examples/lang_55/src/java/org/apache/commons/lang/Entities.java:[91,29] unmappable character for encoding UTF8
[ERROR] /builds/workspace/astor/examples/lang_55/src/java/org/apache/commons/lang/Entities.java:[92,30] unmappable character for encoding UTF8
[ERROR] /builds/workspace/astor/examples/lang_55/src/java/org/apache/commons/lang/Entities.java:[93,30] unmappable character for encoding UTF8
[ERROR] /builds/workspace/astor/examples/lang_55/src/java/org/apache/commons/lang/Entities.java:[94,31] unmappable character for encoding UTF8
[ERROR] /builds/workspace/astor/examples/lang_55/src/java/org/apache/commons/lang/Entities.java:[95,31] unmappable character for encoding UTF8
[ERROR] /builds/workspace/astor/examples/lang_55/src/java/org/apache/commons/lang/Entities.java:[96,31] unmappable character for encoding UTF8
[ERROR] /builds/workspace/astor/examples/lang_55/src/java/org/apache/commons/lang/Entities.java:[97,30] unmappable character for encoding UTF8
[ERROR] /builds/workspace/astor/examples/lang_55/src/java/org/apache/commons/lang/Entities.java:[98,29] unmappable character for encoding UTF8
[ERROR] /builds/workspace/astor/examples/lang_55/src/java/org/apache/commons/lang/Entities.java:[99,31] unmappable character for encoding UTF8
[ERROR] /builds/workspace/astor/examples/lang_55/src/java/org/apache/commons/lang/Entities.java:[100,31] unmappable character for encoding UTF8
[ERROR] /builds/workspace/astor/examples/lang_55/src/java/org/apache/commons/lang/Entities.java:[101,30] unmappable character for encoding UTF8
[ERROR] /builds/workspace/astor/examples/lang_55/src/java/org/apache/commons/lang/Entities.java:[102,29] unmappable character for encoding UTF8
[ERROR] /builds/workspace/astor/examples/lang_55/src/java/org/apache/commons/lang/Entities.java:[103,28] unmappable character for encoding UTF8
[ERROR] /builds/workspace/astor/examples/lang_55/src/java/org/apache/commons/lang/Entities.java:[104,31] unmappable character for encoding UTF8
[ERROR] /builds/workspace/astor/examples/lang_55/src/java/org/apache/commons/lang/Entities.java:[105,31] unmappable character for encoding UTF8
[ERROR] /builds/workspace/astor/examples/lang_55/src/java/org/apache/commons/lang/Entities.java:[106,31] unmappable character for encoding UTF8
[ERROR] /builds/workspace/astor/examples/lang_55/src/java/org/apache/commons/lang/Entities.java:[107,30] unmappable character for encoding UTF8
[ERROR] /builds/workspace/astor/examples/lang_55/src/java/org/apache/commons/lang/Entities.java:[108,31] unmappable character for encoding UTF8
[ERROR] /builds/workspace/astor/examples/lang_55/src/java/org/apache/commons/lang/Entities.java:[109,29] unmappable character for encoding UTF8
[ERROR] /builds/workspace/astor/examples/lang_55/src/java/org/apache/commons/lang/Entities.java:[111,31] unmappable character for encoding UTF8
[ERROR] /builds/workspace/astor/examples/lang_55/src/java/org/apache/commons/lang/Entities.java:[112,31] unmappable character for encoding UTF8
[ERROR] /builds/workspace/astor/examples/lang_55/src/java/org/apache/commons/lang/Entities.java:[113,31] unmappable character for encoding UTF8
[ERROR] /builds/workspace/astor/examples/lang_55/src/java/org/apache/commons/lang/Entities.java:[114,30] unmappable character for encoding UTF8
[ERROR] /builds/workspace/astor/examples/lang_55/src/java/org/apache/commons/lang/Entities.java:[115,29] unmappable character for encoding UTF8
[ERROR] /builds/workspace/astor/examples/lang_55/src/java/org/apache/commons/lang/Entities.java:[116,31] unmappable character for encoding UTF8
[ERROR] /builds/workspace/astor/examples/lang_55/src/java/org/apache/commons/lang/Entities.java:[117,30] unmappable character for encoding UTF8
[ERROR] /builds/workspace/astor/examples/lang_55/src/java/org/apache/commons/lang/Entities.java:[118,30] unmappable character for encoding UTF8
[ERROR] /builds/workspace/astor/examples/lang_55/src/java/org/apache/commons/lang/Entities.java:[119,31] unmappable character for encoding UTF8
[ERROR] /builds/workspace/astor/examples/lang_55/src/java/org/apache/commons/lang/Entities.java:[120,31] unmappable character for encoding UTF8
[ERROR] /builds/workspace/astor/examples/lang_55/src/java/org/apache/commons/lang/Entities.java:[121,30] unmappable character for encoding UTF8
[ERROR] /builds/workspace/astor/examples/lang_55/src/java/org/apache/commons/lang/Entities.java:[122,31] unmappable character for encoding UTF8
[ERROR] /builds/workspace/astor/examples/lang_55/src/java/org/apache/commons/lang/Entities.java:[123,29] unmappable character for encoding UTF8
[ERROR] /builds/workspace/astor/examples/lang_55/src/java/org/apache/commons/lang/Entities.java:[124,30] unmappable character for encoding UTF8
[ERROR] /builds/workspace/astor/examples/lang_55/src/java/org/apache/commons/lang/Entities.java:[125,30] unmappable character for encoding UTF8
[ERROR] /builds/workspace/astor/examples/lang_55/src/java/org/apache/commons/lang/Entities.java:[126,31] unmappable character for encoding UTF8
[ERROR] /builds/workspace/astor/examples/lang_55/src/java/org/apache/commons/lang/Entities.java:[127,31] unmappable character for encoding UTF8
[ERROR] /builds/workspace/astor/examples/lang_55/src/java/org/apache/commons/lang/Entities.java:[128,31] unmappable character for encoding UTF8
[ERROR] /builds/workspace/astor/examples/lang_55/src/java/org/apache/commons/lang/Entities.java:[129,30] unmappable character for encoding UTF8
[ERROR] /builds/workspace/astor/examples/lang_55/src/java/org/apache/commons/lang/Entities.java:[130,29] unmappable character for encoding UTF8
[ERROR] /builds/workspace/astor/examples/lang_55/src/java/org/apache/commons/lang/Entities.java:[131,31] unmappable character for encoding UTF8
[ERROR] /builds/workspace/astor/examples/lang_55/src/java/org/apache/commons/lang/Entities.java:[132,31] unmappable character for encoding UTF8
[ERROR] /builds/workspace/astor/examples/lang_55/src/java/org/apache/commons/lang/Entities.java:[133,30] unmappable character for encoding UTF8
[ERROR] /builds/workspace/astor/examples/lang_55/src/java/org/apache/commons/lang/Entities.java:[134,29] unmappable character for encoding UTF8
[ERROR] /builds/workspace/astor/examples/lang_55/src/java/org/apache/commons/lang/Entities.java:[135,28] unmappable character for encoding UTF8
[ERROR] /builds/workspace/astor/examples/lang_55/src/java/org/apache/commons/lang/Entities.java:[136,31] unmappable character for encoding UTF8
[ERROR] /builds/workspace/astor/examples/lang_55/src/java/org/apache/commons/lang/Entities.java:[137,31] unmappable character for encoding UTF8
[ERROR] /builds/workspace/astor/examples/lang_55/src/java/org/apache/commons/lang/Entities.java:[138,31] unmappable character for encoding UTF8
[ERROR] /builds/workspace/astor/examples/lang_55/src/java/org/apache/commons/lang/Entities.java:[139,30] unmappable character for encoding UTF8
[ERROR] /builds/workspace/astor/examples/lang_55/src/java/org/apache/commons/lang/Entities.java:[140,31] unmappable character for encoding UTF8
[ERROR] /builds/workspace/astor/examples/lang_55/src/java/org/apache/commons/lang/Entities.java:[141,29] unmappable character for encoding UTF8
[ERROR] /builds/workspace/astor/examples/lang_55/src/java/org/apache/commons/lang/Entities.java:[143,31] unmappable character for encoding UTF8
[ERROR] /builds/workspace/astor/examples/lang_55/src/java/org/apache/commons/lang/Entities.java:[144,31] unmappable character for encoding UTF8
[ERROR] /builds/workspace/astor/examples/lang_55/src/java/org/apache/commons/lang/Entities.java:[145,31] unmappable character for encoding UTF8
[ERROR] /builds/workspace/astor/examples/lang_55/src/java/org/apache/commons/lang/Entities.java:[146,30] unmappable character for encoding UTF8
[ERROR] /builds/workspace/astor/examples/lang_55/src/java/org/apache/commons/lang/Entities.java:[147,29] unmappable character for encoding UTF8
[ERROR] /builds/workspace/astor/examples/lang_55/src/java/org/apache/commons/lang/Entities.java:[148,31] unmappable character for encoding UTF8
[ERROR] /builds/workspace/astor/examples/lang_55/src/java/org/apache/commons/lang/Entities.java:[149,30] unmappable character for encoding UTF8
[ERROR] /builds/workspace/astor/examples/lang_55/src/java/org/apache/commons/lang/Entities.java:[150,29] unmappable character for encoding UTF8
[ERROR] -> [Help 1]
[ERROR] 
[ERROR] To see the full stack trace of the errors, re-run Maven with the -e switch.
[ERROR] Re-run Maven using the -X switch to enable full debug logging.
[ERROR] 
[ERROR] For more information about the errors and possible solutions, please read the following articles:
[ERROR] [Help 1] http://cwiki.apache.org/confluence/display/MAVEN/MojoFailureException
compiling examples/math_57/
Picked up JAVA_TOOL_OPTIONS: -Dfile.encoding=UTF8
compiling examples/math_70_modified/
Picked up JAVA_TOOL_OPTIONS: -Dfile.encoding=UTF8
compiling examples/lang_7/
Picked up JAVA_TOOL_OPTIONS: -Dfile.encoding=UTF8
[ERROR] COMPILATION ERROR : 
[ERROR] /builds/workspace/astor/examples/lang_7/src/test/java/org/apache/commons/lang3/reflect/TypeUtilsTest.java:[514,40] error: incompatible types: inferred type does not conform to upper bound(s)
[ERROR] Failed to execute goal org.apache.maven.plugins:maven-compiler-plugin:2.5.1:testCompile (default-testCompile) on project commons-lang3: Compilation failure
[ERROR] /builds/workspace/astor/examples/lang_7/src/test/java/org/apache/commons/lang3/reflect/TypeUtilsTest.java:[514,40] error: incompatible types: inferred type does not conform to upper bound(s)
[ERROR] -> [Help 1]
[ERROR] 
[ERROR] To see the full stack trace of the errors, re-run Maven with the -e switch.
[ERROR] Re-run Maven using the -X switch to enable full debug logging.
[ERROR] 
[ERROR] For more information about the errors and possible solutions, please read the following articles:
[ERROR] [Help 1] http://cwiki.apache.org/confluence/display/MAVEN/MojoFailureException
compiling examples/issues/LeapYearIssue196/
Picked up JAVA_TOOL_OPTIONS: -Dfile.encoding=UTF8
compiling examples/issues/LeapYearIssue196-bis/
Picked up JAVA_TOOL_OPTIONS: -Dfile.encoding=UTF8
+ mvn clean
Picked up JAVA_TOOL_OPTIONS: -Dfile.encoding=UTF8
[INFO] Scanning for projects...
[WARNING] 
[WARNING] Some problems were encountered while building the effective model for org.inria.sacha.automaticRepair:astor:jar:1.0.0-SNAPSHOT
[WARNING] 'build.plugins.plugin.(groupId:artifactId)' must be unique but found duplicate declaration of plugin org.apache.maven.plugins:maven-surefire-plugin @ line 290, column 12
[WARNING] 'build.plugins.plugin.version' for org.codehaus.mojo:build-helper-maven-plugin is missing. @ line 265, column 12
[WARNING] 'dependencies.dependency.exclusions.exclusion.groupId' for fr.inria.gforge.spoon:spoon-core:jar is missing. @ line 47, column 15
[WARNING] 'dependencies.dependency.exclusions.exclusion.artifactId' for fr.inria.gforge.spoon:spoon-core:jar with value '/src/main/resources/log4j.properties' does not match a valid id pattern. @ line 48, column 18
[WARNING] 'repositories.repository.id' must not contain any of these characters \/:"<>|?* but found / @ line 154, column 8
[WARNING] 
[WARNING] It is highly recommended to fix these problems because they threaten the stability of your build.
[WARNING] 
[WARNING] For this reason, future Maven versions might no longer support building such malformed projects.
[WARNING] 
[INFO]                                                                         
[INFO] ------------------------------------------------------------------------
[INFO] Building astor 1.0.0-SNAPSHOT
[INFO] ------------------------------------------------------------------------
[INFO] 
[INFO] --- maven-clean-plugin:3.0.0:clean (default-clean) @ astor ---
[INFO] ------------------------------------------------------------------------
[INFO] BUILD SUCCESS
[INFO] ------------------------------------------------------------------------
[INFO] Total time: 1.209 s
[INFO] Finished at: 2020-02-22T12:31:52+01:00
[INFO] Final Memory: 11M/94M
[INFO] ------------------------------------------------------------------------
+ mvn versions:use-latest-versions -DallowSnapshots=true -Dincludes=fr.inria.gforge.spoon
Picked up JAVA_TOOL_OPTIONS: -Dfile.encoding=UTF8
[INFO] Scanning for projects...
[WARNING] 
[WARNING] Some problems were encountered while building the effective model for org.inria.sacha.automaticRepair:astor:jar:1.0.0-SNAPSHOT
[WARNING] 'build.plugins.plugin.(groupId:artifactId)' must be unique but found duplicate declaration of plugin org.apache.maven.plugins:maven-surefire-plugin @ line 290, column 12
[WARNING] 'build.plugins.plugin.version' for org.codehaus.mojo:build-helper-maven-plugin is missing. @ line 265, column 12
[WARNING] 'dependencies.dependency.exclusions.exclusion.groupId' for fr.inria.gforge.spoon:spoon-core:jar is missing. @ line 47, column 15
[WARNING] 'dependencies.dependency.exclusions.exclusion.artifactId' for fr.inria.gforge.spoon:spoon-core:jar with value '/src/main/resources/log4j.properties' does not match a valid id pattern. @ line 48, column 18
[WARNING] 'repositories.repository.id' must not contain any of these characters \/:"<>|?* but found / @ line 154, column 8
[WARNING] 
[WARNING] It is highly recommended to fix these problems because they threaten the stability of your build.
[WARNING] 
[WARNING] For this reason, future Maven versions might no longer support building such malformed projects.
[WARNING] 
[INFO]                                                                         
[INFO] ------------------------------------------------------------------------
[INFO] Building astor 1.0.0-SNAPSHOT
[INFO] ------------------------------------------------------------------------
[INFO] 
[INFO] --- versions-maven-plugin:2.4:use-latest-versions (default-cli) @ astor ---
[INFO] Major version changes allowed
[INFO] artifact fr.inria.gforge.spoon:spoon-core: checking for updates from inria
[INFO] artifact fr.inria.gforge.spoon:spoon-core: checking for updates from gforge.inria.fr-release
[INFO] artifact fr.inria.gforge.spoon:spoon-core: checking for updates from EvoSuite
[INFO] artifact fr.inria.gforge.spoon:spoon-core: checking for updates from central
[INFO] Updated fr.inria.gforge.spoon:spoon-core:jar:7.5.0 to version 8.1.0-SNAPSHOT
[INFO] ------------------------------------------------------------------------
[INFO] BUILD SUCCESS
[INFO] ------------------------------------------------------------------------
[INFO] Total time: 4.645 s
[INFO] Finished at: 2020-02-22T12:31:58+01:00
[INFO] Final Memory: 19M/173M
[INFO] ------------------------------------------------------------------------
+ mvn test -Dtest=JGenProgEvolutionaryTest
Picked up JAVA_TOOL_OPTIONS: -Dfile.encoding=UTF8
[INFO] Scanning for projects...
[WARNING] 
[WARNING] Some problems were encountered while building the effective model for org.inria.sacha.automaticRepair:astor:jar:1.0.0-SNAPSHOT
[WARNING] 'build.plugins.plugin.(groupId:artifactId)' must be unique but found duplicate declaration of plugin org.apache.maven.plugins:maven-surefire-plugin @ line 290, column 12
[WARNING] 'build.plugins.plugin.version' for org.codehaus.mojo:build-helper-maven-plugin is missing. @ line 265, column 12
[WARNING] 'dependencies.dependency.exclusions.exclusion.groupId' for fr.inria.gforge.spoon:spoon-core:jar is missing. @ line 47, column 15
[WARNING] 'dependencies.dependency.exclusions.exclusion.artifactId' for fr.inria.gforge.spoon:spoon-core:jar with value '/src/main/resources/log4j.properties' does not match a valid id pattern. @ line 48, column 18
[WARNING] 'repositories.repository.id' must not contain any of these characters \/:"<>|?* but found / @ line 154, column 8
[WARNING] 
[WARNING] It is highly recommended to fix these problems because they threaten the stability of your build.
[WARNING] 
[WARNING] For this reason, future Maven versions might no longer support building such malformed projects.
[WARNING] 
[INFO]                                                                         
[INFO] ------------------------------------------------------------------------
[INFO] Building astor 1.0.0-SNAPSHOT
[INFO] ------------------------------------------------------------------------
Downloading: http://www.evosuite.org/m2/fr/inria/gforge/spoon/spoon-core/8.1.0-SNAPSHOT/maven-metadata.xml
Downloading: http://spoon.gforge.inria.fr/repositories/releases/fr/inria/gforge/spoon/spoon-core/8.1.0-SNAPSHOT/maven-metadata.xml
Downloading: http://sachaproject.gforge.inria.fr/repositories/releases/fr/inria/gforge/spoon/spoon-core/8.1.0-SNAPSHOT/maven-metadata.xml



Downloading: http://sachaproject.gforge.inria.fr/repositories/releases/fil/iagl/cocospoon/CocoSpoon/1.0.0-SNAPSHOT/maven-metadata.xml
Downloading: http://www.evosuite.org/m2/fil/iagl/cocospoon/CocoSpoon/1.0.0-SNAPSHOT/maven-metadata.xml
Downloading: http://maven.inria.fr/artifactory/spoon-public-snapshot/fil/iagl/cocospoon/CocoSpoon/1.0.0-SNAPSHOT/maven-metadata.xml



Downloading: http://spoon.gforge.inria.fr/repositories/releases/fr/inria/gforge/spirals/nopol/0.2-SNAPSHOT/maven-metadata.xml
Downloading: http://spoon.gforge.inria.fr/repositories/snapshots/fr/inria/gforge/spirals/nopol/0.2-SNAPSHOT/maven-metadata.xml
Downloading: http://sachaproject.gforge.inria.fr/repositories/releases/fr/inria/gforge/spirals/nopol/0.2-SNAPSHOT/maven-metadata.xml
Downloading: http://www.evosuite.org/m2/fr/inria/gforge/spirals/nopol/0.2-SNAPSHOT/maven-metadata.xml

Downloading: http://sachaproject.gforge.inria.fr/repositories/releases/fr/inria/gforge/spirals/nopol/0.2-SNAPSHOT/maven-metadata.xml


Downloading: http://maven.inria.fr/artifactory/spoon-public-snapshot/fr/inria/gforge/spirals/nopol/0.2-SNAPSHOT/maven-metadata.xml
[WARNING] Could not apply configuration for gforge.inria.fr-snapshot to wagon org.apache.maven.wagon.providers.http.HttpWagon:Cannot find 'preferredAuthentications' in class org.apache.maven.wagon.providers.http.HttpWagon
Downloading: https://tdurieux.github.io/maven-repository/snapshots/fr/inria/gforge/spirals/nopol/0.2-SNAPSHOT/maven-metadata.xml



998 B   
        
Downloaded: https://tdurieux.github.io/maven-repository/snapshots/fr/inria/gforge/spirals/nopol/0.2-SNAPSHOT/maven-metadata.xml (998 B at 0.9 KB/sec)
Downloading: http://spoon.gforge.inria.fr/repositories/releases/fr/inria/gforge/spoon/spoon-core/6.0.0/spoon-core-6.0.0.pom
        
Downloading: http://spoon.gforge.inria.fr/repositories/snapshots/fr/inria/gforge/spoon/spoon-core/6.0.0/spoon-core-6.0.0.pom
[WARNING] Could not apply configuration for gforge.inria.fr-snapshot to wagon org.apache.maven.wagon.providers.http.HttpWagon:Cannot find 'preferredAuthentications' in class org.apache.maven.wagon.providers.http.HttpWagon
        
Downloading: http://sachaproject.gforge.inria.fr/repositories/releases/fr/inria/gforge/spoon/spoon-core/6.0.0/spoon-core-6.0.0.pom
        
Downloading: http://www.evosuite.org/m2/fr/inria/gforge/spoon/spoon-core/6.0.0/spoon-core-6.0.0.pom
        
Downloading: https://tdurieux.github.io/maven-repository/snapshots/fr/inria/gforge/spoon/spoon-core/6.0.0/spoon-core-6.0.0.pom
        
Downloading: http://maven.inria.fr/artifactory/spoon-public-snapshot/fr/inria/gforge/spoon/spoon-core/6.0.0/spoon-core-6.0.0.pom
        
Downloading: https://repo.maven.apache.org/maven2/fr/inria/gforge/spoon/spoon-core/6.0.0/spoon-core-6.0.0.pom
2/19 KB   
3/19 KB   
5/19 KB   
6/19 KB   
7/19 KB   
9/19 KB   
10/19 KB   
11/19 KB   
13/19 KB   
14/19 KB   
15/19 KB   
17/19 KB   
18/19 KB   
19/19 KB   
           
Downloaded: https://repo.maven.apache.org/maven2/fr/inria/gforge/spoon/spoon-core/6.0.0/spoon-core-6.0.0.pom (19 KB at 463.1 KB/sec)
[INFO] 
[INFO] --- jacoco-maven-plugin:0.7.5.201505241946:prepare-agent (default) @ astor ---
[INFO] argLine set to -javaagent:/builds/.m2/repository/org/jacoco/org.jacoco.agent/0.7.5.201505241946/org.jacoco.agent-0.7.5.201505241946-runtime.jar=destfile=/builds/workspace/astor/target/jacoco.exec
[INFO] 
[INFO] --- build-helper-maven-plugin:3.0.0:add-source (default) @ astor ---
[INFO] Source directory: /builds/workspace/astor/src/main/java added.
[INFO] Source directory: /builds/workspace/astor/src-core/main/java added.
[INFO] Source directory: /builds/workspace/astor/src-jgenprog/main/java added.
[INFO] Source directory: /builds/workspace/astor/src-jkali/main/java added.
[INFO] Source directory: /builds/workspace/astor/src-jmutrepair/main/java added.
[INFO] Source directory: /builds/workspace/astor/src-cardumen/main/java added.
[INFO] Source directory: /builds/workspace/astor/src-deeprepair/main/java added.
[INFO] Source directory: /builds/workspace/astor/src-3sfix/main/java added.
[INFO] 
[INFO] --- maven-resources-plugin:2.6:resources (default-resources) @ astor ---
[INFO] Using 'UTF-8' encoding to copy filtered resources.
[INFO] Copying 2 resources
[INFO] 
[INFO] --- maven-compiler-plugin:3.0:compile (default-compile) @ astor ---
[INFO] Changes detected - recompiling the module!
[INFO] Compiling 395 source files to /builds/workspace/astor/target/classes
[INFO] -------------------------------------------------------------
[WARNING] COMPILATION WARNING : 
[INFO] -------------------------------------------------------------
[WARNING] /builds/workspace/astor/src/main/java/fr/inria/astor/approaches/scaffold/scaffoldgeneration/TransformStrategy.java: Some input files use or override a deprecated API.
[WARNING] /builds/workspace/astor/src/main/java/fr/inria/astor/approaches/scaffold/scaffoldgeneration/TransformStrategy.java: Recompile with -Xlint:deprecation for details.
[WARNING] /builds/workspace/astor/src/main/java/fr/inria/astor/core/manipulation/synthesis/dynamoth/spoon/StaSynthBuilder.java: Some input files use unchecked or unsafe operations.
[WARNING] /builds/workspace/astor/src/main/java/fr/inria/astor/core/manipulation/synthesis/dynamoth/spoon/StaSynthBuilder.java: Recompile with -Xlint:unchecked for details.
[INFO] 4 warnings 
[INFO] -------------------------------------------------------------
[INFO] -------------------------------------------------------------
[ERROR] COMPILATION ERROR : 
[INFO] -------------------------------------------------------------
[ERROR] /builds/workspace/astor/src/main/java/fr/inria/astor/approaches/scaffold/scaffoldgeneration/libinfo/LibParser.java:[23,29] cannot find symbol
  symbol:   class ImportScanner
  location: package spoon.reflect.visitor
[ERROR] /builds/workspace/astor/src/main/java/fr/inria/astor/approaches/scaffold/scaffoldgeneration/libinfo/LibParser.java:[24,29] cannot find symbol
  symbol:   class ImportScannerImpl
  location: package spoon.reflect.visitor
[ERROR] /builds/workspace/astor/src/main/java/fr/inria/astor/approaches/scaffold/scaffoldgeneration/libinfo/LibParser.java:[53,9] cannot find symbol
  symbol:   class ImportScanner
  location: class fr.inria.astor.approaches.scaffold.scaffoldgeneration.libinfo.LibParser
[ERROR] /builds/workspace/astor/src/main/java/fr/inria/astor/approaches/scaffold/scaffoldgeneration/libinfo/LibParser.java:[53,43] cannot find symbol
  symbol:   class ImportScannerImpl
  location: class fr.inria.astor.approaches.scaffold.scaffoldgeneration.libinfo.LibParser
[INFO] 4 errors 
[INFO] -------------------------------------------------------------
[INFO] ------------------------------------------------------------------------
[INFO] BUILD FAILURE
[INFO] ------------------------------------------------------------------------
[INFO] Total time: 10.456 s
[INFO] Finished at: 2020-02-22T12:32:10+01:00
[INFO] Final Memory: 28M/212M
[INFO] ------------------------------------------------------------------------
[ERROR] Failed to execute goal org.apache.maven.plugins:maven-compiler-plugin:3.0:compile (default-compile) on project astor: Compilation failure: Compilation failure:
[ERROR] /builds/workspace/astor/src/main/java/fr/inria/astor/approaches/scaffold/scaffoldgeneration/libinfo/LibParser.java:[23,29] cannot find symbol
[ERROR] symbol:   class ImportScanner
[ERROR] location: package spoon.reflect.visitor
[ERROR] /builds/workspace/astor/src/main/java/fr/inria/astor/approaches/scaffold/scaffoldgeneration/libinfo/LibParser.java:[24,29] cannot find symbol
[ERROR] symbol:   class ImportScannerImpl
[ERROR] location: package spoon.reflect.visitor
[ERROR] /builds/workspace/astor/src/main/java/fr/inria/astor/approaches/scaffold/scaffoldgeneration/libinfo/LibParser.java:[53,9] cannot find symbol
[ERROR] symbol:   class ImportScanner
[ERROR] location: class fr.inria.astor.approaches.scaffold.scaffoldgeneration.libinfo.LibParser
[ERROR] /builds/workspace/astor/src/main/java/fr/inria/astor/approaches/scaffold/scaffoldgeneration/libinfo/LibParser.java:[53,43] cannot find symbol
[ERROR] symbol:   class ImportScannerImpl
[ERROR] location: class fr.inria.astor.approaches.scaffold.scaffoldgeneration.libinfo.LibParser
[ERROR] -> [Help 1]
[ERROR] 
[ERROR] To see the full stack trace of the errors, re-run Maven with the -e switch.
[ERROR] Re-run Maven using the -X switch to enable full debug logging.
[ERROR] 
[ERROR] For more information about the errors and possible solutions, please read the following articles:
[ERROR] [Help 1] http://cwiki.apache.org/confluence/display/MAVEN/MojoFailureException
Build step 'Execute shell' marked build as failure
Sending e-mails to: martin.monperrus@gnieh.org matias.sebastian.martinez@gmail.com
[WS-CLEANUP] Deleting project workspace...
[WS-CLEANUP] Deferred wipeout is used...
[WS-CLEANUP] done
Finished: FAILURE