FailedConsole Output

Started by timer
Running as SYSTEM
[EnvInject] - Loading node environment variables.
Building remotely on sos-builder01 (lin) in workspace /builds/workspace/coming
No credentials specified
Cloning the remote Git repository
Cloning repository https://github.com/SpoonLabs/coming.git
 > git init /builds/workspace/coming # timeout=10
Fetching upstream changes from https://github.com/SpoonLabs/coming.git
 > git --version # timeout=10
 > git fetch --tags --progress https://github.com/SpoonLabs/coming.git +refs/heads/*:refs/remotes/origin/*
 > git config remote.origin.url https://github.com/SpoonLabs/coming.git # timeout=10
 > git config --add remote.origin.fetch +refs/heads/*:refs/remotes/origin/* # timeout=10
 > git config remote.origin.url https://github.com/SpoonLabs/coming.git # timeout=10
Fetching upstream changes from https://github.com/SpoonLabs/coming.git
 > git fetch --tags --progress https://github.com/SpoonLabs/coming.git +refs/heads/*:refs/remotes/origin/*
 > git rev-parse refs/remotes/origin/master^{commit} # timeout=10
 > git rev-parse refs/remotes/origin/origin/master^{commit} # timeout=10
Checking out Revision f9b8206706712690898b8c7eb70057a0fdc092e6 (refs/remotes/origin/master)
 > git config core.sparsecheckout # timeout=10
 > git checkout -f f9b8206706712690898b8c7eb70057a0fdc092e6
Commit message: "Nopol tested and revised (#196)"
 > git rev-list --no-walk f9b8206706712690898b8c7eb70057a0fdc092e6 # timeout=10
[coming] $ /bin/sh -xe /tmp/jenkins6314428124926368102.sh
+ git clone https://github.com/SpoonLabs/repogit4testv0
Cloning into 'repogit4testv0'...
+ mvn clean
Picked up JAVA_TOOL_OPTIONS: -Dfile.encoding=UTF8
[INFO] Scanning for projects...
[WARNING] 
[WARNING] Some problems were encountered while building the effective model for com.github.spoonlabs:coming:jar:0-SNAPSHOT
[WARNING] 'repositories.repository.id' must not contain any of these characters \/:"<>|?* but found / @ line 190, column 8
[WARNING] 'repositories.repository.id' must not contain any of these characters \/:"<>|?* but found / @ line 196, column 8
[WARNING] 
[WARNING] It is highly recommended to fix these problems because they threaten the stability of your build.
[WARNING] 
[WARNING] For this reason, future Maven versions might no longer support building such malformed projects.
[WARNING] 
[INFO]                                                                         
[INFO] ------------------------------------------------------------------------
[INFO] Building coming-parent 0-SNAPSHOT
[INFO] ------------------------------------------------------------------------
[INFO] 
[INFO] --- maven-clean-plugin:2.5:clean (default-clean) @ coming ---
[INFO] ------------------------------------------------------------------------
[INFO] BUILD SUCCESS
[INFO] ------------------------------------------------------------------------
[INFO] Total time: 0.281 s
[INFO] Finished at: 2019-12-04T11:38:12+01:00
[INFO] Final Memory: 12M/94M
[INFO] ------------------------------------------------------------------------
+ mvn test
Picked up JAVA_TOOL_OPTIONS: -Dfile.encoding=UTF8
[INFO] Scanning for projects...
[WARNING] 
[WARNING] Some problems were encountered while building the effective model for com.github.spoonlabs:coming:jar:0-SNAPSHOT
[WARNING] 'repositories.repository.id' must not contain any of these characters \/:"<>|?* but found / @ line 190, column 8
[WARNING] 'repositories.repository.id' must not contain any of these characters \/:"<>|?* but found / @ line 196, column 8
[WARNING] 
[WARNING] It is highly recommended to fix these problems because they threaten the stability of your build.
[WARNING] 
[WARNING] For this reason, future Maven versions might no longer support building such malformed projects.
[WARNING] 
[INFO]                                                                         
[INFO] ------------------------------------------------------------------------
[INFO] Building coming-parent 0-SNAPSHOT
[INFO] ------------------------------------------------------------------------
Downloading: http://spoon.gforge.inria.fr/repositories/releases/fr/inria/gforge/spoon/spoon-core/7.3.0/spoon-core-7.3.0.pom

Downloading: http://spoon.gforge.inria.fr/repositories/snapshots/fr/inria/gforge/spoon/spoon-core/7.3.0/spoon-core-7.3.0.pom
[WARNING] Could not apply configuration for gforge.inria.fr-snapshot to wagon org.apache.maven.wagon.providers.http.HttpWagon:Cannot find 'preferredAuthentications' in class org.apache.maven.wagon.providers.http.HttpWagon

Downloading: http://sachaproject.gforge.inria.fr/repositories/releases/fr/inria/gforge/spoon/spoon-core/7.3.0/spoon-core-7.3.0.pom

Downloading: https://tdurieux.github.io/maven-repository/snapshots/fr/inria/gforge/spoon/spoon-core/7.3.0/spoon-core-7.3.0.pom

Downloading: https://tdurieux.github.io/maven-repository/releases/fr/inria/gforge/spoon/spoon-core/7.3.0/spoon-core-7.3.0.pom

Downloading: http://maven.inria.fr/artifactory/spoon-public-snapshot/fr/inria/gforge/spoon/spoon-core/7.3.0/spoon-core-7.3.0.pom

Downloading: https://repo.maven.apache.org/maven2/fr/inria/gforge/spoon/spoon-core/7.3.0/spoon-core-7.3.0.pom

Downloading: http://spoon.gforge.inria.fr/repositories/releases/fr/inria/gforge/spoon/labs/gumtree-spoon-ast-diff/1.21/gumtree-spoon-ast-diff-1.21.pom

Downloading: http://spoon.gforge.inria.fr/repositories/snapshots/fr/inria/gforge/spoon/labs/gumtree-spoon-ast-diff/1.21/gumtree-spoon-ast-diff-1.21.pom
[WARNING] Could not apply configuration for gforge.inria.fr-snapshot to wagon org.apache.maven.wagon.providers.http.HttpWagon:Cannot find 'preferredAuthentications' in class org.apache.maven.wagon.providers.http.HttpWagon

Downloading: http://sachaproject.gforge.inria.fr/repositories/releases/fr/inria/gforge/spoon/labs/gumtree-spoon-ast-diff/1.21/gumtree-spoon-ast-diff-1.21.pom

Downloading: https://tdurieux.github.io/maven-repository/snapshots/fr/inria/gforge/spoon/labs/gumtree-spoon-ast-diff/1.21/gumtree-spoon-ast-diff-1.21.pom

Downloading: https://tdurieux.github.io/maven-repository/releases/fr/inria/gforge/spoon/labs/gumtree-spoon-ast-diff/1.21/gumtree-spoon-ast-diff-1.21.pom

Downloading: http://maven.inria.fr/artifactory/spoon-public-snapshot/fr/inria/gforge/spoon/labs/gumtree-spoon-ast-diff/1.21/gumtree-spoon-ast-diff-1.21.pom

Downloading: https://repo.maven.apache.org/maven2/fr/inria/gforge/spoon/labs/gumtree-spoon-ast-diff/1.21/gumtree-spoon-ast-diff-1.21.pom

[INFO] ------------------------------------------------------------------------
[INFO] BUILD FAILURE
[INFO] ------------------------------------------------------------------------
[INFO] Total time: 14.047 s
[INFO] Finished at: 2019-12-04T11:38:28+01:00
[INFO] Final Memory: 14M/142M
[INFO] ------------------------------------------------------------------------
[ERROR] Failed to execute goal on project coming: Could not resolve dependencies for project com.github.spoonlabs:coming:jar:0-SNAPSHOT: Failed to collect dependencies at fr.inria.gforge.spoon:spoon-core:jar:7.3.0: Failed to read artifact descriptor for fr.inria.gforge.spoon:spoon-core:jar:7.3.0: Could not transfer artifact fr.inria.gforge.spoon:spoon-core:pom:7.3.0 from/to central (https://repo.maven.apache.org/maven2): repo.maven.apache.org: Temporary failure in name resolution: Unknown host repo.maven.apache.org: Temporary failure in name resolution -> [Help 1]
[ERROR] 
[ERROR] To see the full stack trace of the errors, re-run Maven with the -e switch.
[ERROR] Re-run Maven using the -X switch to enable full debug logging.
[ERROR] 
[ERROR] For more information about the errors and possible solutions, please read the following articles:
[ERROR] [Help 1] http://cwiki.apache.org/confluence/display/MAVEN/DependencyResolutionException
Build step 'Execute shell' marked build as failure
WARNING: No GitHub config available for this job, GitHub Issue Notifier will not run! Error: GitHub property not configured
[WS-CLEANUP] Deleting project workspace...
[WS-CLEANUP] Deferred wipeout is used...
[WS-CLEANUP] done
Finished: FAILURE