FailedConsole Output

Skipping 608 KB.. Full Log
.java: Some input files use unchecked or unsafe operations.
[INFO] /builds/workspace/juliac/extension/tinfi/module/opt-oo/mixed-embedded/target/generated-sources/juliac/juliac/CompositeLifeCycleControllerImpl.java: Recompile with -Xlint:unchecked for details.
[INFO] 
[INFO] --- maven-resources-plugin:2.7:testResources (default-testResources) @ frascati-tinfi-runtime-membranes-oo ---
[INFO] Using 'UTF-8' encoding to copy filtered resources.
[INFO] skip non existing resourceDirectory /builds/workspace/juliac/extension/tinfi/module/opt-oo/mixed-embedded/src/test/resources
[INFO] 
[INFO] --- maven-compiler-plugin:3.7.0:testCompile (default-testCompile) @ frascati-tinfi-runtime-membranes-oo ---
[INFO] No sources to compile
[INFO] 
[INFO] --- maven-surefire-plugin:2.22.1:test (default-test) @ frascati-tinfi-runtime-membranes-oo ---
[INFO] No tests to run.
[INFO] 
[INFO] --- maven-jar-plugin:2.4:jar (default-jar) @ frascati-tinfi-runtime-membranes-oo ---
[INFO] Building jar: /builds/workspace/juliac/extension/tinfi/module/opt-oo/mixed-embedded/target/frascati-tinfi-runtime-membranes-oo-2.8-SNAPSHOT.jar
[INFO] 
[INFO] --- maven-source-plugin:3.0.1:jar-no-fork (default) @ frascati-tinfi-runtime-membranes-oo ---
[INFO] Building jar: /builds/workspace/juliac/extension/tinfi/module/opt-oo/mixed-embedded/target/frascati-tinfi-runtime-membranes-oo-2.8-SNAPSHOT-sources.jar
[INFO]                                                                         
[INFO] ------------------------------------------------------------------------
[INFO] Building Tinfi Opt Level OO Conf Tests Fraclet 2.8-SNAPSHOT
[INFO] ------------------------------------------------------------------------
[INFO] 
[INFO] --- maven-clean-plugin:2.5:clean (default-clean) @ frascati-tinfi-tests-fraclet ---
[INFO] 
[INFO] --- maven-enforcer-plugin:1.0-beta-1:enforce (enforce-maven) @ frascati-tinfi-tests-fraclet ---
[INFO] 
[INFO] --- maven-dependency-plugin:2.10:copy (copy-julia-tinfi-mixins) @ frascati-tinfi-tests-fraclet ---
[INFO] Configured Artifact: org.objectweb.fractal.julia:julia-mixins:sources:2.5.2:jar
[INFO] Configured Artifact: org.ow2.fractal.juliac.tinfi:frascati-tinfi-mixins:sources:2.8-SNAPSHOT:jar
[INFO] Copying julia-mixins-2.5.2-sources.jar to /builds/workspace/juliac/extension/tinfi/module/opt-oo/tests-conf-fraclet/target/dependency/julia-mixins-sources.jar
[INFO] Copying frascati-tinfi-mixins-2.8-SNAPSHOT-sources.jar to /builds/workspace/juliac/extension/tinfi/module/opt-oo/tests-conf-fraclet/target/dependency/frascati-tinfi-mixins-sources.jar
[INFO] 
[INFO] --- maven-resources-plugin:2.7:resources (default-resources) @ frascati-tinfi-tests-fraclet ---
[INFO] Using 'UTF-8' encoding to copy filtered resources.
[INFO] Copying 18 resources
[INFO] 
[INFO] --- maven-compiler-plugin:3.7.0:compile (default-compile) @ frascati-tinfi-tests-fraclet ---
[INFO] Changes detected - recompiling the module!
[INFO] Compiling 46 source files to /builds/workspace/juliac/extension/tinfi/module/opt-oo/tests-conf-fraclet/target/classes
[INFO] 
[INFO] --- exec-maven-plugin:1.6.0:java (juliac-compile) @ frascati-tinfi-tests-fraclet ---
[INFO] Registering compile source root /builds/workspace/juliac/extension/tinfi/module/opt-oo/tests-conf-fraclet/target/generated-sources/juliac
[INFO] 
[INFO] --- maven-compiler-plugin:3.7.0:compile (juliac-compile) @ frascati-tinfi-tests-fraclet ---
[INFO] Changes detected - recompiling the module!
[INFO] Compiling 238 source files to /builds/workspace/juliac/extension/tinfi/module/opt-oo/tests-conf-fraclet/target/classes
[INFO] /builds/workspace/juliac/extension/tinfi/module/opt-oo/tests-conf-fraclet/target/generated-sources/juliac/juliac/org/ow2/frascati/tinfi/api/IntentHandlerInterceptorSCALC135dd8d9SCACCIntent.java: Some input files use unchecked or unsafe operations.
[INFO] /builds/workspace/juliac/extension/tinfi/module/opt-oo/tests-conf-fraclet/target/generated-sources/juliac/juliac/org/ow2/frascati/tinfi/api/IntentHandlerInterceptorSCALC135dd8d9SCACCIntent.java: Recompile with -Xlint:unchecked for details.
[INFO] 
[INFO] --- maven-resources-plugin:2.7:testResources (default-testResources) @ frascati-tinfi-tests-fraclet ---
[INFO] Using 'UTF-8' encoding to copy filtered resources.
[INFO] skip non existing resourceDirectory /builds/workspace/juliac/extension/tinfi/module/opt-oo/tests-conf-fraclet/src/test/resources
[INFO] 
[INFO] --- maven-compiler-plugin:3.7.0:testCompile (default-testCompile) @ frascati-tinfi-tests-fraclet ---
[INFO] Changes detected - recompiling the module!
[INFO] Compiling 13 source files to /builds/workspace/juliac/extension/tinfi/module/opt-oo/tests-conf-fraclet/target/test-classes
[INFO] 
[INFO] --- maven-surefire-plugin:2.22.1:test (default-test) @ frascati-tinfi-tests-fraclet ---
[INFO] Surefire report directory: /builds/workspace/juliac/extension/tinfi/module/opt-oo/tests-conf-fraclet/target/surefire-reports
[INFO] 
[INFO] -------------------------------------------------------
[INFO]  T E S T S
[INFO] -------------------------------------------------------
[INFO] Running org.ow2.frascati.tinfi.OneWayTestCase
[INFO] Tests run: 1, Failures: 0, Errors: 0, Skipped: 0, Time elapsed: 0.096 s - in org.ow2.frascati.tinfi.OneWayTestCase
[INFO] Running org.ow2.frascati.tinfi.PropertyCompositeTestCase
[INFO] Tests run: 10, Failures: 0, Errors: 0, Skipped: 0, Time elapsed: 0.068 s - in org.ow2.frascati.tinfi.PropertyCompositeTestCase
[INFO] Running org.ow2.frascati.tinfi.mix.MixTestCase
[INFO] Tests run: 1, Failures: 0, Errors: 0, Skipped: 0, Time elapsed: 0.183 s - in org.ow2.frascati.tinfi.mix.MixTestCase
[INFO] Running org.ow2.frascati.tinfi.ControllerTestCase
[INFO] Tests run: 2, Failures: 0, Errors: 0, Skipped: 0, Time elapsed: 0.007 s - in org.ow2.frascati.tinfi.ControllerTestCase
[INFO] Running org.ow2.frascati.tinfi.SCAContainerMembraneTestCase
[INFO] Tests run: 1, Failures: 0, Errors: 0, Skipped: 0, Time elapsed: 0.006 s - in org.ow2.frascati.tinfi.SCAContainerMembraneTestCase
[INFO] Running org.ow2.frascati.tinfi.PropertyTestCase
[INFO] Tests run: 7, Failures: 0, Errors: 0, Skipped: 0, Time elapsed: 0.013 s - in org.ow2.frascati.tinfi.PropertyTestCase
[INFO] Running org.ow2.frascati.tinfi.ScopeTestCase
[INFO] Tests run: 13, Failures: 0, Errors: 0, Skipped: 0, Time elapsed: 3.67 s - in org.ow2.frascati.tinfi.ScopeTestCase
[INFO] Running org.ow2.frascati.tinfi.vaudaux.callback.CallbackTestCase
[INFO] Tests run: 1, Failures: 0, Errors: 0, Skipped: 0, Time elapsed: 0.026 s - in org.ow2.frascati.tinfi.vaudaux.callback.CallbackTestCase
[INFO] Running org.ow2.frascati.tinfi.SCAContentControllerTestCase
[INFO] Tests run: 3, Failures: 0, Errors: 0, Skipped: 0, Time elapsed: 0.013 s - in org.ow2.frascati.tinfi.SCAContentControllerTestCase
[INFO] Running org.ow2.frascati.tinfi.ReferenceTestCase
[INFO] Tests run: 4, Failures: 0, Errors: 0, Skipped: 0, Time elapsed: 0.039 s - in org.ow2.frascati.tinfi.ReferenceTestCase
[INFO] Running org.ow2.frascati.tinfi.oabdoun.optionalreference.OptionalReferenceTestCase
[INFO] Tests run: 2, Failures: 0, Errors: 0, Skipped: 0, Time elapsed: 0.017 s - in org.ow2.frascati.tinfi.oabdoun.optionalreference.OptionalReferenceTestCase
[INFO] Running org.ow2.frascati.tinfi.ComponentNameTestCase
[INFO] Tests run: 1, Failures: 0, Errors: 0, Skipped: 0, Time elapsed: 0.006 s - in org.ow2.frascati.tinfi.ComponentNameTestCase
[INFO] Running org.ow2.frascati.tinfi.SCAIntentControllerTestCase
[INFO] Tests run: 11, Failures: 0, Errors: 0, Skipped: 0, Time elapsed: 0.051 s - in org.ow2.frascati.tinfi.SCAIntentControllerTestCase
[INFO] 
[INFO] Results:
[INFO] 
[INFO] Tests run: 57, Failures: 0, Errors: 0, Skipped: 0
[INFO] 
[INFO] 
[INFO] --- maven-jar-plugin:2.4:jar (default-jar) @ frascati-tinfi-tests-fraclet ---
[INFO] Building jar: /builds/workspace/juliac/extension/tinfi/module/opt-oo/tests-conf-fraclet/target/frascati-tinfi-tests-fraclet-2.8-SNAPSHOT.jar
[INFO] 
[INFO] --- maven-source-plugin:3.0.1:jar-no-fork (default) @ frascati-tinfi-tests-fraclet ---
[INFO] Building jar: /builds/workspace/juliac/extension/tinfi/module/opt-oo/tests-conf-fraclet/target/frascati-tinfi-tests-fraclet-2.8-SNAPSHOT-sources.jar
[INFO]                                                                         
[INFO] ------------------------------------------------------------------------
[INFO] Building Tinfi Opt Level OO Conf Tests OASIS SCA 1.1 2.8-SNAPSHOT
[INFO] ------------------------------------------------------------------------
[INFO] 
[INFO] --- maven-clean-plugin:2.5:clean (default-clean) @ frascati-tinfi-tests-oasis ---
[INFO] 
[INFO] --- maven-enforcer-plugin:1.0-beta-1:enforce (enforce-maven) @ frascati-tinfi-tests-oasis ---
[INFO] 
[INFO] --- maven-dependency-plugin:2.10:copy (copy-julia-tinfi-mixins) @ frascati-tinfi-tests-oasis ---
[INFO] Configured Artifact: org.objectweb.fractal.julia:julia-mixins:sources:2.5.2:jar
[INFO] Configured Artifact: org.ow2.fractal.juliac.tinfi:frascati-tinfi-mixins:sources:2.8-SNAPSHOT:jar
[INFO] Copying julia-mixins-2.5.2-sources.jar to /builds/workspace/juliac/extension/tinfi/module/opt-oo/tests-conf-oasis/target/dependency/julia-mixins-sources.jar
[INFO] Copying frascati-tinfi-mixins-2.8-SNAPSHOT-sources.jar to /builds/workspace/juliac/extension/tinfi/module/opt-oo/tests-conf-oasis/target/dependency/frascati-tinfi-mixins-sources.jar
[INFO] 
[INFO] --- maven-resources-plugin:2.7:resources (default-resources) @ frascati-tinfi-tests-oasis ---
[INFO] Using 'UTF-8' encoding to copy filtered resources.
[INFO] Copying 22 resources
[INFO] 
[INFO] --- maven-compiler-plugin:3.7.0:compile (default-compile) @ frascati-tinfi-tests-oasis ---
[INFO] Changes detected - recompiling the module!
[INFO] Compiling 51 source files to /builds/workspace/juliac/extension/tinfi/module/opt-oo/tests-conf-oasis/target/classes
[INFO] 
[INFO] --- exec-maven-plugin:1.6.0:java (juliac-compile) @ frascati-tinfi-tests-oasis ---
[INFO] Registering compile source root /builds/workspace/juliac/extension/tinfi/module/opt-oo/tests-conf-oasis/target/generated-sources/juliac
[INFO] 
[INFO] --- maven-compiler-plugin:3.7.0:compile (juliac-compile) @ frascati-tinfi-tests-oasis ---
[INFO] Changes detected - recompiling the module!
[INFO] Compiling 269 source files to /builds/workspace/juliac/extension/tinfi/module/opt-oo/tests-conf-oasis/target/classes
[INFO] /builds/workspace/juliac/extension/tinfi/module/opt-oo/tests-conf-oasis/target/generated-sources/juliac/juliac/org/ow2/frascati/tinfi/api/control/SCABasicIntentControllerInterceptorSCAIntent.java: Some input files use unchecked or unsafe operations.
[INFO] /builds/workspace/juliac/extension/tinfi/module/opt-oo/tests-conf-oasis/target/generated-sources/juliac/juliac/org/ow2/frascati/tinfi/api/control/SCABasicIntentControllerInterceptorSCAIntent.java: Recompile with -Xlint:unchecked for details.
[INFO] 
[INFO] --- maven-resources-plugin:2.7:testResources (default-testResources) @ frascati-tinfi-tests-oasis ---
[INFO] Using 'UTF-8' encoding to copy filtered resources.
[INFO] skip non existing resourceDirectory /builds/workspace/juliac/extension/tinfi/module/opt-oo/tests-conf-oasis/src/test/resources
[INFO] 
[INFO] --- maven-compiler-plugin:3.7.0:testCompile (default-testCompile) @ frascati-tinfi-tests-oasis ---
[INFO] Changes detected - recompiling the module!
[INFO] Compiling 18 source files to /builds/workspace/juliac/extension/tinfi/module/opt-oo/tests-conf-oasis/target/test-classes
[INFO] 
[INFO] --- maven-surefire-plugin:2.22.1:test (default-test) @ frascati-tinfi-tests-oasis ---
[INFO] Surefire report directory: /builds/workspace/juliac/extension/tinfi/module/opt-oo/tests-conf-oasis/target/surefire-reports
[INFO] 
[INFO] -------------------------------------------------------
[INFO]  T E S T S
[INFO] -------------------------------------------------------
[INFO] Running org.ow2.frascati.tinfi.OneWayTestCase
[INFO] Tests run: 1, Failures: 0, Errors: 0, Skipped: 0, Time elapsed: 0.126 s - in org.ow2.frascati.tinfi.OneWayTestCase
[INFO] Running org.ow2.frascati.tinfi.PropertyCompositeTestCase
[INFO] Tests run: 13, Failures: 0, Errors: 0, Skipped: 0, Time elapsed: 0.106 s - in org.ow2.frascati.tinfi.PropertyCompositeTestCase
[INFO] Running org.ow2.frascati.tinfi.mix.MixTestCase
[INFO] Tests run: 1, Failures: 0, Errors: 0, Skipped: 0, Time elapsed: 0.146 s - in org.ow2.frascati.tinfi.mix.MixTestCase
[INFO] Running org.ow2.frascati.tinfi.ControllerTestCase
[INFO] Tests run: 3, Failures: 0, Errors: 0, Skipped: 0, Time elapsed: 0.008 s - in org.ow2.frascati.tinfi.ControllerTestCase
[INFO] Running org.ow2.frascati.tinfi.ConstructorTestCase
[INFO] Tests run: 1, Failures: 0, Errors: 0, Skipped: 0, Time elapsed: 0.006 s - in org.ow2.frascati.tinfi.ConstructorTestCase
[INFO] Running org.ow2.frascati.tinfi.SCAContainerMembraneTestCase
[INFO] Tests run: 1, Failures: 0, Errors: 0, Skipped: 0, Time elapsed: 0.005 s - in org.ow2.frascati.tinfi.SCAContainerMembraneTestCase
[INFO] Running org.ow2.frascati.tinfi.PropertyTestCase
[INFO] Tests run: 9, Failures: 0, Errors: 0, Skipped: 0, Time elapsed: 0.018 s - in org.ow2.frascati.tinfi.PropertyTestCase
[INFO] Running org.ow2.frascati.tinfi.ScopeTestCase
[INFO] Tests run: 6, Failures: 0, Errors: 0, Skipped: 0, Time elapsed: 0.185 s - in org.ow2.frascati.tinfi.ScopeTestCase
[INFO] Running org.ow2.frascati.tinfi.ProvidesTestCase
[INFO] Tests run: 1, Failures: 0, Errors: 0, Skipped: 0, Time elapsed: 0.008 s - in org.ow2.frascati.tinfi.ProvidesTestCase
[INFO] Running org.ow2.frascati.tinfi.ComponentContextTestCase
[INFO] Tests run: 12, Failures: 0, Errors: 0, Skipped: 0, Time elapsed: 0.054 s - in org.ow2.frascati.tinfi.ComponentContextTestCase
[INFO] Running org.ow2.frascati.tinfi.SCAContentControllerTestCase
[INFO] Tests run: 8, Failures: 0, Errors: 0, Skipped: 0, Time elapsed: 0.147 s - in org.ow2.frascati.tinfi.SCAContentControllerTestCase
[INFO] Running org.ow2.frascati.tinfi.ReferenceTestCase
[INFO] Tests run: 5, Failures: 0, Errors: 0, Skipped: 0, Time elapsed: 0.028 s - in org.ow2.frascati.tinfi.ReferenceTestCase
[INFO] Running org.ow2.frascati.tinfi.oabdoun.constructor.ConstructorPropertyInjectionTestCase
[INFO] Tests run: 2, Failures: 0, Errors: 0, Skipped: 0, Time elapsed: 0.011 s - in org.ow2.frascati.tinfi.oabdoun.constructor.ConstructorPropertyInjectionTestCase
[INFO] Running org.ow2.frascati.tinfi.oabdoun.optionalreference.OptionalReferenceTestCase
[INFO] Tests run: 2, Failures: 0, Errors: 0, Skipped: 0, Time elapsed: 0.013 s - in org.ow2.frascati.tinfi.oabdoun.optionalreference.OptionalReferenceTestCase
[INFO] Running org.ow2.frascati.tinfi.ComponentNameTestCase
[INFO] Tests run: 1, Failures: 0, Errors: 0, Skipped: 0, Time elapsed: 0.008 s - in org.ow2.frascati.tinfi.ComponentNameTestCase
[INFO] Running org.ow2.frascati.tinfi.SCAIntentControllerTestCase
[INFO] Tests run: 16, Failures: 0, Errors: 0, Skipped: 0, Time elapsed: 0.075 s - in org.ow2.frascati.tinfi.SCAIntentControllerTestCase
[INFO] Running org.objectweb.fractal.julia.conform.components.BindingControllerTestCase
[INFO] Tests run: 10, Failures: 0, Errors: 0, Skipped: 0, Time elapsed: 0.101 s - in org.objectweb.fractal.julia.conform.components.BindingControllerTestCase
[INFO] 
[INFO] Results:
[INFO] 
[INFO] Tests run: 92, Failures: 0, Errors: 0, Skipped: 0
[INFO] 
[INFO] 
[INFO] --- maven-jar-plugin:2.4:jar (default-jar) @ frascati-tinfi-tests-oasis ---
[INFO] Building jar: /builds/workspace/juliac/extension/tinfi/module/opt-oo/tests-conf-oasis/target/frascati-tinfi-tests-oasis-2.8-SNAPSHOT.jar
[INFO] 
[INFO] --- maven-source-plugin:3.0.1:jar-no-fork (default) @ frascati-tinfi-tests-oasis ---
[INFO] Building jar: /builds/workspace/juliac/extension/tinfi/module/opt-oo/tests-conf-oasis/target/frascati-tinfi-tests-oasis-2.8-SNAPSHOT-sources.jar
[INFO]                                                                         
[INFO] ------------------------------------------------------------------------
[INFO] Building Tinfi Opt Level OO Conf Tests OSOA SCA 1.0 2.8-SNAPSHOT
[INFO] ------------------------------------------------------------------------
[INFO] 
[INFO] --- maven-clean-plugin:2.5:clean (default-clean) @ frascati-tinfi-tests-osoa ---
[INFO] 
[INFO] --- maven-enforcer-plugin:1.0-beta-1:enforce (enforce-maven) @ frascati-tinfi-tests-osoa ---
[INFO] 
[INFO] --- maven-dependency-plugin:2.10:copy (copy-julia-tinfi-mixins) @ frascati-tinfi-tests-osoa ---
[INFO] Configured Artifact: org.objectweb.fractal.julia:julia-mixins:sources:2.5.2:jar
[INFO] Configured Artifact: org.ow2.fractal.juliac.tinfi:frascati-tinfi-mixins:sources:2.8-SNAPSHOT:jar
[INFO] Copying julia-mixins-2.5.2-sources.jar to /builds/workspace/juliac/extension/tinfi/module/opt-oo/tests-conf-osoa/target/dependency/julia-mixins-sources.jar
[INFO] Copying frascati-tinfi-mixins-2.8-SNAPSHOT-sources.jar to /builds/workspace/juliac/extension/tinfi/module/opt-oo/tests-conf-osoa/target/dependency/frascati-tinfi-mixins-sources.jar
[INFO] 
[INFO] --- maven-resources-plugin:2.7:resources (default-resources) @ frascati-tinfi-tests-osoa ---
[INFO] Using 'UTF-8' encoding to copy filtered resources.
[INFO] Copying 18 resources
[INFO] 
[INFO] --- maven-compiler-plugin:3.7.0:compile (default-compile) @ frascati-tinfi-tests-osoa ---
[INFO] Changes detected - recompiling the module!
[INFO] Compiling 46 source files to /builds/workspace/juliac/extension/tinfi/module/opt-oo/tests-conf-osoa/target/classes
[INFO] 
[INFO] --- exec-maven-plugin:1.6.0:java (juliac-compile) @ frascati-tinfi-tests-osoa ---
[INFO] Registering compile source root /builds/workspace/juliac/extension/tinfi/module/opt-oo/tests-conf-osoa/target/generated-sources/juliac
[INFO] 
[INFO] --- maven-compiler-plugin:3.7.0:compile (juliac-compile) @ frascati-tinfi-tests-osoa ---
[INFO] Changes detected - recompiling the module!
[INFO] Compiling 238 source files to /builds/workspace/juliac/extension/tinfi/module/opt-oo/tests-conf-osoa/target/classes
[INFO] /builds/workspace/juliac/extension/tinfi/module/opt-oo/tests-conf-osoa/target/generated-sources/juliac/juliac/SCABindingControllerImpl.java: Some input files use unchecked or unsafe operations.
[INFO] /builds/workspace/juliac/extension/tinfi/module/opt-oo/tests-conf-osoa/target/generated-sources/juliac/juliac/SCABindingControllerImpl.java: Recompile with -Xlint:unchecked for details.
[INFO] 
[INFO] --- maven-resources-plugin:2.7:testResources (default-testResources) @ frascati-tinfi-tests-osoa ---
[INFO] Using 'UTF-8' encoding to copy filtered resources.
[INFO] skip non existing resourceDirectory /builds/workspace/juliac/extension/tinfi/module/opt-oo/tests-conf-osoa/src/test/resources
[INFO] 
[INFO] --- maven-compiler-plugin:3.7.0:testCompile (default-testCompile) @ frascati-tinfi-tests-osoa ---
[INFO] Changes detected - recompiling the module!
[INFO] Compiling 13 source files to /builds/workspace/juliac/extension/tinfi/module/opt-oo/tests-conf-osoa/target/test-classes
[INFO] 
[INFO] --- maven-surefire-plugin:2.22.1:test (default-test) @ frascati-tinfi-tests-osoa ---
[INFO] Surefire report directory: /builds/workspace/juliac/extension/tinfi/module/opt-oo/tests-conf-osoa/target/surefire-reports
[INFO] 
[INFO] -------------------------------------------------------
[INFO]  T E S T S
[INFO] -------------------------------------------------------
[INFO] Running org.ow2.frascati.tinfi.OneWayTestCase
[INFO] Tests run: 1, Failures: 0, Errors: 0, Skipped: 0, Time elapsed: 0.118 s - in org.ow2.frascati.tinfi.OneWayTestCase
[INFO] Running org.ow2.frascati.tinfi.PropertyCompositeTestCase
[INFO] Tests run: 11, Failures: 0, Errors: 0, Skipped: 0, Time elapsed: 0.078 s - in org.ow2.frascati.tinfi.PropertyCompositeTestCase
[INFO] Running org.ow2.frascati.tinfi.mix.MixTestCase
[INFO] Tests run: 1, Failures: 0, Errors: 0, Skipped: 0, Time elapsed: 0.122 s - in org.ow2.frascati.tinfi.mix.MixTestCase
[INFO] Running org.ow2.frascati.tinfi.ControllerTestCase
[INFO] Tests run: 2, Failures: 0, Errors: 0, Skipped: 0, Time elapsed: 0 s - in org.ow2.frascati.tinfi.ControllerTestCase
[INFO] Running org.ow2.frascati.tinfi.SCAContainerMembraneTestCase
[INFO] Tests run: 1, Failures: 0, Errors: 0, Skipped: 0, Time elapsed: 0 s - in org.ow2.frascati.tinfi.SCAContainerMembraneTestCase
[INFO] Running org.ow2.frascati.tinfi.PropertyTestCase
[INFO] Tests run: 8, Failures: 0, Errors: 0, Skipped: 0, Time elapsed: 0.027 s - in org.ow2.frascati.tinfi.PropertyTestCase
[INFO] Running org.ow2.frascati.tinfi.ScopeTestCase
[INFO] Tests run: 13, Failures: 0, Errors: 0, Skipped: 0, Time elapsed: 3.715 s - in org.ow2.frascati.tinfi.ScopeTestCase
[INFO] Running org.ow2.frascati.tinfi.vaudaux.callback.CallbackTestCase
[INFO] Tests run: 1, Failures: 0, Errors: 0, Skipped: 0, Time elapsed: 0.024 s - in org.ow2.frascati.tinfi.vaudaux.callback.CallbackTestCase
[INFO] Running org.ow2.frascati.tinfi.SCAContentControllerTestCase
[INFO] Tests run: 3, Failures: 0, Errors: 0, Skipped: 0, Time elapsed: 0.012 s - in org.ow2.frascati.tinfi.SCAContentControllerTestCase
[INFO] Running org.ow2.frascati.tinfi.ReferenceTestCase
[INFO] Tests run: 4, Failures: 0, Errors: 0, Skipped: 0, Time elapsed: 0.028 s - in org.ow2.frascati.tinfi.ReferenceTestCase
[INFO] Running org.ow2.frascati.tinfi.oabdoun.optionalreference.OptionalReferenceTestCase
[INFO] Tests run: 2, Failures: 0, Errors: 0, Skipped: 0, Time elapsed: 0.013 s - in org.ow2.frascati.tinfi.oabdoun.optionalreference.OptionalReferenceTestCase
[INFO] Running org.ow2.frascati.tinfi.ComponentNameTestCase
[INFO] Tests run: 1, Failures: 0, Errors: 0, Skipped: 0, Time elapsed: 0.011 s - in org.ow2.frascati.tinfi.ComponentNameTestCase
[INFO] Running org.ow2.frascati.tinfi.SCAIntentControllerTestCase
[INFO] Tests run: 11, Failures: 0, Errors: 0, Skipped: 0, Time elapsed: 0.055 s - in org.ow2.frascati.tinfi.SCAIntentControllerTestCase
[INFO] 
[INFO] Results:
[INFO] 
[INFO] Tests run: 59, Failures: 0, Errors: 0, Skipped: 0
[INFO] 
[INFO] 
[INFO] --- maven-jar-plugin:2.4:jar (default-jar) @ frascati-tinfi-tests-osoa ---
[INFO] Building jar: /builds/workspace/juliac/extension/tinfi/module/opt-oo/tests-conf-osoa/target/frascati-tinfi-tests-osoa-2.8-SNAPSHOT.jar
[INFO] 
[INFO] --- maven-source-plugin:3.0.1:jar-no-fork (default) @ frascati-tinfi-tests-osoa ---
[INFO] Building jar: /builds/workspace/juliac/extension/tinfi/module/opt-oo/tests-conf-osoa/target/frascati-tinfi-tests-osoa-2.8-SNAPSHOT-sources.jar
[INFO]                                                                         
[INFO] ------------------------------------------------------------------------
[INFO] Building Tinfi Opt Level OO Light 2.8-SNAPSHOT
[INFO] ------------------------------------------------------------------------
[INFO] 
[INFO] --- maven-clean-plugin:2.5:clean (default-clean) @ frascati-tinfi-oo-light-parent ---
[INFO] 
[INFO] --- maven-enforcer-plugin:1.0-beta-1:enforce (enforce-maven) @ frascati-tinfi-oo-light-parent ---
[INFO] 
[INFO] --- maven-source-plugin:3.0.1:jar-no-fork (default) @ frascati-tinfi-oo-light-parent ---
[INFO]                                                                         
[INFO] ------------------------------------------------------------------------
[INFO] Building Tinfi Opt Level OO Light Core 2.8-SNAPSHOT
[INFO] ------------------------------------------------------------------------
[INFO] 
[INFO] --- maven-clean-plugin:2.5:clean (default-clean) @ frascati-tinfi-oo-light ---
[INFO] 
[INFO] --- maven-enforcer-plugin:1.0-beta-1:enforce (enforce-maven) @ frascati-tinfi-oo-light ---
[INFO] 
[INFO] --- maven-resources-plugin:2.7:resources (default-resources) @ frascati-tinfi-oo-light ---
[INFO] Using 'UTF-8' encoding to copy filtered resources.
[INFO] skip non existing resourceDirectory /builds/workspace/juliac/extension/tinfi/module/opt-oo-light/core/src/main/resources
[INFO] 
[INFO] --- maven-compiler-plugin:3.7.0:compile (default-compile) @ frascati-tinfi-oo-light ---
[INFO] Changes detected - recompiling the module!
[INFO] Compiling 9 source files to /builds/workspace/juliac/extension/tinfi/module/opt-oo-light/core/target/classes
[INFO] /builds/workspace/juliac/extension/tinfi/module/opt-oo-light/core/src/main/java/org/ow2/frascati/tinfi/opt/oo/light/InitializerOOCtrlClassGenerator.java: /builds/workspace/juliac/extension/tinfi/module/opt-oo-light/core/src/main/java/org/ow2/frascati/tinfi/opt/oo/light/InitializerOOCtrlClassGenerator.java uses or overrides a deprecated API.
[INFO] /builds/workspace/juliac/extension/tinfi/module/opt-oo-light/core/src/main/java/org/ow2/frascati/tinfi/opt/oo/light/InitializerOOCtrlClassGenerator.java: Recompile with -Xlint:deprecation for details.
[INFO] /builds/workspace/juliac/extension/tinfi/module/opt-oo-light/core/src/main/java/org/ow2/frascati/tinfi/opt/oo/light/InitializerOOCtrlClassGenerator.java: /builds/workspace/juliac/extension/tinfi/module/opt-oo-light/core/src/main/java/org/ow2/frascati/tinfi/opt/oo/light/InitializerOOCtrlClassGenerator.java uses unchecked or unsafe operations.
[INFO] /builds/workspace/juliac/extension/tinfi/module/opt-oo-light/core/src/main/java/org/ow2/frascati/tinfi/opt/oo/light/InitializerOOCtrlClassGenerator.java: Recompile with -Xlint:unchecked for details.
[INFO] 
[INFO] --- maven-resources-plugin:2.7:testResources (default-testResources) @ frascati-tinfi-oo-light ---
[INFO] Using 'UTF-8' encoding to copy filtered resources.
[INFO] skip non existing resourceDirectory /builds/workspace/juliac/extension/tinfi/module/opt-oo-light/core/src/test/resources
[INFO] 
[INFO] --- maven-compiler-plugin:3.7.0:testCompile (default-testCompile) @ frascati-tinfi-oo-light ---
[INFO] No sources to compile
[INFO] 
[INFO] --- maven-surefire-plugin:2.22.1:test (default-test) @ frascati-tinfi-oo-light ---
[INFO] No tests to run.
[INFO] 
[INFO] --- maven-jar-plugin:2.4:jar (default-jar) @ frascati-tinfi-oo-light ---
[INFO] Building jar: /builds/workspace/juliac/extension/tinfi/module/opt-oo-light/core/target/frascati-tinfi-oo-light-2.8-SNAPSHOT.jar
[INFO] 
[INFO] --- maven-source-plugin:3.0.1:jar-no-fork (default) @ frascati-tinfi-oo-light ---
[INFO] Building jar: /builds/workspace/juliac/extension/tinfi/module/opt-oo-light/core/target/frascati-tinfi-oo-light-2.8-SNAPSHOT-sources.jar
[INFO]                                                                         
[INFO] ------------------------------------------------------------------------
[INFO] Building Tinfi Opt Level OO Light Service 2.8-SNAPSHOT
[INFO] ------------------------------------------------------------------------
[INFO] 
[INFO] --- maven-clean-plugin:2.5:clean (default-clean) @ frascati-tinfi-oo-light-service ---
[INFO] 
[INFO] --- maven-enforcer-plugin:1.0-beta-1:enforce (enforce-maven) @ frascati-tinfi-oo-light-service ---
[INFO] 
[INFO] --- maven-resources-plugin:2.7:resources (default-resources) @ frascati-tinfi-oo-light-service ---
[INFO] Using 'UTF-8' encoding to copy filtered resources.
[INFO] Copying 1 resource
[INFO] 
[INFO] --- maven-compiler-plugin:3.7.0:compile (default-compile) @ frascati-tinfi-oo-light-service ---
[INFO] No sources to compile
[INFO] 
[INFO] --- maven-resources-plugin:2.7:testResources (default-testResources) @ frascati-tinfi-oo-light-service ---
[INFO] Using 'UTF-8' encoding to copy filtered resources.
[INFO] skip non existing resourceDirectory /builds/workspace/juliac/extension/tinfi/module/opt-oo-light/service/src/test/resources
[INFO] 
[INFO] --- maven-compiler-plugin:3.7.0:testCompile (default-testCompile) @ frascati-tinfi-oo-light-service ---
[INFO] No sources to compile
[INFO] 
[INFO] --- maven-surefire-plugin:2.22.1:test (default-test) @ frascati-tinfi-oo-light-service ---
[INFO] No tests to run.
[INFO] 
[INFO] --- maven-jar-plugin:2.4:jar (default-jar) @ frascati-tinfi-oo-light-service ---
[INFO] Building jar: /builds/workspace/juliac/extension/tinfi/module/opt-oo-light/service/target/frascati-tinfi-oo-light-service-2.8-SNAPSHOT.jar
[INFO] 
[INFO] --- maven-source-plugin:3.0.1:jar-no-fork (default) @ frascati-tinfi-oo-light-service ---
[INFO] Building jar: /builds/workspace/juliac/extension/tinfi/module/opt-oo-light/service/target/frascati-tinfi-oo-light-service-2.8-SNAPSHOT-sources.jar
[INFO]                                                                         
[INFO] ------------------------------------------------------------------------
[INFO] Building Tinfi Opt Level OO Light Conf Tests 2.8-SNAPSHOT
[INFO] ------------------------------------------------------------------------
[INFO] 
[INFO] --- maven-clean-plugin:2.5:clean (default-clean) @ frascati-tinfi-tests-oo-light ---
[INFO] 
[INFO] --- maven-enforcer-plugin:1.0-beta-1:enforce (enforce-maven) @ frascati-tinfi-tests-oo-light ---
[INFO] 
[INFO] --- maven-dependency-plugin:2.10:copy (copy-julia-tinfi-mixins) @ frascati-tinfi-tests-oo-light ---
[INFO] Configured Artifact: org.objectweb.fractal.julia:julia-mixins:sources:2.5.2:jar
[INFO] Configured Artifact: org.ow2.fractal.juliac.tinfi:frascati-tinfi-mixins:sources:2.8-SNAPSHOT:jar
[INFO] Copying julia-mixins-2.5.2-sources.jar to /builds/workspace/juliac/extension/tinfi/module/opt-oo-light/tests-conf-light/target/dependency/julia-mixins-sources.jar
[INFO] Copying frascati-tinfi-mixins-2.8-SNAPSHOT-sources.jar to /builds/workspace/juliac/extension/tinfi/module/opt-oo-light/tests-conf-light/target/dependency/frascati-tinfi-mixins-sources.jar
[INFO] 
[INFO] --- maven-resources-plugin:2.7:resources (default-resources) @ frascati-tinfi-tests-oo-light ---
[INFO] Using 'UTF-8' encoding to copy filtered resources.
[INFO] Copying 15 resources
[INFO] 
[INFO] --- maven-compiler-plugin:3.7.0:compile (default-compile) @ frascati-tinfi-tests-oo-light ---
[INFO] Changes detected - recompiling the module!
[INFO] Compiling 39 source files to /builds/workspace/juliac/extension/tinfi/module/opt-oo-light/tests-conf-light/target/classes
[INFO] 
[INFO] --- exec-maven-plugin:1.6.0:java (juliac-compile) @ frascati-tinfi-tests-oo-light ---
[INFO] Registering compile source root /builds/workspace/juliac/extension/tinfi/module/opt-oo-light/tests-conf-light/target/generated-sources/juliac
[INFO] 
[INFO] --- maven-compiler-plugin:3.7.0:compile (juliac-compile) @ frascati-tinfi-tests-oo-light ---
[INFO] Changes detected - recompiling the module!
[INFO] Compiling 237 source files to /builds/workspace/juliac/extension/tinfi/module/opt-oo-light/tests-conf-light/target/classes
[INFO] /builds/workspace/juliac/extension/tinfi/module/opt-oo-light/tests-conf-light/target/generated-sources/juliac/juliac/SCALifeCycleControllerImpl.java: Some input files use unchecked or unsafe operations.
[INFO] /builds/workspace/juliac/extension/tinfi/module/opt-oo-light/tests-conf-light/target/generated-sources/juliac/juliac/SCALifeCycleControllerImpl.java: Recompile with -Xlint:unchecked for details.
[INFO] 
[INFO] --- maven-resources-plugin:2.7:testResources (default-testResources) @ frascati-tinfi-tests-oo-light ---
[INFO] Using 'UTF-8' encoding to copy filtered resources.
[INFO] skip non existing resourceDirectory /builds/workspace/juliac/extension/tinfi/module/opt-oo-light/tests-conf-light/src/test/resources
[INFO] 
[INFO] --- maven-compiler-plugin:3.7.0:testCompile (default-testCompile) @ frascati-tinfi-tests-oo-light ---
[INFO] Changes detected - recompiling the module!
[INFO] Compiling 14 source files to /builds/workspace/juliac/extension/tinfi/module/opt-oo-light/tests-conf-light/target/test-classes
[INFO] 
[INFO] --- maven-surefire-plugin:2.22.1:test (default-test) @ frascati-tinfi-tests-oo-light ---
[INFO] Surefire report directory: /builds/workspace/juliac/extension/tinfi/module/opt-oo-light/tests-conf-light/target/surefire-reports
[INFO] 
[INFO] -------------------------------------------------------
[INFO]  T E S T S
[INFO] -------------------------------------------------------
[INFO] Running org.ow2.frascati.tinfi.OneWayTestCase
[INFO] Tests run: 1, Failures: 0, Errors: 0, Skipped: 0, Time elapsed: 0.065 s - in org.ow2.frascati.tinfi.OneWayTestCase
[INFO] Running org.ow2.frascati.tinfi.PropertyCompositeTestCase
[INFO] Tests run: 12, Failures: 0, Errors: 0, Skipped: 0, Time elapsed: 0.081 s - in org.ow2.frascati.tinfi.PropertyCompositeTestCase
[INFO] Running org.ow2.frascati.tinfi.mix.MixTestCase
[INFO] Tests run: 1, Failures: 0, Errors: 0, Skipped: 0, Time elapsed: 0.146 s - in org.ow2.frascati.tinfi.mix.MixTestCase
[INFO] Running org.ow2.frascati.tinfi.ControllerTestCase
[INFO] Tests run: 3, Failures: 0, Errors: 0, Skipped: 0, Time elapsed: 0.005 s - in org.ow2.frascati.tinfi.ControllerTestCase
[INFO] Running org.ow2.frascati.tinfi.ConstructorTestCase
[INFO] Tests run: 1, Failures: 0, Errors: 0, Skipped: 0, Time elapsed: 0.004 s - in org.ow2.frascati.tinfi.ConstructorTestCase
[INFO] Running org.ow2.frascati.tinfi.PropertyTestCase
[INFO] Tests run: 9, Failures: 0, Errors: 0, Skipped: 0, Time elapsed: 0.013 s - in org.ow2.frascati.tinfi.PropertyTestCase
[INFO] Running org.ow2.frascati.tinfi.ScopeTestCase
[INFO] Tests run: 6, Failures: 0, Errors: 0, Skipped: 0, Time elapsed: 0.118 s - in org.ow2.frascati.tinfi.ScopeTestCase
[INFO] Running org.ow2.frascati.tinfi.ProvidesTestCase
[INFO] Tests run: 1, Failures: 0, Errors: 0, Skipped: 0, Time elapsed: 0.006 s - in org.ow2.frascati.tinfi.ProvidesTestCase
[INFO] Running org.ow2.frascati.tinfi.ComponentContextTestCase
[INFO] Tests run: 12, Failures: 0, Errors: 0, Skipped: 0, Time elapsed: 0.069 s - in org.ow2.frascati.tinfi.ComponentContextTestCase
[INFO] Running org.ow2.frascati.tinfi.SCAContentControllerTestCase
[INFO] Tests run: 5, Failures: 0, Errors: 0, Skipped: 0, Time elapsed: 0 s - in org.ow2.frascati.tinfi.SCAContentControllerTestCase
[INFO] Running org.ow2.frascati.tinfi.ReferenceTestCase
[INFO] Tests run: 4, Failures: 0, Errors: 0, Skipped: 0, Time elapsed: 0.005 s - in org.ow2.frascati.tinfi.ReferenceTestCase
[INFO] Running org.ow2.frascati.tinfi.oabdoun.constructor.ConstructorPropertyInjectionTestCase
[INFO] Tests run: 2, Failures: 0, Errors: 0, Skipped: 0, Time elapsed: 0.012 s - in org.ow2.frascati.tinfi.oabdoun.constructor.ConstructorPropertyInjectionTestCase
[INFO] Running org.ow2.frascati.tinfi.oabdoun.optionalreference.OptionalReferenceTestCase
[INFO] Tests run: 2, Failures: 0, Errors: 0, Skipped: 0, Time elapsed: 0.014 s - in org.ow2.frascati.tinfi.oabdoun.optionalreference.OptionalReferenceTestCase
[INFO] Running org.ow2.frascati.tinfi.ComponentNameTestCase
[INFO] Tests run: 1, Failures: 0, Errors: 0, Skipped: 0, Time elapsed: 0.005 s - in org.ow2.frascati.tinfi.ComponentNameTestCase
[INFO] 
[INFO] Results:
[INFO] 
[INFO] Tests run: 60, Failures: 0, Errors: 0, Skipped: 0
[INFO] 
[INFO] 
[INFO] --- maven-jar-plugin:2.4:jar (default-jar) @ frascati-tinfi-tests-oo-light ---
[INFO] Building jar: /builds/workspace/juliac/extension/tinfi/module/opt-oo-light/tests-conf-light/target/frascati-tinfi-tests-oo-light-2.8-SNAPSHOT.jar
[INFO] 
[INFO] --- maven-source-plugin:3.0.1:jar-no-fork (default) @ frascati-tinfi-tests-oo-light ---
[INFO] Building jar: /builds/workspace/juliac/extension/tinfi/module/opt-oo-light/tests-conf-light/target/frascati-tinfi-tests-oo-light-2.8-SNAPSHOT-sources.jar
[INFO]                                                                         
[INFO] ------------------------------------------------------------------------
[INFO] Building Tinfi Opt Level OO OSGi 2.8-SNAPSHOT
[INFO] ------------------------------------------------------------------------
[INFO] 
[INFO] --- maven-clean-plugin:2.5:clean (default-clean) @ frascati-tinfi-oo-osgi-parent ---
[INFO] 
[INFO] --- maven-enforcer-plugin:1.0-beta-1:enforce (enforce-maven) @ frascati-tinfi-oo-osgi-parent ---
[INFO] 
[INFO] --- maven-source-plugin:3.0.1:jar-no-fork (default) @ frascati-tinfi-oo-osgi-parent ---
[INFO]                                                                         
[INFO] ------------------------------------------------------------------------
[INFO] Building Tinfi Opt Level OO OSGi Core 2.8-SNAPSHOT
[INFO] ------------------------------------------------------------------------
[INFO] 
[INFO] --- maven-clean-plugin:2.5:clean (default-clean) @ frascati-tinfi-oo-osgi ---
[INFO] 
[INFO] --- maven-enforcer-plugin:1.0-beta-1:enforce (enforce-maven) @ frascati-tinfi-oo-osgi ---
[INFO] 
[INFO] --- maven-resources-plugin:2.7:resources (default-resources) @ frascati-tinfi-oo-osgi ---
[INFO] Using 'UTF-8' encoding to copy filtered resources.
[INFO] skip non existing resourceDirectory /builds/workspace/juliac/extension/tinfi/module/opt-oo-osgi/core/src/main/resources
[INFO] 
[INFO] --- maven-compiler-plugin:3.7.0:compile (default-compile) @ frascati-tinfi-oo-osgi ---
[INFO] Changes detected - recompiling the module!
[INFO] Compiling 2 source files to /builds/workspace/juliac/extension/tinfi/module/opt-oo-osgi/core/target/classes
[INFO] 
[INFO] --- maven-resources-plugin:2.7:testResources (default-testResources) @ frascati-tinfi-oo-osgi ---
[INFO] Using 'UTF-8' encoding to copy filtered resources.
[INFO] skip non existing resourceDirectory /builds/workspace/juliac/extension/tinfi/module/opt-oo-osgi/core/src/test/resources
[INFO] 
[INFO] --- maven-compiler-plugin:3.7.0:testCompile (default-testCompile) @ frascati-tinfi-oo-osgi ---
[INFO] No sources to compile
[INFO] 
[INFO] --- maven-surefire-plugin:2.22.1:test (default-test) @ frascati-tinfi-oo-osgi ---
[INFO] No tests to run.
[INFO] 
[INFO] --- maven-jar-plugin:2.4:jar (default-jar) @ frascati-tinfi-oo-osgi ---
[INFO] Building jar: /builds/workspace/juliac/extension/tinfi/module/opt-oo-osgi/core/target/frascati-tinfi-oo-osgi-2.8-SNAPSHOT.jar
[INFO] 
[INFO] --- maven-source-plugin:3.0.1:jar-no-fork (default) @ frascati-tinfi-oo-osgi ---
[INFO] Building jar: /builds/workspace/juliac/extension/tinfi/module/opt-oo-osgi/core/target/frascati-tinfi-oo-osgi-2.8-SNAPSHOT-sources.jar
[INFO]                                                                         
[INFO] ------------------------------------------------------------------------
[INFO] Building Tinfi Opt Level OO OSGi Service 2.8-SNAPSHOT
[INFO] ------------------------------------------------------------------------
[INFO] 
[INFO] --- maven-clean-plugin:2.5:clean (default-clean) @ frascati-tinfi-oo-osgi-service ---
[INFO] 
[INFO] --- maven-enforcer-plugin:1.0-beta-1:enforce (enforce-maven) @ frascati-tinfi-oo-osgi-service ---
[INFO] 
[INFO] --- maven-resources-plugin:2.7:resources (default-resources) @ frascati-tinfi-oo-osgi-service ---
[INFO] Using 'UTF-8' encoding to copy filtered resources.
[INFO] Copying 1 resource
[INFO] 
[INFO] --- maven-compiler-plugin:3.7.0:compile (default-compile) @ frascati-tinfi-oo-osgi-service ---
[INFO] No sources to compile
[INFO] 
[INFO] --- maven-resources-plugin:2.7:testResources (default-testResources) @ frascati-tinfi-oo-osgi-service ---
[INFO] Using 'UTF-8' encoding to copy filtered resources.
[INFO] skip non existing resourceDirectory /builds/workspace/juliac/extension/tinfi/module/opt-oo-osgi/service/src/test/resources
[INFO] 
[INFO] --- maven-compiler-plugin:3.7.0:testCompile (default-testCompile) @ frascati-tinfi-oo-osgi-service ---
[INFO] No sources to compile
[INFO] 
[INFO] --- maven-surefire-plugin:2.22.1:test (default-test) @ frascati-tinfi-oo-osgi-service ---
[INFO] No tests to run.
[INFO] 
[INFO] --- maven-jar-plugin:2.4:jar (default-jar) @ frascati-tinfi-oo-osgi-service ---
[INFO] Building jar: /builds/workspace/juliac/extension/tinfi/module/opt-oo-osgi/service/target/frascati-tinfi-oo-osgi-service-2.8-SNAPSHOT.jar
[INFO] 
[INFO] --- maven-source-plugin:3.0.1:jar-no-fork (default) @ frascati-tinfi-oo-osgi-service ---
[INFO] Building jar: /builds/workspace/juliac/extension/tinfi/module/opt-oo-osgi/service/target/frascati-tinfi-oo-osgi-service-2.8-SNAPSHOT-sources.jar
[INFO]                                                                         
[INFO] ------------------------------------------------------------------------
[INFO] Building Tinfi Opt Level OO OSGi Pre-mixed 2.8-SNAPSHOT
[INFO] ------------------------------------------------------------------------
[INFO] 
[INFO] --- maven-clean-plugin:2.5:clean (default-clean) @ frascati-tinfi-oo-osgi-membranes ---
[INFO] 
[INFO] --- maven-enforcer-plugin:1.0-beta-1:enforce (enforce-maven) @ frascati-tinfi-oo-osgi-membranes ---
[INFO] 
[INFO] --- maven-dependency-plugin:2.10:copy (copy-julia-tinfi-mixins) @ frascati-tinfi-oo-osgi-membranes ---
[INFO] Configured Artifact: org.objectweb.fractal.julia:julia-mixins:sources:2.5.2:jar
[INFO] Configured Artifact: org.ow2.fractal.juliac.osgi:juliac-osgi-mixins:sources:2.8-SNAPSHOT:jar
[INFO] Configured Artifact: org.ow2.fractal.juliac.tinfi:frascati-tinfi-mixins:sources:2.8-SNAPSHOT:jar
[INFO] Copying julia-mixins-2.5.2-sources.jar to /builds/workspace/juliac/extension/tinfi/module/opt-oo-osgi/mixed/target/dependency/julia-mixins-sources.jar
[INFO] Copying juliac-osgi-mixins-2.8-SNAPSHOT-sources.jar to /builds/workspace/juliac/extension/tinfi/module/opt-oo-osgi/mixed/target/dependency/juliac-osgi-mixins-sources.jar
[INFO] Copying frascati-tinfi-mixins-2.8-SNAPSHOT-sources.jar to /builds/workspace/juliac/extension/tinfi/module/opt-oo-osgi/mixed/target/dependency/frascati-tinfi-mixins-sources.jar
[INFO] 
[INFO] --- exec-maven-plugin:1.6.0:java (juliac-compile) @ frascati-tinfi-oo-osgi-membranes ---
[INFO] 
[INFO] --- maven-resources-plugin:2.7:resources (default-resources) @ frascati-tinfi-oo-osgi-membranes ---
[INFO] Using 'UTF-8' encoding to copy filtered resources.
[INFO] skip non existing resourceDirectory /builds/workspace/juliac/extension/tinfi/module/opt-oo-osgi/mixed/src/main/resources
[INFO] 
[INFO] --- maven-compiler-plugin:3.7.0:compile (default-compile) @ frascati-tinfi-oo-osgi-membranes ---
[INFO] Changes detected - recompiling the module!
[INFO] Compiling 25 source files to /builds/workspace/juliac/extension/tinfi/module/opt-oo-osgi/mixed/target/classes
[INFO] /builds/workspace/juliac/extension/tinfi/module/opt-oo-osgi/mixed/target/generated-sources/juliac/juliac/SCABindingControllerImpl.java: Some input files use unchecked or unsafe operations.
[INFO] /builds/workspace/juliac/extension/tinfi/module/opt-oo-osgi/mixed/target/generated-sources/juliac/juliac/SCABindingControllerImpl.java: Recompile with -Xlint:unchecked for details.
[INFO] 
[INFO] --- maven-resources-plugin:2.7:testResources (default-testResources) @ frascati-tinfi-oo-osgi-membranes ---
[INFO] Using 'UTF-8' encoding to copy filtered resources.
[INFO] skip non existing resourceDirectory /builds/workspace/juliac/extension/tinfi/module/opt-oo-osgi/mixed/src/test/resources
[INFO] 
[INFO] --- maven-compiler-plugin:3.7.0:testCompile (default-testCompile) @ frascati-tinfi-oo-osgi-membranes ---
[INFO] No sources to compile
[INFO] 
[INFO] --- maven-surefire-plugin:2.22.1:test (default-test) @ frascati-tinfi-oo-osgi-membranes ---
[INFO] No tests to run.
[INFO] 
[INFO] --- maven-jar-plugin:2.4:jar (default-jar) @ frascati-tinfi-oo-osgi-membranes ---
[INFO] Building jar: /builds/workspace/juliac/extension/tinfi/module/opt-oo-osgi/mixed/target/frascati-tinfi-oo-osgi-membranes-2.8-SNAPSHOT.jar
[INFO] 
[INFO] --- maven-source-plugin:3.0.1:jar-no-fork (default) @ frascati-tinfi-oo-osgi-membranes ---
[INFO] Building jar: /builds/workspace/juliac/extension/tinfi/module/opt-oo-osgi/mixed/target/frascati-tinfi-oo-osgi-membranes-2.8-SNAPSHOT-sources.jar
[INFO]                                                                         
[INFO] ------------------------------------------------------------------------
[INFO] Building Tinfi Opt Level ULTRA_MERGE Parent 2.8-SNAPSHOT
[INFO] ------------------------------------------------------------------------
[INFO] 
[INFO] --- maven-clean-plugin:2.5:clean (default-clean) @ frascati-tinfi-ultra-merge-parent ---
[INFO] 
[INFO] --- maven-enforcer-plugin:1.0-beta-1:enforce (enforce-maven) @ frascati-tinfi-ultra-merge-parent ---
[INFO] 
[INFO] --- maven-source-plugin:3.0.1:jar-no-fork (default) @ frascati-tinfi-ultra-merge-parent ---
[INFO]                                                                         
[INFO] ------------------------------------------------------------------------
[INFO] Building Tinfi Opt Level ULTRA_MERGE Core 2.8-SNAPSHOT
[INFO] ------------------------------------------------------------------------
[INFO] 
[INFO] --- maven-clean-plugin:2.5:clean (default-clean) @ frascati-tinfi-ultra-merge-core ---
[INFO] 
[INFO] --- maven-enforcer-plugin:1.0-beta-1:enforce (enforce-maven) @ frascati-tinfi-ultra-merge-core ---
[INFO] 
[INFO] --- maven-resources-plugin:2.7:resources (default-resources) @ frascati-tinfi-ultra-merge-core ---
[INFO] Using 'UTF-8' encoding to copy filtered resources.
[INFO] skip non existing resourceDirectory /builds/workspace/juliac/extension/tinfi/module/opt-ultramerge/core/src/main/resources
[INFO] 
[INFO] --- maven-compiler-plugin:3.7.0:compile (default-compile) @ frascati-tinfi-ultra-merge-core ---
[INFO] Changes detected - recompiling the module!
[INFO] Compiling 2 source files to /builds/workspace/juliac/extension/tinfi/module/opt-ultramerge/core/target/classes
[INFO] /builds/workspace/juliac/extension/tinfi/module/opt-ultramerge/core/src/main/java/org/ow2/frascati/tinfi/opt/ultramerge/SCAUltraMerge.java: /builds/workspace/juliac/extension/tinfi/module/opt-ultramerge/core/src/main/java/org/ow2/frascati/tinfi/opt/ultramerge/SCAUltraMerge.java uses unchecked or unsafe operations.
[INFO] /builds/workspace/juliac/extension/tinfi/module/opt-ultramerge/core/src/main/java/org/ow2/frascati/tinfi/opt/ultramerge/SCAUltraMerge.java: Recompile with -Xlint:unchecked for details.
[INFO] 
[INFO] --- maven-resources-plugin:2.7:testResources (default-testResources) @ frascati-tinfi-ultra-merge-core ---
[INFO] Using 'UTF-8' encoding to copy filtered resources.
[INFO] skip non existing resourceDirectory /builds/workspace/juliac/extension/tinfi/module/opt-ultramerge/core/src/test/resources
[INFO] 
[INFO] --- maven-compiler-plugin:3.7.0:testCompile (default-testCompile) @ frascati-tinfi-ultra-merge-core ---
[INFO] No sources to compile
[INFO] 
[INFO] --- maven-surefire-plugin:2.22.1:test (default-test) @ frascati-tinfi-ultra-merge-core ---
[INFO] No tests to run.
[INFO] 
[INFO] --- maven-jar-plugin:2.4:jar (default-jar) @ frascati-tinfi-ultra-merge-core ---
[INFO] Building jar: /builds/workspace/juliac/extension/tinfi/module/opt-ultramerge/core/target/frascati-tinfi-ultra-merge-core-2.8-SNAPSHOT.jar
[INFO] 
[INFO] --- maven-source-plugin:3.0.1:jar-no-fork (default) @ frascati-tinfi-ultra-merge-core ---
[INFO] Building jar: /builds/workspace/juliac/extension/tinfi/module/opt-ultramerge/core/target/frascati-tinfi-ultra-merge-core-2.8-SNAPSHOT-sources.jar
[INFO]                                                                         
[INFO] ------------------------------------------------------------------------
[INFO] Building Tinfi Opt Level ULTRA_MERGE Service 2.8-SNAPSHOT
[INFO] ------------------------------------------------------------------------
[INFO] 
[INFO] --- maven-clean-plugin:2.5:clean (default-clean) @ frascati-tinfi-ultra-merge-service ---
[INFO] 
[INFO] --- maven-enforcer-plugin:1.0-beta-1:enforce (enforce-maven) @ frascati-tinfi-ultra-merge-service ---
[INFO] 
[INFO] --- maven-resources-plugin:2.7:resources (default-resources) @ frascati-tinfi-ultra-merge-service ---
[INFO] Using 'UTF-8' encoding to copy filtered resources.
[INFO] Copying 1 resource
[INFO] 
[INFO] --- maven-compiler-plugin:3.7.0:compile (default-compile) @ frascati-tinfi-ultra-merge-service ---
[INFO] No sources to compile
[INFO] 
[INFO] --- maven-resources-plugin:2.7:testResources (default-testResources) @ frascati-tinfi-ultra-merge-service ---
[INFO] Using 'UTF-8' encoding to copy filtered resources.
[INFO] skip non existing resourceDirectory /builds/workspace/juliac/extension/tinfi/module/opt-ultramerge/service/src/test/resources
[INFO] 
[INFO] --- maven-compiler-plugin:3.7.0:testCompile (default-testCompile) @ frascati-tinfi-ultra-merge-service ---
[INFO] No sources to compile
[INFO] 
[INFO] --- maven-surefire-plugin:2.22.1:test (default-test) @ frascati-tinfi-ultra-merge-service ---
[INFO] No tests to run.
[INFO] 
[INFO] --- maven-jar-plugin:2.4:jar (default-jar) @ frascati-tinfi-ultra-merge-service ---
[INFO] Building jar: /builds/workspace/juliac/extension/tinfi/module/opt-ultramerge/service/target/frascati-tinfi-ultra-merge-service-2.8-SNAPSHOT.jar
[INFO] 
[INFO] --- maven-source-plugin:3.0.1:jar-no-fork (default) @ frascati-tinfi-ultra-merge-service ---
[INFO] Building jar: /builds/workspace/juliac/extension/tinfi/module/opt-ultramerge/service/target/frascati-tinfi-ultra-merge-service-2.8-SNAPSHOT-sources.jar
[INFO]                                                                         
[INFO] ------------------------------------------------------------------------
[INFO] Building Tinfi Examples 2.8-SNAPSHOT
[INFO] ------------------------------------------------------------------------
[INFO] 
[INFO] --- maven-clean-plugin:2.5:clean (default-clean) @ frascati-tinfi-parent ---
[INFO] 
[INFO] --- maven-enforcer-plugin:1.0-beta-1:enforce (enforce-maven) @ frascati-tinfi-parent ---
[INFO] 
[INFO] --- maven-source-plugin:3.0.1:jar-no-fork (default) @ frascati-tinfi-parent ---
[INFO]                                                                         
[INFO] ------------------------------------------------------------------------
[INFO] Building Tinfi Example HelloWorld 2.8-SNAPSHOT
[INFO] ------------------------------------------------------------------------
[INFO] 
[INFO] --- maven-clean-plugin:2.5:clean (default-clean) @ frascati-tinfi-helloworld ---
[INFO] 
[INFO] --- maven-enforcer-plugin:1.0-beta-1:enforce (enforce-maven) @ frascati-tinfi-helloworld ---
[INFO] 
[INFO] --- maven-resources-plugin:2.7:resources (default-resources) @ frascati-tinfi-helloworld ---
[INFO] Using 'UTF-8' encoding to copy filtered resources.
[INFO] Copying 1 resource
[INFO] 
[INFO] --- maven-compiler-plugin:3.7.0:compile (default-compile) @ frascati-tinfi-helloworld ---
[INFO] Changes detected - recompiling the module!
[INFO] Compiling 4 source files to /builds/workspace/juliac/extension/tinfi/examples/helloworld/target/classes
[INFO] 
[INFO] --- exec-maven-plugin:1.6.0:java (juliac-compile) @ frascati-tinfi-helloworld ---
java.lang.InterruptedException
	at java.base/java.lang.Object.wait(Native Method)
	at java.base/java.lang.ref.ReferenceQueue.remove(ReferenceQueue.java:151)
	at java.base/java.lang.ref.ReferenceQueue.remove(ReferenceQueue.java:172)
	at org.eclipse.emf.common.util.CommonUtil$1ReferenceClearingQueuePollingThread.run(CommonUtil.java:70)
[INFO] Registering compile source root /builds/workspace/juliac/extension/tinfi/examples/helloworld/target/generated-sources/juliac
[INFO] 
[INFO] --- maven-compiler-plugin:3.7.0:compile (juliac-compile) @ frascati-tinfi-helloworld ---
[INFO] Changes detected - recompiling the module!
[INFO] Compiling 18 source files to /builds/workspace/juliac/extension/tinfi/examples/helloworld/target/classes
[INFO] /builds/workspace/juliac/extension/tinfi/examples/helloworld/target/generated-sources/juliac/juliac/java/lang/RunnableInterceptorSCAIntent.java: Some input files use unchecked or unsafe operations.
[INFO] /builds/workspace/juliac/extension/tinfi/examples/helloworld/target/generated-sources/juliac/juliac/java/lang/RunnableInterceptorSCAIntent.java: Recompile with -Xlint:unchecked for details.
[INFO] 
[INFO] --- maven-resources-plugin:2.7:testResources (default-testResources) @ frascati-tinfi-helloworld ---
[INFO] Using 'UTF-8' encoding to copy filtered resources.
[INFO] skip non existing resourceDirectory /builds/workspace/juliac/extension/tinfi/examples/helloworld/src/test/resources
[INFO] 
[INFO] --- maven-compiler-plugin:3.7.0:testCompile (default-testCompile) @ frascati-tinfi-helloworld ---
[INFO] No sources to compile
[INFO] 
[INFO] --- maven-surefire-plugin:2.22.1:test (default-test) @ frascati-tinfi-helloworld ---
[INFO] No tests to run.
[INFO] 
[INFO] --- maven-jar-plugin:2.4:jar (default-jar) @ frascati-tinfi-helloworld ---
[INFO] Building jar: /builds/workspace/juliac/extension/tinfi/examples/helloworld/target/frascati-tinfi-helloworld-2.8-SNAPSHOT.jar
[INFO] 
[INFO] --- maven-source-plugin:3.0.1:jar-no-fork (default) @ frascati-tinfi-helloworld ---
[INFO] Building jar: /builds/workspace/juliac/extension/tinfi/examples/helloworld/target/frascati-tinfi-helloworld-2.8-SNAPSHOT-sources.jar
[INFO]                                                                         
[INFO] ------------------------------------------------------------------------
[INFO] Building Tinfi Example FooBar Cases 2.8-SNAPSHOT
[INFO] ------------------------------------------------------------------------
[INFO] 
[INFO] --- maven-clean-plugin:2.5:clean (default-clean) @ frascati-tinfi-foobar-cases ---
[INFO] 
[INFO] --- maven-enforcer-plugin:1.0-beta-1:enforce (enforce-maven) @ frascati-tinfi-foobar-cases ---
[INFO] 
[INFO] --- maven-source-plugin:3.0.1:jar-no-fork (default) @ frascati-tinfi-foobar-cases ---
[INFO]                                                                         
[INFO] ------------------------------------------------------------------------
[INFO] Building Tinfi Example Property of Type Class 2.8-SNAPSHOT
[INFO] ------------------------------------------------------------------------
[INFO] 
[INFO] --- maven-clean-plugin:2.5:clean (default-clean) @ frascati-tinfi-classproperty ---
[INFO] 
[INFO] --- maven-enforcer-plugin:1.0-beta-1:enforce (enforce-maven) @ frascati-tinfi-classproperty ---
[INFO] 
[INFO] --- maven-resources-plugin:2.7:resources (default-resources) @ frascati-tinfi-classproperty ---
[INFO] Using 'UTF-8' encoding to copy filtered resources.
[INFO] Copying 1 resource
[INFO] 
[INFO] --- maven-compiler-plugin:3.7.0:compile (default-compile) @ frascati-tinfi-classproperty ---
[INFO] Changes detected - recompiling the module!
[INFO] Compiling 2 source files to /builds/workspace/juliac/extension/tinfi/examples/advanced/foobar-cases/classproperty/target/classes
[INFO] 
[INFO] --- exec-maven-plugin:1.6.0:java (juliac-compile) @ frascati-tinfi-classproperty ---
java.lang.InterruptedException
	at java.base/java.lang.Object.wait(Native Method)
	at java.base/java.lang.ref.ReferenceQueue.remove(ReferenceQueue.java:151)
	at java.base/java.lang.ref.ReferenceQueue.remove(ReferenceQueue.java:172)
	at org.eclipse.emf.common.util.CommonUtil$1ReferenceClearingQueuePollingThread.run(CommonUtil.java:70)
[INFO] Registering compile source root /builds/workspace/juliac/extension/tinfi/examples/advanced/foobar-cases/classproperty/target/generated-sources/juliac
[INFO] 
[INFO] --- maven-compiler-plugin:3.7.0:compile (juliac-compile) @ frascati-tinfi-classproperty ---
[INFO] Changes detected - recompiling the module!
[INFO] Compiling 10 source files to /builds/workspace/juliac/extension/tinfi/examples/advanced/foobar-cases/classproperty/target/classes
[INFO] /builds/workspace/juliac/extension/tinfi/examples/advanced/foobar-cases/classproperty/target/generated-sources/juliac/example/hw/ServerImplFCscaPrimitiveFCd12c176c.java: Some input files use unchecked or unsafe operations.
[INFO] /builds/workspace/juliac/extension/tinfi/examples/advanced/foobar-cases/classproperty/target/generated-sources/juliac/example/hw/ServerImplFCscaPrimitiveFCd12c176c.java: Recompile with -Xlint:unchecked for details.
[INFO] 
[INFO] --- maven-resources-plugin:2.7:testResources (default-testResources) @ frascati-tinfi-classproperty ---
[INFO] Using 'UTF-8' encoding to copy filtered resources.
[INFO] skip non existing resourceDirectory /builds/workspace/juliac/extension/tinfi/examples/advanced/foobar-cases/classproperty/src/test/resources
[INFO] 
[INFO] --- maven-compiler-plugin:3.7.0:testCompile (default-testCompile) @ frascati-tinfi-classproperty ---
[INFO] Changes detected - recompiling the module!
[INFO] Compiling 1 source file to /builds/workspace/juliac/extension/tinfi/examples/advanced/foobar-cases/classproperty/target/test-classes
[INFO] 
[INFO] --- maven-surefire-plugin:2.22.1:test (default-test) @ frascati-tinfi-classproperty ---
[INFO] Surefire report directory: /builds/workspace/juliac/extension/tinfi/examples/advanced/foobar-cases/classproperty/target/surefire-reports
[INFO] 
[INFO] -------------------------------------------------------
[INFO]  T E S T S
[INFO] -------------------------------------------------------
[INFO] Running example.hw.HelloWorldTestCase
[INFO] Tests run: 1, Failures: 0, Errors: 0, Skipped: 0, Time elapsed: 0.084 s - in example.hw.HelloWorldTestCase
[INFO] 
[INFO] Results:
[INFO] 
[INFO] Tests run: 1, Failures: 0, Errors: 0, Skipped: 0
[INFO] 
[INFO] 
[INFO] --- maven-jar-plugin:2.4:jar (default-jar) @ frascati-tinfi-classproperty ---
[INFO] Building jar: /builds/workspace/juliac/extension/tinfi/examples/advanced/foobar-cases/classproperty/target/frascati-tinfi-classproperty-2.8-SNAPSHOT.jar
[INFO] 
[INFO] --- maven-source-plugin:3.0.1:jar-no-fork (default) @ frascati-tinfi-classproperty ---
[INFO] Building jar: /builds/workspace/juliac/extension/tinfi/examples/advanced/foobar-cases/classproperty/target/frascati-tinfi-classproperty-2.8-SNAPSHOT-sources.jar
[INFO]                                                                         
[INFO] ------------------------------------------------------------------------
[INFO] Building Tinfi Example Proxy Parameters 2.8-SNAPSHOT
[INFO] ------------------------------------------------------------------------
[INFO] 
[INFO] --- maven-clean-plugin:2.5:clean (default-clean) @ frascati-tinfi-proxyparameters ---
[INFO] 
[INFO] --- maven-enforcer-plugin:1.0-beta-1:enforce (enforce-maven) @ frascati-tinfi-proxyparameters ---
[INFO] 
[INFO] --- maven-resources-plugin:2.7:resources (default-resources) @ frascati-tinfi-proxyparameters ---
[INFO] Using 'UTF-8' encoding to copy filtered resources.
[INFO] Copying 1 resource
[INFO] 
[INFO] --- maven-compiler-plugin:3.7.0:compile (default-compile) @ frascati-tinfi-proxyparameters ---
[INFO] Changes detected - recompiling the module!
[INFO] Compiling 9 source files to /builds/workspace/juliac/extension/tinfi/examples/advanced/foobar-cases/proxyparameters/target/classes
[INFO] 
[INFO] --- exec-maven-plugin:1.6.0:java (juliac-compile) @ frascati-tinfi-proxyparameters ---
[INFO] Registering compile source root /builds/workspace/juliac/extension/tinfi/examples/advanced/foobar-cases/proxyparameters/target/generated-sources/juliac
[INFO] 
[INFO] --- maven-compiler-plugin:3.7.0:compile (juliac-compile) @ frascati-tinfi-proxyparameters ---
[INFO] Changes detected - recompiling the module!
[INFO] Compiling 27 source files to /builds/workspace/juliac/extension/tinfi/examples/advanced/foobar-cases/proxyparameters/target/classes
[INFO] /builds/workspace/juliac/extension/tinfi/examples/advanced/foobar-cases/proxyparameters/target/generated-sources/juliac/juliac/example/proxyparameters/IInterceptorSCAIntent.java: Some input files use unchecked or unsafe operations.
[INFO] /builds/workspace/juliac/extension/tinfi/examples/advanced/foobar-cases/proxyparameters/target/generated-sources/juliac/juliac/example/proxyparameters/IInterceptorSCAIntent.java: Recompile with -Xlint:unchecked for details.
[INFO] 
[INFO] --- maven-resources-plugin:2.7:testResources (default-testResources) @ frascati-tinfi-proxyparameters ---
[INFO] Using 'UTF-8' encoding to copy filtered resources.
[INFO] skip non existing resourceDirectory /builds/workspace/juliac/extension/tinfi/examples/advanced/foobar-cases/proxyparameters/src/test/resources
[INFO] 
[INFO] --- maven-compiler-plugin:3.7.0:testCompile (default-testCompile) @ frascati-tinfi-proxyparameters ---
[INFO] No sources to compile
[INFO] 
[INFO] --- maven-surefire-plugin:2.22.1:test (default-test) @ frascati-tinfi-proxyparameters ---
[INFO] No tests to run.
[INFO] 
[INFO] --- maven-jar-plugin:2.4:jar (default-jar) @ frascati-tinfi-proxyparameters ---
[INFO] Building jar: /builds/workspace/juliac/extension/tinfi/examples/advanced/foobar-cases/proxyparameters/target/frascati-tinfi-proxyparameters-2.8-SNAPSHOT.jar
[INFO] 
[INFO] --- maven-source-plugin:3.0.1:jar-no-fork (default) @ frascati-tinfi-proxyparameters ---
[INFO] Building jar: /builds/workspace/juliac/extension/tinfi/examples/advanced/foobar-cases/proxyparameters/target/frascati-tinfi-proxyparameters-2.8-SNAPSHOT-sources.jar
[INFO]                                                                         
[INFO] ------------------------------------------------------------------------
[INFO] Building Tinfi Example HelloWorld Binary 2.8-SNAPSHOT
[INFO] ------------------------------------------------------------------------
[INFO] 
[INFO] --- maven-clean-plugin:2.5:clean (default-clean) @ frascati-tinfi-helloworld-bin ---
[INFO] 
[INFO] --- maven-enforcer-plugin:1.0-beta-1:enforce (enforce-maven) @ frascati-tinfi-helloworld-bin ---
[INFO] 
[INFO] --- maven-source-plugin:3.0.1:jar-no-fork (default) @ frascati-tinfi-helloworld-bin ---
[INFO]                                                                         
[INFO] ------------------------------------------------------------------------
[INFO] Building Tinfi Example HelloWorld Binary - Business 2.8-SNAPSHOT
[INFO] ------------------------------------------------------------------------
[INFO] 
[INFO] --- maven-clean-plugin:2.5:clean (default-clean) @ frascati-tinfi-helloworld-bin-code ---
[INFO] 
[INFO] --- maven-enforcer-plugin:1.0-beta-1:enforce (enforce-maven) @ frascati-tinfi-helloworld-bin-code ---
[INFO] 
[INFO] --- maven-resources-plugin:2.7:resources (default-resources) @ frascati-tinfi-helloworld-bin-code ---
[INFO] Using 'UTF-8' encoding to copy filtered resources.
[INFO] skip non existing resourceDirectory /builds/workspace/juliac/extension/tinfi/examples/advanced/helloworld-bin/code/src/main/resources
[INFO] 
[INFO] --- maven-compiler-plugin:3.7.0:compile (default-compile) @ frascati-tinfi-helloworld-bin-code ---
[INFO] Changes detected - recompiling the module!
[INFO] Compiling 4 source files to /builds/workspace/juliac/extension/tinfi/examples/advanced/helloworld-bin/code/target/classes
[INFO] 
[INFO] --- maven-resources-plugin:2.7:testResources (default-testResources) @ frascati-tinfi-helloworld-bin-code ---
[INFO] Using 'UTF-8' encoding to copy filtered resources.
[INFO] skip non existing resourceDirectory /builds/workspace/juliac/extension/tinfi/examples/advanced/helloworld-bin/code/src/test/resources
[INFO] 
[INFO] --- maven-compiler-plugin:3.7.0:testCompile (default-testCompile) @ frascati-tinfi-helloworld-bin-code ---
[INFO] No sources to compile
[INFO] 
[INFO] --- maven-surefire-plugin:2.22.1:test (default-test) @ frascati-tinfi-helloworld-bin-code ---
[INFO] No tests to run.
[INFO] 
[INFO] --- maven-jar-plugin:2.4:jar (default-jar) @ frascati-tinfi-helloworld-bin-code ---
[INFO] Building jar: /builds/workspace/juliac/extension/tinfi/examples/advanced/helloworld-bin/code/target/frascati-tinfi-helloworld-bin-code-2.8-SNAPSHOT.jar
[INFO] 
[INFO] --- maven-source-plugin:3.0.1:jar-no-fork (default) @ frascati-tinfi-helloworld-bin-code ---
[INFO] Building jar: /builds/workspace/juliac/extension/tinfi/examples/advanced/helloworld-bin/code/target/frascati-tinfi-helloworld-bin-code-2.8-SNAPSHOT-sources.jar
[INFO]                                                                         
[INFO] ------------------------------------------------------------------------
[INFO] Building Tinfi Example HelloWorld Binary - Assembly 2.8-SNAPSHOT
[INFO] ------------------------------------------------------------------------
[INFO] 
[INFO] --- maven-clean-plugin:2.5:clean (default-clean) @ frascati-tinfi-helloworld-bin-assembly ---
[INFO] 
[INFO] --- maven-enforcer-plugin:1.0-beta-1:enforce (enforce-maven) @ frascati-tinfi-helloworld-bin-assembly ---
[INFO] 
[INFO] --- maven-resources-plugin:2.7:resources (resources-copy) @ frascati-tinfi-helloworld-bin-assembly ---
[INFO] Using 'UTF-8' encoding to copy filtered resources.
[INFO] Copying 1 resource
[INFO] 
[INFO] --- exec-maven-plugin:1.6.0:java (juliac-compile) @ frascati-tinfi-helloworld-bin-assembly ---
[INFO] Registering compile source root /builds/workspace/juliac/extension/tinfi/examples/advanced/helloworld-bin/assembly/target/generated-sources/juliac
[INFO] 
[INFO] --- maven-resources-plugin:2.7:resources (default-resources) @ frascati-tinfi-helloworld-bin-assembly ---
[INFO] Using 'UTF-8' encoding to copy filtered resources.
[INFO] Copying 1 resource
[INFO] 
[INFO] --- maven-compiler-plugin:3.7.0:compile (default-compile) @ frascati-tinfi-helloworld-bin-assembly ---
[INFO] Changes detected - recompiling the module!
[INFO] Compiling 14 source files to /builds/workspace/juliac/extension/tinfi/examples/advanced/helloworld-bin/assembly/target/classes
[INFO] /builds/workspace/juliac/extension/tinfi/examples/advanced/helloworld-bin/assembly/target/generated-sources/juliac/example/hw/ServerImplFCscaPrimitiveFCc21f9996.java: Some input files use unchecked or unsafe operations.
[INFO] /builds/workspace/juliac/extension/tinfi/examples/advanced/helloworld-bin/assembly/target/generated-sources/juliac/example/hw/ServerImplFCscaPrimitiveFCc21f9996.java: Recompile with -Xlint:unchecked for details.
[INFO] 
[INFO] --- maven-resources-plugin:2.7:testResources (default-testResources) @ frascati-tinfi-helloworld-bin-assembly ---
[INFO] Using 'UTF-8' encoding to copy filtered resources.
[INFO] skip non existing resourceDirectory /builds/workspace/juliac/extension/tinfi/examples/advanced/helloworld-bin/assembly/src/test/resources
[INFO] 
[INFO] --- maven-compiler-plugin:3.7.0:testCompile (default-testCompile) @ frascati-tinfi-helloworld-bin-assembly ---
[INFO] Changes detected - recompiling the module!
[INFO] Compiling 1 source file to /builds/workspace/juliac/extension/tinfi/examples/advanced/helloworld-bin/assembly/target/test-classes
[INFO] 
[INFO] --- maven-surefire-plugin:2.22.1:test (default-test) @ frascati-tinfi-helloworld-bin-assembly ---
[INFO] Surefire report directory: /builds/workspace/juliac/extension/tinfi/examples/advanced/helloworld-bin/assembly/target/surefire-reports
[INFO] 
[INFO] -------------------------------------------------------
[INFO]  T E S T S
[INFO] -------------------------------------------------------
[INFO] Running example.hw.HelloWorldTestCase
CLIENT created
CLIENT initialized
SERVER created
Server: begin printing...
->hello world
Server: print done.
[INFO] Tests run: 1, Failures: 0, Errors: 0, Skipped: 0, Time elapsed: 0.168 s - in example.hw.HelloWorldTestCase
[INFO] 
[INFO] Results:
[INFO] 
[INFO] Tests run: 1, Failures: 0, Errors: 0, Skipped: 0
[INFO] 
[INFO] 
[INFO] --- maven-jar-plugin:2.4:jar (default-jar) @ frascati-tinfi-helloworld-bin-assembly ---
[INFO] Building jar: /builds/workspace/juliac/extension/tinfi/examples/advanced/helloworld-bin/assembly/target/frascati-tinfi-helloworld-bin-assembly-2.8-SNAPSHOT.jar
[INFO] 
[INFO] --- maven-source-plugin:3.0.1:jar-no-fork (default) @ frascati-tinfi-helloworld-bin-assembly ---
[INFO] Building jar: /builds/workspace/juliac/extension/tinfi/examples/advanced/helloworld-bin/assembly/target/frascati-tinfi-helloworld-bin-assembly-2.8-SNAPSHOT-sources.jar
[INFO]                                                                         
[INFO] ------------------------------------------------------------------------
[INFO] Building Tinfi Example HelloWorld COMP Mode 2.8-SNAPSHOT
[INFO] ------------------------------------------------------------------------
[INFO] 
[INFO] --- maven-clean-plugin:2.5:clean (default-clean) @ frascati-tinfi-helloworld-scala ---
[INFO] 
[INFO] --- maven-enforcer-plugin:1.0-beta-1:enforce (enforce-maven) @ frascati-tinfi-helloworld-scala ---
[INFO] 
[INFO] --- maven-scala-plugin:2.14.1:compile (scala-compile) @ frascati-tinfi-helloworld-scala ---
[INFO] Checking for multiple versions of scala
[WARNING]  Expected all dependencies to require Scala version: 2.12.4
[WARNING]  org.ow2.fractal.juliac.tinfi:frascati-tinfi-comp-mixins:2.8-SNAPSHOT requires scala version: 2.12.4
[WARNING]  org.ow2.fractal.julia:julia-mixins-scala:2.5.2.1 requires scala version: 2.12.1
[WARNING] Multiple versions of scala libraries detected!
[INFO] includes = [**/*.java,**/*.scala,]
[INFO] excludes = []
[INFO] /builds/workspace/juliac/extension/tinfi/examples/advanced/helloworld-comp/src/main/scala:-1: info: compiling
[INFO] Compiling 4 source files to /builds/workspace/juliac/extension/tinfi/examples/advanced/helloworld-comp/target/classes at 1585498572063
[INFO] Picked up JAVA_TOOL_OPTIONS: -Dfile.encoding=UTF8
[INFO] prepare-compile in 0 s
[INFO] compile in 6 s
[INFO] 
[INFO] --- maven-resources-plugin:2.7:resources (resources-copy) @ frascati-tinfi-helloworld-scala ---
[INFO] Using 'UTF-8' encoding to copy filtered resources.
[INFO] Copying 1 resource
[INFO] 
[INFO] --- exec-maven-plugin:1.6.0:java (juliac-compile) @ frascati-tinfi-helloworld-scala ---
java.lang.InterruptedException
	at java.base/java.lang.Object.wait(Native Method)
	at java.base/java.lang.ref.ReferenceQueue.remove(ReferenceQueue.java:151)
	at java.base/java.lang.ref.ReferenceQueue.remove(ReferenceQueue.java:172)
	at org.eclipse.emf.common.util.CommonUtil$1ReferenceClearingQueuePollingThread.run(CommonUtil.java:70)
[INFO] Registering compile source root /builds/workspace/juliac/extension/tinfi/examples/advanced/helloworld-comp/target/generated-sources/juliac
[INFO] 
[INFO] --- maven-resources-plugin:2.7:resources (default-resources) @ frascati-tinfi-helloworld-scala ---
[INFO] Using 'UTF-8' encoding to copy filtered resources.
[INFO] Copying 1 resource
[INFO] 
[INFO] --- maven-compiler-plugin:3.7.0:compile (default-compile) @ frascati-tinfi-helloworld-scala ---
[INFO] Changes detected - recompiling the module!
[INFO] Compiling 75 source files to /builds/workspace/juliac/extension/tinfi/examples/advanced/helloworld-comp/target/classes
[INFO] /builds/workspace/juliac/extension/tinfi/examples/advanced/helloworld-comp/target/generated-sources/juliac/juliac/org/oasisopen/sca/ComponentContextInterceptorSCAIntent.java: Some input files use unchecked or unsafe operations.
[INFO] /builds/workspace/juliac/extension/tinfi/examples/advanced/helloworld-comp/target/generated-sources/juliac/juliac/org/oasisopen/sca/ComponentContextInterceptorSCAIntent.java: Recompile with -Xlint:unchecked for details.
[INFO] 
[INFO] --- maven-resources-plugin:2.7:testResources (default-testResources) @ frascati-tinfi-helloworld-scala ---
[INFO] Using 'UTF-8' encoding to copy filtered resources.
[INFO] skip non existing resourceDirectory /builds/workspace/juliac/extension/tinfi/examples/advanced/helloworld-comp/src/test/resources
[INFO] 
[INFO] --- maven-compiler-plugin:3.7.0:testCompile (default-testCompile) @ frascati-tinfi-helloworld-scala ---
[INFO] Changes detected - recompiling the module!
[INFO] Compiling 1 source file to /builds/workspace/juliac/extension/tinfi/examples/advanced/helloworld-comp/target/test-classes
[INFO] 
[INFO] --- maven-surefire-plugin:2.22.1:test (default-test) @ frascati-tinfi-helloworld-scala ---
[INFO] Surefire report directory: /builds/workspace/juliac/extension/tinfi/examples/advanced/helloworld-comp/target/surefire-reports
[INFO] 
[INFO] -------------------------------------------------------
[INFO]  T E S T S
[INFO] -------------------------------------------------------
[INFO] Running example.hw.HelloWorldTestCase
CLIENT created
SERVER created
Server: begin printing...
->hello world
Server: print done.
[INFO] Tests run: 1, Failures: 0, Errors: 0, Skipped: 0, Time elapsed: 0.716 s - in example.hw.HelloWorldTestCase
[INFO] 
[INFO] Results:
[INFO] 
[INFO] Tests run: 1, Failures: 0, Errors: 0, Skipped: 0
[INFO] 
[INFO] 
[INFO] --- maven-jar-plugin:2.4:jar (default-jar) @ frascati-tinfi-helloworld-scala ---
[INFO] Building jar: /builds/workspace/juliac/extension/tinfi/examples/advanced/helloworld-comp/target/frascati-tinfi-helloworld-scala-2.8-SNAPSHOT.jar
[INFO] 
[INFO] --- maven-source-plugin:3.0.1:jar-no-fork (default) @ frascati-tinfi-helloworld-scala ---
[INFO] Building jar: /builds/workspace/juliac/extension/tinfi/examples/advanced/helloworld-comp/target/frascati-tinfi-helloworld-scala-2.8-SNAPSHOT-sources.jar
[INFO]                                                                         
[INFO] ------------------------------------------------------------------------
[INFO] Building Tinfi Example HelloWorld Composite 2.8-SNAPSHOT
[INFO] ------------------------------------------------------------------------
[INFO] 
[INFO] --- maven-clean-plugin:2.5:clean (default-clean) @ frascati-tinfi-helloworld-composite ---
[INFO] 
[INFO] --- maven-enforcer-plugin:1.0-beta-1:enforce (enforce-maven) @ frascati-tinfi-helloworld-composite ---
[INFO] 
[INFO] --- maven-resources-plugin:2.7:resources (default-resources) @ frascati-tinfi-helloworld-composite ---
[INFO] Using 'UTF-8' encoding to copy filtered resources.
[INFO] Copying 3 resources
[INFO] 
[INFO] --- maven-compiler-plugin:3.7.0:compile (default-compile) @ frascati-tinfi-helloworld-composite ---
[INFO] Changes detected - recompiling the module!
[INFO] Compiling 4 source files to /builds/workspace/juliac/extension/tinfi/examples/advanced/helloworld-composite/target/classes
[INFO] 
[INFO] --- exec-maven-plugin:1.6.0:java (juliac-compile) @ frascati-tinfi-helloworld-composite ---
java.lang.InterruptedException
	at java.base/java.lang.Object.wait(Native Method)
	at java.base/java.lang.ref.ReferenceQueue.remove(ReferenceQueue.java:151)
	at java.base/java.lang.ref.ReferenceQueue.remove(ReferenceQueue.java:172)
	at org.eclipse.emf.common.util.CommonUtil$1ReferenceClearingQueuePollingThread.run(CommonUtil.java:70)
[INFO] Registering compile source root /builds/workspace/juliac/extension/tinfi/examples/advanced/helloworld-composite/target/generated-sources/juliac
[INFO] 
[INFO] --- maven-compiler-plugin:3.7.0:compile (juliac-compile) @ frascati-tinfi-helloworld-composite ---
[INFO] Changes detected - recompiling the module!
[INFO] Compiling 20 source files to /builds/workspace/juliac/extension/tinfi/examples/advanced/helloworld-composite/target/classes
[INFO] /builds/workspace/juliac/extension/tinfi/examples/advanced/helloworld-composite/target/generated-sources/juliac/juliac/example/hw/PrinterItfInterceptorSCALC135dd8d9SCACCIntent.java: Some input files use unchecked or unsafe operations.
[INFO] /builds/workspace/juliac/extension/tinfi/examples/advanced/helloworld-composite/target/generated-sources/juliac/juliac/example/hw/PrinterItfInterceptorSCALC135dd8d9SCACCIntent.java: Recompile with -Xlint:unchecked for details.
[INFO] 
[INFO] --- maven-resources-plugin:2.7:testResources (default-testResources) @ frascati-tinfi-helloworld-composite ---
[INFO] Using 'UTF-8' encoding to copy filtered resources.
[INFO] skip non existing resourceDirectory /builds/workspace/juliac/extension/tinfi/examples/advanced/helloworld-composite/src/test/resources
[INFO] 
[INFO] --- maven-compiler-plugin:3.7.0:testCompile (default-testCompile) @ frascati-tinfi-helloworld-composite ---
[INFO] Changes detected - recompiling the module!
[INFO] Compiling 1 source file to /builds/workspace/juliac/extension/tinfi/examples/advanced/helloworld-composite/target/test-classes
[INFO] 
[INFO] --- maven-surefire-plugin:2.22.1:test (default-test) @ frascati-tinfi-helloworld-composite ---
[INFO] Surefire report directory: /builds/workspace/juliac/extension/tinfi/examples/advanced/helloworld-composite/target/surefire-reports
[INFO] 
[INFO] -------------------------------------------------------
[INFO]  T E S T S
[INFO] -------------------------------------------------------
[INFO] Running example.hw.HelloWorldTestCase
CLIENT created
CLIENT initialized
SERVER created
Server: begin printing...
->hello world
Server: print done.
[INFO] Tests run: 1, Failures: 0, Errors: 0, Skipped: 0, Time elapsed: 0.164 s - in example.hw.HelloWorldTestCase
[INFO] 
[INFO] Results:
[INFO] 
[INFO] Tests run: 1, Failures: 0, Errors: 0, Skipped: 0
[INFO] 
[INFO] 
[INFO] --- maven-jar-plugin:2.4:jar (default-jar) @ frascati-tinfi-helloworld-composite ---
[INFO] Building jar: /builds/workspace/juliac/extension/tinfi/examples/advanced/helloworld-composite/target/frascati-tinfi-helloworld-composite-2.8-SNAPSHOT.jar
[INFO] 
[INFO] --- maven-source-plugin:3.0.1:jar-no-fork (default) @ frascati-tinfi-helloworld-composite ---
[INFO] Building jar: /builds/workspace/juliac/extension/tinfi/examples/advanced/helloworld-composite/target/frascati-tinfi-helloworld-composite-2.8-SNAPSHOT-sources.jar
[INFO]                                                                         
[INFO] ------------------------------------------------------------------------
[INFO] Building Tinfi Example HelloWorld Fraclet 2.8-SNAPSHOT
[INFO] ------------------------------------------------------------------------
[INFO] 
[INFO] --- maven-clean-plugin:2.5:clean (default-clean) @ frascati-tinfi-helloworld-fraclet ---
[INFO] 
[INFO] --- maven-enforcer-plugin:1.0-beta-1:enforce (enforce-maven) @ frascati-tinfi-helloworld-fraclet ---
[INFO] 
[INFO] --- maven-resources-plugin:2.7:resources (default-resources) @ frascati-tinfi-helloworld-fraclet ---
[INFO] Using 'UTF-8' encoding to copy filtered resources.
[INFO] Copying 1 resource
[INFO] 
[INFO] --- maven-compiler-plugin:3.7.0:compile (default-compile) @ frascati-tinfi-helloworld-fraclet ---
[INFO] Changes detected - recompiling the module!
[INFO] Compiling 4 source files to /builds/workspace/juliac/extension/tinfi/examples/advanced/helloworld-fraclet/target/classes
[INFO] 
[INFO] --- exec-maven-plugin:1.6.0:java (juliac-compile) @ frascati-tinfi-helloworld-fraclet ---
java.lang.InterruptedException
	at java.base/java.lang.Object.wait(Native Method)
	at java.base/java.lang.ref.ReferenceQueue.remove(ReferenceQueue.java:151)
	at java.base/java.lang.ref.ReferenceQueue.remove(ReferenceQueue.java:172)
	at org.eclipse.emf.common.util.CommonUtil$1ReferenceClearingQueuePollingThread.run(CommonUtil.java:70)
[INFO] Registering compile source root /builds/workspace/juliac/extension/tinfi/examples/advanced/helloworld-fraclet/target/generated-sources/juliac
[INFO] 
[INFO] --- maven-compiler-plugin:3.7.0:compile (juliac-compile) @ frascati-tinfi-helloworld-fraclet ---
[INFO] Changes detected - recompiling the module!
[INFO] Compiling 18 source files to /builds/workspace/juliac/extension/tinfi/examples/advanced/helloworld-fraclet/target/classes
[INFO] /builds/workspace/juliac/extension/tinfi/examples/advanced/helloworld-fraclet/target/generated-sources/juliac/juliac/scaCompositeFCf938cfee.java: Some input files use unchecked or unsafe operations.
[INFO] /builds/workspace/juliac/extension/tinfi/examples/advanced/helloworld-fraclet/target/generated-sources/juliac/juliac/scaCompositeFCf938cfee.java: Recompile with -Xlint:unchecked for details.
[INFO] 
[INFO] --- maven-resources-plugin:2.7:testResources (default-testResources) @ frascati-tinfi-helloworld-fraclet ---
[INFO] Using 'UTF-8' encoding to copy filtered resources.
[INFO] skip non existing resourceDirectory /builds/workspace/juliac/extension/tinfi/examples/advanced/helloworld-fraclet/src/test/resources
[INFO] 
[INFO] --- maven-compiler-plugin:3.7.0:testCompile (default-testCompile) @ frascati-tinfi-helloworld-fraclet ---
[INFO] No sources to compile
[INFO] 
[INFO] --- maven-surefire-plugin:2.22.1:test (default-test) @ frascati-tinfi-helloworld-fraclet ---
[INFO] No tests to run.
[INFO] 
[INFO] --- maven-jar-plugin:2.4:jar (default-jar) @ frascati-tinfi-helloworld-fraclet ---
[INFO] Building jar: /builds/workspace/juliac/extension/tinfi/examples/advanced/helloworld-fraclet/target/frascati-tinfi-helloworld-fraclet-2.8-SNAPSHOT.jar
[INFO] 
[INFO] --- maven-source-plugin:3.0.1:jar-no-fork (default) @ frascati-tinfi-helloworld-fraclet ---
[INFO] Building jar: /builds/workspace/juliac/extension/tinfi/examples/advanced/helloworld-fraclet/target/frascati-tinfi-helloworld-fraclet-2.8-SNAPSHOT-sources.jar
[INFO]                                                                         
[INFO] ------------------------------------------------------------------------
[INFO] Building Tinfi Example HelloWorld JDK 1.3 2.8-SNAPSHOT
[INFO] ------------------------------------------------------------------------
[INFO] 
[INFO] --- maven-clean-plugin:2.5:clean (default-clean) @ frascati-tinfi-helloworld-jdk13 ---
[INFO] 
[INFO] --- maven-enforcer-plugin:1.0-beta-1:enforce (enforce-maven) @ frascati-tinfi-helloworld-jdk13 ---
[INFO] 
[INFO] --- maven-resources-plugin:2.7:resources (default-resources) @ frascati-tinfi-helloworld-jdk13 ---
[INFO] Using 'UTF-8' encoding to copy filtered resources.
[INFO] Copying 1 resource
[INFO] 
[INFO] --- maven-compiler-plugin:3.7.0:compile (default-compile) @ frascati-tinfi-helloworld-jdk13 ---
[INFO] Changes detected - recompiling the module!
[INFO] Compiling 4 source files to /builds/workspace/juliac/extension/tinfi/examples/advanced/helloworld-jdk13/target/classes
[INFO] 
[INFO] --- exec-maven-plugin:1.6.0:java (juliac-compile) @ frascati-tinfi-helloworld-jdk13 ---
java.lang.InterruptedException
	at java.base/java.lang.Object.wait(Native Method)
	at java.base/java.lang.ref.ReferenceQueue.remove(ReferenceQueue.java:151)
	at java.base/java.lang.ref.ReferenceQueue.remove(ReferenceQueue.java:172)
	at org.eclipse.emf.common.util.CommonUtil$1ReferenceClearingQueuePollingThread.run(CommonUtil.java:70)
[INFO] Registering compile source root /builds/workspace/juliac/extension/tinfi/examples/advanced/helloworld-jdk13/target/generated-sources/juliac
[INFO] 
[INFO] --- maven-compiler-plugin:3.7.0:compile (juliac-compile) @ frascati-tinfi-helloworld-jdk13 ---
[INFO] Changes detected - recompiling the module!
[INFO] Compiling 18 source files to /builds/workspace/juliac/extension/tinfi/examples/advanced/helloworld-jdk13/target/classes
[INFO] /builds/workspace/juliac/extension/tinfi/examples/advanced/helloworld-jdk13/target/generated-sources/juliac/example/hw/ClientImplFCscaPrimitiveFC18c04f3e.java: Some input files use unchecked or unsafe operations.
[INFO] /builds/workspace/juliac/extension/tinfi/examples/advanced/helloworld-jdk13/target/generated-sources/juliac/example/hw/ClientImplFCscaPrimitiveFC18c04f3e.java: Recompile with -Xlint:unchecked for details.
[INFO] 
[INFO] --- maven-resources-plugin:2.7:testResources (default-testResources) @ frascati-tinfi-helloworld-jdk13 ---
[INFO] Using 'UTF-8' encoding to copy filtered resources.
[INFO] skip non existing resourceDirectory /builds/workspace/juliac/extension/tinfi/examples/advanced/helloworld-jdk13/src/test/resources
[INFO] 
[INFO] --- maven-compiler-plugin:3.7.0:testCompile (default-testCompile) @ frascati-tinfi-helloworld-jdk13 ---
[INFO] No sources to compile
[INFO] 
[INFO] --- maven-surefire-plugin:2.22.1:test (default-test) @ frascati-tinfi-helloworld-jdk13 ---
[INFO] No tests to run.
[INFO] 
[INFO] --- maven-jar-plugin:2.4:jar (default-jar) @ frascati-tinfi-helloworld-jdk13 ---
[INFO] Building jar: /builds/workspace/juliac/extension/tinfi/examples/advanced/helloworld-jdk13/target/frascati-tinfi-helloworld-jdk13-2.8-SNAPSHOT.jar
[INFO] 
[INFO] --- maven-source-plugin:3.0.1:jar-no-fork (default) @ frascati-tinfi-helloworld-jdk13 ---
[INFO] Building jar: /builds/workspace/juliac/extension/tinfi/examples/advanced/helloworld-jdk13/target/frascati-tinfi-helloworld-jdk13-2.8-SNAPSHOT-sources.jar
[INFO]                                                                         
[INFO] ------------------------------------------------------------------------
[INFO] Building Tinfi Example HelloWorld Light 2.8-SNAPSHOT
[INFO] ------------------------------------------------------------------------
[INFO] 
[INFO] --- maven-clean-plugin:2.5:clean (default-clean) @ frascati-tinfi-helloworld-light ---
[INFO] 
[INFO] --- maven-enforcer-plugin:1.0-beta-1:enforce (enforce-maven) @ frascati-tinfi-helloworld-light ---
[INFO] 
[INFO] --- maven-dependency-plugin:2.10:copy (copy-julia-tinfi-mixins) @ frascati-tinfi-helloworld-light ---
[INFO] Configured Artifact: org.objectweb.fractal.julia:julia-mixins:sources:2.5.2:jar
[INFO] Configured Artifact: org.ow2.fractal.juliac.tinfi:frascati-tinfi-mixins:sources:2.8-SNAPSHOT:jar
[INFO] Copying julia-mixins-2.5.2-sources.jar to /builds/workspace/juliac/extension/tinfi/examples/advanced/helloworld-light/target/dependency/julia-mixins-sources.jar
[INFO] Copying frascati-tinfi-mixins-2.8-SNAPSHOT-sources.jar to /builds/workspace/juliac/extension/tinfi/examples/advanced/helloworld-light/target/dependency/frascati-tinfi-mixins-sources.jar
[INFO] 
[INFO] --- maven-resources-plugin:2.7:resources (default-resources) @ frascati-tinfi-helloworld-light ---
[INFO] Using 'UTF-8' encoding to copy filtered resources.
[INFO] Copying 1 resource
[INFO] 
[INFO] --- maven-compiler-plugin:3.7.0:compile (default-compile) @ frascati-tinfi-helloworld-light ---
[INFO] Changes detected - recompiling the module!
[INFO] Compiling 4 source files to /builds/workspace/juliac/extension/tinfi/examples/advanced/helloworld-light/target/classes
[INFO] 
[INFO] --- exec-maven-plugin:1.6.0:java (juliac-compile) @ frascati-tinfi-helloworld-light ---
java.lang.InterruptedException
	at java.base/java.lang.Object.wait(Native Method)
	at java.base/java.lang.ref.ReferenceQueue.remove(ReferenceQueue.java:151)
	at java.base/java.lang.ref.ReferenceQueue.remove(ReferenceQueue.java:172)
	at org.eclipse.emf.common.util.CommonUtil$1ReferenceClearingQueuePollingThread.run(CommonUtil.java:70)
[INFO] Registering compile source root /builds/workspace/juliac/extension/tinfi/examples/advanced/helloworld-light/target/generated-sources/juliac
[INFO] 
[INFO] --- maven-compiler-plugin:3.7.0:compile (juliac-compile) @ frascati-tinfi-helloworld-light ---
[INFO] Changes detected - recompiling the module!
[INFO] Compiling 52 source files to /builds/workspace/juliac/extension/tinfi/examples/advanced/helloworld-light/target/classes
[INFO] /builds/workspace/juliac/extension/tinfi/examples/advanced/helloworld-light/target/generated-sources/juliac/juliac/scaPrimitive.java: Some input files use unchecked or unsafe operations.
[INFO] /builds/workspace/juliac/extension/tinfi/examples/advanced/helloworld-light/target/generated-sources/juliac/juliac/scaPrimitive.java: Recompile with -Xlint:unchecked for details.
[INFO] 
[INFO] --- maven-resources-plugin:2.7:testResources (default-testResources) @ frascati-tinfi-helloworld-light ---
[INFO] Using 'UTF-8' encoding to copy filtered resources.
[INFO] skip non existing resourceDirectory /builds/workspace/juliac/extension/tinfi/examples/advanced/helloworld-light/src/test/resources
[INFO] 
[INFO] --- maven-compiler-plugin:3.7.0:testCompile (default-testCompile) @ frascati-tinfi-helloworld-light ---
[INFO] Changes detected - recompiling the module!
[INFO] Compiling 1 source file to /builds/workspace/juliac/extension/tinfi/examples/advanced/helloworld-light/target/test-classes
[INFO] 
[INFO] --- maven-surefire-plugin:2.22.1:test (default-test) @ frascati-tinfi-helloworld-light ---
[INFO] Surefire report directory: /builds/workspace/juliac/extension/tinfi/examples/advanced/helloworld-light/target/surefire-reports
[INFO] 
[INFO] -------------------------------------------------------
[INFO]  T E S T S
[INFO] -------------------------------------------------------
[INFO] Running example.hw.HelloWorldTestCase
CLIENT created
CLIENT initialized
SERVER created
Server: begin printing...
->hello world
Server: print done.
[INFO] Tests run: 1, Failures: 0, Errors: 0, Skipped: 0, Time elapsed: 0.086 s - in example.hw.HelloWorldTestCase
[INFO] 
[INFO] Results:
[INFO] 
[INFO] Tests run: 1, Failures: 0, Errors: 0, Skipped: 0
[INFO] 
[INFO] 
[INFO] --- maven-jar-plugin:2.4:jar (default-jar) @ frascati-tinfi-helloworld-light ---
[INFO] Building jar: /builds/workspace/juliac/extension/tinfi/examples/advanced/helloworld-light/target/frascati-tinfi-helloworld-light-2.8-SNAPSHOT.jar
[INFO] 
[INFO] --- maven-source-plugin:3.0.1:jar-no-fork (default) @ frascati-tinfi-helloworld-light ---
[INFO] Building jar: /builds/workspace/juliac/extension/tinfi/examples/advanced/helloworld-light/target/frascati-tinfi-helloworld-light-2.8-SNAPSHOT-sources.jar
[INFO]                                                                         
[INFO] ------------------------------------------------------------------------
[INFO] Building Tinfi Examples Advanced 2.8-SNAPSHOT
[INFO] ------------------------------------------------------------------------
[INFO] 
[INFO] --- maven-clean-plugin:2.5:clean (default-clean) @ frascati-tinfi-advanced ---
[INFO] 
[INFO] --- maven-enforcer-plugin:1.0-beta-1:enforce (enforce-maven) @ frascati-tinfi-advanced ---
[INFO] 
[INFO] --- maven-source-plugin:3.0.1:jar-no-fork (default) @ frascati-tinfi-advanced ---
[INFO]                                                                         
[INFO] ------------------------------------------------------------------------
[INFO] Building Tinfi Example HelloWorld OSGi 2.8-SNAPSHOT
[INFO] ------------------------------------------------------------------------
[INFO] 
[INFO] --- maven-clean-plugin:2.5:clean (default-clean) @ frascati-tinfi-helloworld-osgi ---
[INFO] 
[INFO] --- maven-enforcer-plugin:1.0-beta-1:enforce (enforce-maven) @ frascati-tinfi-helloworld-osgi ---
[INFO] 
[INFO] --- maven-source-plugin:3.0.1:jar-no-fork (default) @ frascati-tinfi-helloworld-osgi ---
[INFO]                                                                         
[INFO] ------------------------------------------------------------------------
[INFO] Building Tinfi Example HelloWorld OSGi - Interfaces 2.8-SNAPSHOT
[INFO] ------------------------------------------------------------------------
[INFO] 
[INFO] --- maven-clean-plugin:2.5:clean (default-clean) @ frascati-tinfi-helloworld-osgi-interfaces ---
[INFO] 
[INFO] --- maven-enforcer-plugin:1.0-beta-1:enforce (enforce-maven) @ frascati-tinfi-helloworld-osgi-interfaces ---
[INFO] 
[INFO] --- maven-resources-plugin:2.7:resources (default-resources) @ frascati-tinfi-helloworld-osgi-interfaces ---
[INFO] Using 'UTF-8' encoding to copy filtered resources.
[INFO] skip non existing resourceDirectory /builds/workspace/juliac/extension/tinfi/examples/advanced/helloworld-osgi/interfaces/src/main/resources
[INFO] 
[INFO] --- maven-compiler-plugin:3.7.0:compile (default-compile) @ frascati-tinfi-helloworld-osgi-interfaces ---
[INFO] Changes detected - recompiling the module!
[INFO] Compiling 3 source files to /builds/workspace/juliac/extension/tinfi/examples/advanced/helloworld-osgi/interfaces/target/classes
[INFO] 
[INFO] --- maven-resources-plugin:2.7:testResources (default-testResources) @ frascati-tinfi-helloworld-osgi-interfaces ---
[INFO] Using 'UTF-8' encoding to copy filtered resources.
[INFO] skip non existing resourceDirectory /builds/workspace/juliac/extension/tinfi/examples/advanced/helloworld-osgi/interfaces/src/test/resources
[INFO] 
[INFO] --- maven-compiler-plugin:3.7.0:testCompile (default-testCompile) @ frascati-tinfi-helloworld-osgi-interfaces ---
[INFO] No sources to compile
[INFO] 
[INFO] --- maven-surefire-plugin:2.22.1:test (default-test) @ frascati-tinfi-helloworld-osgi-interfaces ---
[INFO] No tests to run.
[INFO] 
[INFO] --- maven-jar-plugin:2.4:jar (default-jar) @ frascati-tinfi-helloworld-osgi-interfaces ---
[INFO] Building jar: /builds/workspace/juliac/extension/tinfi/examples/advanced/helloworld-osgi/interfaces/target/frascati-tinfi-helloworld-osgi-interfaces-2.8-SNAPSHOT.jar
[INFO] 
[INFO] --- maven-source-plugin:3.0.1:jar-no-fork (default) @ frascati-tinfi-helloworld-osgi-interfaces ---
[INFO] Building jar: /builds/workspace/juliac/extension/tinfi/examples/advanced/helloworld-osgi/interfaces/target/frascati-tinfi-helloworld-osgi-interfaces-2.8-SNAPSHOT-sources.jar
[INFO] 
[INFO] --- maven-bundle-plugin:3.3.0:bundle (bundle-bundle) @ frascati-tinfi-helloworld-osgi-interfaces ---
[INFO]                                                                         
[INFO] ------------------------------------------------------------------------
[INFO] Building Tinfi Example HelloWorld OSGi - Client 2.8-SNAPSHOT
[INFO] ------------------------------------------------------------------------
[INFO] 
[INFO] --- maven-clean-plugin:2.5:clean (default-clean) @ frascati-tinfi-helloworld-osgi-client ---
[INFO] 
[INFO] --- maven-enforcer-plugin:1.0-beta-1:enforce (enforce-maven) @ frascati-tinfi-helloworld-osgi-client ---
[INFO] 
[INFO] --- maven-resources-plugin:2.7:resources (default-resources) @ frascati-tinfi-helloworld-osgi-client ---
[INFO] Using 'UTF-8' encoding to copy filtered resources.
[INFO] skip non existing resourceDirectory /builds/workspace/juliac/extension/tinfi/examples/advanced/helloworld-osgi/client/src/main/resources
[INFO] 
[INFO] --- maven-compiler-plugin:3.7.0:compile (default-compile) @ frascati-tinfi-helloworld-osgi-client ---
[INFO] Changes detected - recompiling the module!
[INFO] Compiling 2 source files to /builds/workspace/juliac/extension/tinfi/examples/advanced/helloworld-osgi/client/target/classes
[INFO] 
[INFO] --- maven-resources-plugin:2.7:testResources (default-testResources) @ frascati-tinfi-helloworld-osgi-client ---
[INFO] Using 'UTF-8' encoding to copy filtered resources.
[INFO] skip non existing resourceDirectory /builds/workspace/juliac/extension/tinfi/examples/advanced/helloworld-osgi/client/src/test/resources
[INFO] 
[INFO] --- maven-compiler-plugin:3.7.0:testCompile (default-testCompile) @ frascati-tinfi-helloworld-osgi-client ---
[INFO] No sources to compile
[INFO] 
[INFO] --- maven-surefire-plugin:2.22.1:test (default-test) @ frascati-tinfi-helloworld-osgi-client ---
[INFO] No tests to run.
[INFO] 
[INFO] --- maven-jar-plugin:2.4:jar (default-jar) @ frascati-tinfi-helloworld-osgi-client ---
[INFO] Building jar: /builds/workspace/juliac/extension/tinfi/examples/advanced/helloworld-osgi/client/target/frascati-tinfi-helloworld-osgi-client-2.8-SNAPSHOT.jar
[INFO] 
[INFO] --- maven-source-plugin:3.0.1:jar-no-fork (default) @ frascati-tinfi-helloworld-osgi-client ---
[INFO] Building jar: /builds/workspace/juliac/extension/tinfi/examples/advanced/helloworld-osgi/client/target/frascati-tinfi-helloworld-osgi-client-2.8-SNAPSHOT-sources.jar
[INFO] 
[INFO] --- maven-bundle-plugin:3.3.0:bundle (bundle-bundle) @ frascati-tinfi-helloworld-osgi-client ---
[INFO]                                                                         
[INFO] ------------------------------------------------------------------------
[INFO] Building Tinfi Example HelloWorld OSGi - Server 2.8-SNAPSHOT
[INFO] ------------------------------------------------------------------------
[INFO] 
[INFO] --- maven-clean-plugin:2.5:clean (default-clean) @ frascati-tinfi-helloworld-osgi-server ---
[INFO] 
[INFO] --- maven-enforcer-plugin:1.0-beta-1:enforce (enforce-maven) @ frascati-tinfi-helloworld-osgi-server ---
[INFO] 
[INFO] --- maven-resources-plugin:2.7:resources (default-resources) @ frascati-tinfi-helloworld-osgi-server ---
[INFO] Using 'UTF-8' encoding to copy filtered resources.
[INFO] skip non existing resourceDirectory /builds/workspace/juliac/extension/tinfi/examples/advanced/helloworld-osgi/server/src/main/resources
[INFO] 
[INFO] --- maven-compiler-plugin:3.7.0:compile (default-compile) @ frascati-tinfi-helloworld-osgi-server ---
[INFO] Changes detected - recompiling the module!
[INFO] Compiling 2 source files to /builds/workspace/juliac/extension/tinfi/examples/advanced/helloworld-osgi/server/target/classes
[INFO] 
[INFO] --- maven-resources-plugin:2.7:testResources (default-testResources) @ frascati-tinfi-helloworld-osgi-server ---
[INFO] Using 'UTF-8' encoding to copy filtered resources.
[INFO] skip non existing resourceDirectory /builds/workspace/juliac/extension/tinfi/examples/advanced/helloworld-osgi/server/src/test/resources
[INFO] 
[INFO] --- maven-compiler-plugin:3.7.0:testCompile (default-testCompile) @ frascati-tinfi-helloworld-osgi-server ---
[INFO] No sources to compile
[INFO] 
[INFO] --- maven-surefire-plugin:2.22.1:test (default-test) @ frascati-tinfi-helloworld-osgi-server ---
[INFO] No tests to run.
[INFO] 
[INFO] --- maven-jar-plugin:2.4:jar (default-jar) @ frascati-tinfi-helloworld-osgi-server ---
[INFO] Building jar: /builds/workspace/juliac/extension/tinfi/examples/advanced/helloworld-osgi/server/target/frascati-tinfi-helloworld-osgi-server-2.8-SNAPSHOT.jar
[INFO] 
[INFO] --- maven-source-plugin:3.0.1:jar-no-fork (default) @ frascati-tinfi-helloworld-osgi-server ---
[INFO] Building jar: /builds/workspace/juliac/extension/tinfi/examples/advanced/helloworld-osgi/server/target/frascati-tinfi-helloworld-osgi-server-2.8-SNAPSHOT-sources.jar
[INFO]                                                                         
[INFO] ------------------------------------------------------------------------
[INFO] Building Tinfi Example HelloWorld OSGi - Assembly 2.8-SNAPSHOT
[INFO] ------------------------------------------------------------------------
[INFO] 
[INFO] --- maven-clean-plugin:2.5:clean (default-clean) @ frascati-tinfi-helloworld-osgi-assembly ---
[INFO] 
[INFO] --- maven-enforcer-plugin:1.0-beta-1:enforce (enforce-maven) @ frascati-tinfi-helloworld-osgi-assembly ---
[INFO] 
[INFO] --- maven-resources-plugin:2.7:resources (resources-copy) @ frascati-tinfi-helloworld-osgi-assembly ---
[INFO] Using 'UTF-8' encoding to copy filtered resources.
[INFO] Copying 1 resource
[INFO] 
[INFO] --- exec-maven-plugin:1.6.0:java (juliac-compile) @ frascati-tinfi-helloworld-osgi-assembly ---
[INFO] Registering compile source root /builds/workspace/juliac/extension/tinfi/examples/advanced/helloworld-osgi/assembly/target/generated-sources/juliac
[INFO] 
[INFO] --- maven-dependency-plugin:2.10:copy (copy-bundles) @ frascati-tinfi-helloworld-osgi-assembly ---
[INFO] Configured Artifact: org.ow2.fractal.juliac.tinfi.examples:frascati-tinfi-helloworld-osgi-interfaces:2.8-SNAPSHOT:jar
[INFO] Configured Artifact: org.ow2.fractal.juliac.tinfi.examples:frascati-tinfi-helloworld-osgi-client:2.8-SNAPSHOT:jar
[INFO] Copying frascati-tinfi-helloworld-osgi-interfaces-2.8-SNAPSHOT.jar to /builds/workspace/juliac/extension/tinfi/examples/advanced/helloworld-osgi/assembly/target/classes/frascati-tinfi-helloworld-osgi-interfaces.jar
[INFO] Copying frascati-tinfi-helloworld-osgi-client-2.8-SNAPSHOT.jar to /builds/workspace/juliac/extension/tinfi/examples/advanced/helloworld-osgi/assembly/target/classes/frascati-tinfi-helloworld-osgi-client.jar
[INFO] 
[INFO] --- maven-resources-plugin:2.7:resources (default-resources) @ frascati-tinfi-helloworld-osgi-assembly ---
[INFO] Using 'UTF-8' encoding to copy filtered resources.
[INFO] Copying 1 resource
[INFO] 
[INFO] --- maven-compiler-plugin:3.7.0:compile (default-compile) @ frascati-tinfi-helloworld-osgi-assembly ---
[INFO] Changes detected - recompiling the module!
[INFO] Compiling 13 source files to /builds/workspace/juliac/extension/tinfi/examples/advanced/helloworld-osgi/assembly/target/classes
[INFO] /builds/workspace/juliac/extension/tinfi/examples/advanced/helloworld-osgi/assembly/target/generated-sources/juliac/juliac/java/lang/RunnableInterceptorLC8c41f3cDyn.java: Some input files use unchecked or unsafe operations.
[INFO] /builds/workspace/juliac/extension/tinfi/examples/advanced/helloworld-osgi/assembly/target/generated-sources/juliac/juliac/java/lang/RunnableInterceptorLC8c41f3cDyn.java: Recompile with -Xlint:unchecked for details.
[INFO] 
[INFO] --- maven-resources-plugin:2.7:testResources (default-testResources) @ frascati-tinfi-helloworld-osgi-assembly ---
[INFO] Using 'UTF-8' encoding to copy filtered resources.
[INFO] skip non existing resourceDirectory /builds/workspace/juliac/extension/tinfi/examples/advanced/helloworld-osgi/assembly/src/test/resources
[INFO] 
[INFO] --- maven-compiler-plugin:3.7.0:testCompile (default-testCompile) @ frascati-tinfi-helloworld-osgi-assembly ---
[INFO] No sources to compile
[INFO] 
[INFO] --- maven-surefire-plugin:2.22.1:test (default-test) @ frascati-tinfi-helloworld-osgi-assembly ---
[INFO] No tests to run.
[INFO] 
[INFO] --- maven-jar-plugin:2.4:jar (default-jar) @ frascati-tinfi-helloworld-osgi-assembly ---
[INFO] Building jar: /builds/workspace/juliac/extension/tinfi/examples/advanced/helloworld-osgi/assembly/target/frascati-tinfi-helloworld-osgi-assembly-2.8-SNAPSHOT.jar
[INFO] 
[INFO] --- maven-source-plugin:3.0.1:jar-no-fork (default) @ frascati-tinfi-helloworld-osgi-assembly ---
[INFO] Building jar: /builds/workspace/juliac/extension/tinfi/examples/advanced/helloworld-osgi/assembly/target/frascati-tinfi-helloworld-osgi-assembly-2.8-SNAPSHOT-sources.jar
[INFO]                                                                         
[INFO] ------------------------------------------------------------------------
[INFO] Building Tinfi Example HelloWorld POJO 2.8-SNAPSHOT
[INFO] ------------------------------------------------------------------------
[INFO] 
[INFO] --- maven-clean-plugin:2.5:clean (default-clean) @ frascati-tinfi-helloworld-pojo ---
[INFO] 
[INFO] --- maven-enforcer-plugin:1.0-beta-1:enforce (enforce-maven) @ frascati-tinfi-helloworld-pojo ---
[INFO] 
[INFO] --- maven-resources-plugin:2.7:resources (default-resources) @ frascati-tinfi-helloworld-pojo ---
[INFO] Using 'UTF-8' encoding to copy filtered resources.
[INFO] Copying 1 resource
[INFO] 
[INFO] --- maven-compiler-plugin:3.7.0:compile (default-compile) @ frascati-tinfi-helloworld-pojo ---
[INFO] Changes detected - recompiling the module!
[INFO] Compiling 4 source files to /builds/workspace/juliac/extension/tinfi/examples/advanced/helloworld-pojo/target/classes
[INFO] 
[INFO] --- exec-maven-plugin:1.6.0:java (juliac-compile) @ frascati-tinfi-helloworld-pojo ---
java.lang.InterruptedException
	at java.base/java.lang.Object.wait(Native Method)
	at java.base/java.lang.ref.ReferenceQueue.remove(ReferenceQueue.java:151)
	at java.base/java.lang.ref.ReferenceQueue.remove(ReferenceQueue.java:172)
	at org.eclipse.emf.common.util.CommonUtil$1ReferenceClearingQueuePollingThread.run(CommonUtil.java:70)
[INFO] Registering compile source root /builds/workspace/juliac/extension/tinfi/examples/advanced/helloworld-pojo/target/generated-sources/juliac
[INFO] 
[INFO] --- maven-compiler-plugin:3.7.0:compile (juliac-compile) @ frascati-tinfi-helloworld-pojo ---
[INFO] Changes detected - recompiling the module!
[INFO] Compiling 18 source files to /builds/workspace/juliac/extension/tinfi/examples/advanced/helloworld-pojo/target/classes
[INFO] /builds/workspace/juliac/extension/tinfi/examples/advanced/helloworld-pojo/target/generated-sources/juliac/juliac/java/lang/RunnableInterceptorSCAIntent.java: Some input files use unchecked or unsafe operations.
[INFO] /builds/workspace/juliac/extension/tinfi/examples/advanced/helloworld-pojo/target/generated-sources/juliac/juliac/java/lang/RunnableInterceptorSCAIntent.java: Recompile with -Xlint:unchecked for details.
[INFO] 
[INFO] --- maven-resources-plugin:2.7:testResources (default-testResources) @ frascati-tinfi-helloworld-pojo ---
[INFO] Using 'UTF-8' encoding to copy filtered resources.
[INFO] skip non existing resourceDirectory /builds/workspace/juliac/extension/tinfi/examples/advanced/helloworld-pojo/src/test/resources
[INFO] 
[INFO] --- maven-compiler-plugin:3.7.0:testCompile (default-testCompile) @ frascati-tinfi-helloworld-pojo ---
[INFO] Changes detected - recompiling the module!
[INFO] Compiling 1 source file to /builds/workspace/juliac/extension/tinfi/examples/advanced/helloworld-pojo/target/test-classes
[INFO] 
[INFO] --- maven-surefire-plugin:2.22.1:test (default-test) @ frascati-tinfi-helloworld-pojo ---
[INFO] Surefire report directory: /builds/workspace/juliac/extension/tinfi/examples/advanced/helloworld-pojo/target/surefire-reports
[INFO] 
[INFO] -------------------------------------------------------
[INFO]  T E S T S
[INFO] -------------------------------------------------------
[INFO] Running example.hw.HelloWorldTestCase
CLIENT created
SERVER created
Server: begin printing...
->hello world
Server: print done.
[INFO] Tests run: 1, Failures: 0, Errors: 0, Skipped: 0, Time elapsed: 0.121 s - in example.hw.HelloWorldTestCase
[INFO] 
[INFO] Results:
[INFO] 
[INFO] Tests run: 1, Failures: 0, Errors: 0, Skipped: 0
[INFO] 
[INFO] 
[INFO] --- maven-jar-plugin:2.4:jar (default-jar) @ frascati-tinfi-helloworld-pojo ---
[INFO] Building jar: /builds/workspace/juliac/extension/tinfi/examples/advanced/helloworld-pojo/target/frascati-tinfi-helloworld-pojo-2.8-SNAPSHOT.jar
[INFO] 
[INFO] --- maven-source-plugin:3.0.1:jar-no-fork (default) @ frascati-tinfi-helloworld-pojo ---
[INFO] Building jar: /builds/workspace/juliac/extension/tinfi/examples/advanced/helloworld-pojo/target/frascati-tinfi-helloworld-pojo-2.8-SNAPSHOT-sources.jar
[INFO]                                                                         
[INFO] ------------------------------------------------------------------------
[INFO] Building Tinfi Example HelloWorld Tinfilet 2.8-SNAPSHOT
[INFO] ------------------------------------------------------------------------
[INFO] 
[INFO] --- maven-clean-plugin:2.5:clean (default-clean) @ frascati-tinfi-helloworld-tinfilet ---
[INFO] 
[INFO] --- maven-enforcer-plugin:1.0-beta-1:enforce (enforce-maven) @ frascati-tinfi-helloworld-tinfilet ---
[INFO] 
[INFO] --- maven-dependency-plugin:2.10:copy (copy-julia-tinfi-mixins) @ frascati-tinfi-helloworld-tinfilet ---
[INFO] Configured Artifact: org.objectweb.fractal.julia:julia-mixins:sources:2.5.2:jar
[INFO] Configured Artifact: org.ow2.fractal.juliac.tinfi:frascati-tinfi-mixins:sources:2.8-SNAPSHOT:jar
[INFO] Copying julia-mixins-2.5.2-sources.jar to /builds/workspace/juliac/extension/tinfi/examples/advanced/helloworld-tinfilet/target/dependency/julia-mixins-sources.jar
[INFO] Copying frascati-tinfi-mixins-2.8-SNAPSHOT-sources.jar to /builds/workspace/juliac/extension/tinfi/examples/advanced/helloworld-tinfilet/target/dependency/frascati-tinfi-mixins-sources.jar
[INFO] 
[INFO] --- maven-resources-plugin:2.7:resources (default-resources) @ frascati-tinfi-helloworld-tinfilet ---
[INFO] Using 'UTF-8' encoding to copy filtered resources.
[INFO] skip non existing resourceDirectory /builds/workspace/juliac/extension/tinfi/examples/advanced/helloworld-tinfilet/src/main/resources
[INFO] 
[INFO] --- maven-compiler-plugin:3.7.0:compile (default-compile) @ frascati-tinfi-helloworld-tinfilet ---
[INFO] Changes detected - recompiling the module!
[INFO] Compiling 5 source files to /builds/workspace/juliac/extension/tinfi/examples/advanced/helloworld-tinfilet/target/classes
[INFO] 
[INFO] --- exec-maven-plugin:1.6.0:java (juliac-compile) @ frascati-tinfi-helloworld-tinfilet ---
[INFO] Registering compile source root /builds/workspace/juliac/extension/tinfi/examples/advanced/helloworld-tinfilet/target/generated-sources/juliac
[INFO] 
[INFO] --- maven-compiler-plugin:3.7.0:compile (juliac-compile) @ frascati-tinfi-helloworld-tinfilet ---
[INFO] Changes detected - recompiling the module!
[INFO] Compiling 59 source files to /builds/workspace/juliac/extension/tinfi/examples/advanced/helloworld-tinfilet/target/classes
[INFO] /builds/workspace/juliac/extension/tinfi/examples/advanced/helloworld-tinfilet/target/generated-sources/juliac/juliac/mySCAPrimitive.java: Some input files use unchecked or unsafe operations.
[INFO] /builds/workspace/juliac/extension/tinfi/examples/advanced/helloworld-tinfilet/target/generated-sources/juliac/juliac/mySCAPrimitive.java: Recompile with -Xlint:unchecked for details.
[INFO] 
[INFO] --- maven-resources-plugin:2.7:testResources (default-testResources) @ frascati-tinfi-helloworld-tinfilet ---
[INFO] Using 'UTF-8' encoding to copy filtered resources.
[INFO] skip non existing resourceDirectory /builds/workspace/juliac/extension/tinfi/examples/advanced/helloworld-tinfilet/src/test/resources
[INFO] 
[INFO] --- maven-compiler-plugin:3.7.0:testCompile (default-testCompile) @ frascati-tinfi-helloworld-tinfilet ---
[INFO] Changes detected - recompiling the module!
[INFO] Compiling 1 source file to /builds/workspace/juliac/extension/tinfi/examples/advanced/helloworld-tinfilet/target/test-classes
[INFO] 
[INFO] --- maven-surefire-plugin:2.22.1:test (default-test) @ frascati-tinfi-helloworld-tinfilet ---
[INFO] Surefire report directory: /builds/workspace/juliac/extension/tinfi/examples/advanced/helloworld-tinfilet/target/surefire-reports
[INFO] 
[INFO] -------------------------------------------------------
[INFO]  T E S T S
[INFO] -------------------------------------------------------
[INFO] Running example.hw.HelloWorldTestCase
CLIENT created
CLIENT initialized
SERVER created
Server: begin printing...
-> hello world
Server: print done.
[INFO] Tests run: 1, Failures: 0, Errors: 0, Skipped: 0, Time elapsed: 0.19 s - in example.hw.HelloWorldTestCase
[INFO] 
[INFO] Results:
[INFO] 
[INFO] Tests run: 1, Failures: 0, Errors: 0, Skipped: 0
[INFO] 
[INFO] 
[INFO] --- maven-jar-plugin:2.4:jar (default-jar) @ frascati-tinfi-helloworld-tinfilet ---
[INFO] Building jar: /builds/workspace/juliac/extension/tinfi/examples/advanced/helloworld-tinfilet/target/frascati-tinfi-helloworld-tinfilet-2.8-SNAPSHOT.jar
[INFO] 
[INFO] --- maven-source-plugin:3.0.1:jar-no-fork (default) @ frascati-tinfi-helloworld-tinfilet ---
[INFO] Building jar: /builds/workspace/juliac/extension/tinfi/examples/advanced/helloworld-tinfilet/target/frascati-tinfi-helloworld-tinfilet-2.8-SNAPSHOT-sources.jar
[INFO]                                                                         
[INFO] ------------------------------------------------------------------------
[INFO] Building Tinfi Example HelloWorld With Intent 2.8-SNAPSHOT
[INFO] ------------------------------------------------------------------------
[INFO] 
[INFO] --- maven-clean-plugin:2.5:clean (default-clean) @ frascati-tinfi-helloworld-with-intent ---
[INFO] 
[INFO] --- maven-enforcer-plugin:1.0-beta-1:enforce (enforce-maven) @ frascati-tinfi-helloworld-with-intent ---
[INFO] 
[INFO] --- maven-resources-plugin:2.7:resources (default-resources) @ frascati-tinfi-helloworld-with-intent ---
[INFO] Using 'UTF-8' encoding to copy filtered resources.
[INFO] Copying 3 resources
[INFO] 
[INFO] --- maven-compiler-plugin:3.7.0:compile (default-compile) @ frascati-tinfi-helloworld-with-intent ---
[INFO] Changes detected - recompiling the module!
[INFO] Compiling 7 source files to /builds/workspace/juliac/extension/tinfi/examples/advanced/helloworld-with-intent/target/classes
[INFO] 
[INFO] --- exec-maven-plugin:1.6.0:java (juliac-compile) @ frascati-tinfi-helloworld-with-intent ---
[INFO] Registering compile source root /builds/workspace/juliac/extension/tinfi/examples/advanced/helloworld-with-intent/target/generated-sources/juliac
[INFO] 
[INFO] --- maven-compiler-plugin:3.7.0:compile (juliac-compile) @ frascati-tinfi-helloworld-with-intent ---
[INFO] Changes detected - recompiling the module!
[INFO] Compiling 29 source files to /builds/workspace/juliac/extension/tinfi/examples/advanced/helloworld-with-intent/target/classes
[INFO] /builds/workspace/juliac/extension/tinfi/examples/advanced/helloworld-with-intent/target/generated-sources/juliac/example/hw/handler/PolicySetDebug1HandlerFCscaPrimitiveFCc3b71b60.java: Some input files use unchecked or unsafe operations.
[INFO] /builds/workspace/juliac/extension/tinfi/examples/advanced/helloworld-with-intent/target/generated-sources/juliac/example/hw/handler/PolicySetDebug1HandlerFCscaPrimitiveFCc3b71b60.java: Recompile with -Xlint:unchecked for details.
[INFO] 
[INFO] --- maven-resources-plugin:2.7:testResources (default-testResources) @ frascati-tinfi-helloworld-with-intent ---
[INFO] Using 'UTF-8' encoding to copy filtered resources.
[INFO] skip non existing resourceDirectory /builds/workspace/juliac/extension/tinfi/examples/advanced/helloworld-with-intent/src/test/resources
[INFO] 
[INFO] --- maven-compiler-plugin:3.7.0:testCompile (default-testCompile) @ frascati-tinfi-helloworld-with-intent ---
[INFO] Changes detected - recompiling the module!
[INFO] Compiling 1 source file to /builds/workspace/juliac/extension/tinfi/examples/advanced/helloworld-with-intent/target/test-classes
[INFO] 
[INFO] --- maven-surefire-plugin:2.22.1:test (default-test) @ frascati-tinfi-helloworld-with-intent ---
[INFO] Surefire report directory: /builds/workspace/juliac/extension/tinfi/examples/advanced/helloworld-with-intent/target/surefire-reports
[INFO] 
[INFO] -------------------------------------------------------
[INFO]  T E S T S
[INFO] -------------------------------------------------------
[INFO] Running example.hw.HelloWorldTestCase
<< debug1: before print
<< debug2: before
Server: begin printing...
->hello world
Server: print done.
<< debug2: after
<< debug1: after

<< debug1: before print
Server: begin printing...
->hello world
Server: print done.
<< debug1: after

<< debug1: before print
<< debug2: before
<< MyException thrown with message: foo not supported

[INFO] Tests run: 3, Failures: 0, Errors: 0, Skipped: 0, Time elapsed: 0.211 s - in example.hw.HelloWorldTestCase
[INFO] 
[INFO] Results:
[INFO] 
[INFO] Tests run: 3, Failures: 0, Errors: 0, Skipped: 0
[INFO] 
[INFO] 
[INFO] --- maven-jar-plugin:2.4:jar (default-jar) @ frascati-tinfi-helloworld-with-intent ---
[INFO] Building jar: /builds/workspace/juliac/extension/tinfi/examples/advanced/helloworld-with-intent/target/frascati-tinfi-helloworld-with-intent-2.8-SNAPSHOT.jar
[INFO] 
[INFO] --- maven-source-plugin:3.0.1:jar-no-fork (default) @ frascati-tinfi-helloworld-with-intent ---
[INFO] Building jar: /builds/workspace/juliac/extension/tinfi/examples/advanced/helloworld-with-intent/target/frascati-tinfi-helloworld-with-intent-2.8-SNAPSHOT-sources.jar
[INFO]                                                                         
[INFO] ------------------------------------------------------------------------
[INFO] Building Tinfi Example HelloWorld Ultra-Merge 2.8-SNAPSHOT
[INFO] ------------------------------------------------------------------------
[INFO] 
[INFO] --- maven-clean-plugin:2.5:clean (default-clean) @ frascati-tinfi-ultra-merge-helloworld ---
[INFO] 
[INFO] --- maven-enforcer-plugin:1.0-beta-1:enforce (enforce-maven) @ frascati-tinfi-ultra-merge-helloworld ---
[INFO] 
[INFO] --- maven-resources-plugin:2.7:resources (default-resources) @ frascati-tinfi-ultra-merge-helloworld ---
[INFO] Using 'UTF-8' encoding to copy filtered resources.
[INFO] Copying 1 resource
[INFO] 
[INFO] --- maven-compiler-plugin:3.7.0:compile (default-compile) @ frascati-tinfi-ultra-merge-helloworld ---
[INFO] Changes detected - recompiling the module!
[INFO] Compiling 7 source files to /builds/workspace/juliac/extension/tinfi/examples/advanced/ultra-merge-helloworld/target/classes
[INFO] 
[INFO] --- exec-maven-plugin:1.6.0:java (juliac-compile) @ frascati-tinfi-ultra-merge-helloworld ---
java.lang.InterruptedException
	at java.base/java.lang.Object.wait(Native Method)
	at java.base/java.lang.ref.ReferenceQueue.remove(ReferenceQueue.java:151)
	at java.base/java.lang.ref.ReferenceQueue.remove(ReferenceQueue.java:172)
	at org.eclipse.emf.common.util.CommonUtil$1ReferenceClearingQueuePollingThread.run(CommonUtil.java:70)
[INFO] Registering compile source root /builds/workspace/juliac/extension/tinfi/examples/advanced/ultra-merge-helloworld/target/generated-sources/juliac
[INFO] 
[INFO] --- maven-compiler-plugin:3.7.0:compile (juliac-compile) @ frascati-tinfi-ultra-merge-helloworld ---
[INFO] Changes detected - recompiling the module!
[INFO] Compiling 8 source files to /builds/workspace/juliac/extension/tinfi/examples/advanced/ultra-merge-helloworld/target/classes
[INFO] /builds/workspace/juliac/extension/tinfi/examples/advanced/ultra-merge-helloworld/target/generated-sources/juliac/HelloWorld.java: /builds/workspace/juliac/extension/tinfi/examples/advanced/ultra-merge-helloworld/target/generated-sources/juliac/HelloWorld.java uses unchecked or unsafe operations.
[INFO] /builds/workspace/juliac/extension/tinfi/examples/advanced/ultra-merge-helloworld/target/generated-sources/juliac/HelloWorld.java: Recompile with -Xlint:unchecked for details.
[INFO] 
[INFO] --- maven-resources-plugin:2.7:testResources (default-testResources) @ frascati-tinfi-ultra-merge-helloworld ---
[INFO] Using 'UTF-8' encoding to copy filtered resources.
[INFO] skip non existing resourceDirectory /builds/workspace/juliac/extension/tinfi/examples/advanced/ultra-merge-helloworld/src/test/resources
[INFO] 
[INFO] --- maven-compiler-plugin:3.7.0:testCompile (default-testCompile) @ frascati-tinfi-ultra-merge-helloworld ---
[INFO] Changes detected - recompiling the module!
[INFO] Compiling 1 source file to /builds/workspace/juliac/extension/tinfi/examples/advanced/ultra-merge-helloworld/target/test-classes
[INFO] 
[INFO] --- maven-surefire-plugin:2.22.1:test (default-test) @ frascati-tinfi-ultra-merge-helloworld ---
[INFO] Surefire report directory: /builds/workspace/juliac/extension/tinfi/examples/advanced/ultra-merge-helloworld/target/surefire-reports
[INFO] 
[INFO] -------------------------------------------------------
[INFO]  T E S T S
[INFO] -------------------------------------------------------
[INFO] Running example.hw.HelloWorldTestCase
Server: begin printing...
-> hello world
Server: print done.
Server2: begin printing...
=> hello world
=> hello world
Server2: print done.
Server3: begin printing...
== hello world
== hello world
== hello world
Server3: print done.
[INFO] Tests run: 1, Failures: 0, Errors: 0, Skipped: 0, Time elapsed: 0.097 s - in example.hw.HelloWorldTestCase
[INFO] 
[INFO] Results:
[INFO] 
[INFO] Tests run: 1, Failures: 0, Errors: 0, Skipped: 0
[INFO] 
[INFO] 
[INFO] --- maven-jar-plugin:2.4:jar (default-jar) @ frascati-tinfi-ultra-merge-helloworld ---
[INFO] Building jar: /builds/workspace/juliac/extension/tinfi/examples/advanced/ultra-merge-helloworld/target/frascati-tinfi-ultra-merge-helloworld-2.8-SNAPSHOT.jar
[INFO] 
[INFO] --- maven-source-plugin:3.0.1:jar-no-fork (default) @ frascati-tinfi-ultra-merge-helloworld ---
[INFO] Building jar: /builds/workspace/juliac/extension/tinfi/examples/advanced/ultra-merge-helloworld/target/frascati-tinfi-ultra-merge-helloworld-2.8-SNAPSHOT-sources.jar
[INFO]                                                                         
[INFO] ------------------------------------------------------------------------
[INFO] Building Juliac MOJO Parent 2.8-SNAPSHOT
[INFO] ------------------------------------------------------------------------
[INFO] 
[INFO] --- maven-clean-plugin:2.5:clean (default-clean) @ juliac-mojo-parent ---
[INFO] 
[INFO] --- maven-enforcer-plugin:1.0-beta-1:enforce (enforce-maven) @ juliac-mojo-parent ---
[INFO] 
[INFO] --- maven-source-plugin:3.0.1:jar-no-fork (default) @ juliac-mojo-parent ---
[INFO]                                                                         
[INFO] ------------------------------------------------------------------------
[INFO] Building Juliac MOJO Maven 2 2.8-SNAPSHOT
[INFO] ------------------------------------------------------------------------
[INFO] 
[INFO] --- maven-clean-plugin:2.5:clean (default-clean) @ juliac-maven-plugin ---
[INFO] 
[INFO] --- maven-enforcer-plugin:1.0-beta-1:enforce (enforce-maven) @ juliac-maven-plugin ---
[INFO] 
[INFO] --- maven-resources-plugin:2.7:resources (default-resources) @ juliac-maven-plugin ---
[INFO] Using 'UTF-8' encoding to copy filtered resources.
[INFO] skip non existing resourceDirectory /builds/workspace/juliac/mojo/mvn2/src/main/resources
[INFO] 
[INFO] --- maven-compiler-plugin:3.7.0:compile (default-compile) @ juliac-maven-plugin ---
[INFO] Changes detected - recompiling the module!
[INFO] Compiling 8 source files to /builds/workspace/juliac/mojo/mvn2/target/classes
[INFO] /builds/workspace/juliac/mojo/mvn2/src/main/java/org/objectweb/fractal/juliac/AbstractJuliacMojo.java: Some input files use unchecked or unsafe operations.
[INFO] /builds/workspace/juliac/mojo/mvn2/src/main/java/org/objectweb/fractal/juliac/AbstractJuliacMojo.java: Recompile with -Xlint:unchecked for details.
[INFO] 
[INFO] --- maven-plugin-plugin:2.9:descriptor (default-descriptor) @ juliac-maven-plugin ---
[INFO] Using 'UTF-8' encoding to read mojo metadata.
[INFO] Applying mojo extractor for language: java
[INFO] Mojo extractor for language: java found 2 mojo descriptors.
[INFO] Applying mojo extractor for language: bsh
[INFO] Mojo extractor for language: bsh found 0 mojo descriptors.
[INFO] 
[INFO] --- maven-resources-plugin:2.7:testResources (default-testResources) @ juliac-maven-plugin ---
[INFO] Using 'UTF-8' encoding to copy filtered resources.
[INFO] skip non existing resourceDirectory /builds/workspace/juliac/mojo/mvn2/src/test/resources
[INFO] 
[INFO] --- maven-compiler-plugin:3.7.0:testCompile (default-testCompile) @ juliac-maven-plugin ---
[INFO] No sources to compile
[INFO] 
[INFO] --- maven-surefire-plugin:2.22.1:test (default-test) @ juliac-maven-plugin ---
[INFO] No tests to run.
[INFO] 
[INFO] --- maven-jar-plugin:2.4:jar (default-jar) @ juliac-maven-plugin ---
[INFO] Building jar: /builds/workspace/juliac/mojo/mvn2/target/juliac-maven-plugin-2.8-SNAPSHOT.jar
[INFO] 
[INFO] --- maven-plugin-plugin:2.9:addPluginArtifactMetadata (default-addPluginArtifactMetadata) @ juliac-maven-plugin ---
[INFO] 
[INFO] --- maven-source-plugin:3.0.1:jar-no-fork (default) @ juliac-maven-plugin ---
[INFO] Building jar: /builds/workspace/juliac/mojo/mvn2/target/juliac-maven-plugin-2.8-SNAPSHOT-sources.jar
[INFO]                                                                         
[INFO] ------------------------------------------------------------------------
[INFO] Building Juliac MOJO Conf Tests 2.8-SNAPSHOT
[INFO] ------------------------------------------------------------------------
[INFO] 
[INFO] --- maven-clean-plugin:2.5:clean (default-clean) @ juliac-mojo-tests-conf-parent ---
[INFO] 
[INFO] --- maven-enforcer-plugin:1.0-beta-1:enforce (enforce-maven) @ juliac-mojo-tests-conf-parent ---
[INFO] 
[INFO] --- maven-source-plugin:3.0.1:jar-no-fork (default) @ juliac-mojo-tests-conf-parent ---
[INFO]                                                                         
[INFO] ------------------------------------------------------------------------
[INFO] Building Juliac MOJO Conf Tests Add Classpath Elements 2.8-SNAPSHOT
[INFO] ------------------------------------------------------------------------
[INFO] 
[INFO] --- maven-clean-plugin:2.5:clean (default-clean) @ add-classpath-elements ---
[INFO] 
[INFO] --- maven-enforcer-plugin:1.0-beta-1:enforce (enforce-maven) @ add-classpath-elements ---
[INFO] 
[INFO] --- juliac-maven-plugin:2.8-SNAPSHOT:compile (juliac-compile) @ add-classpath-elements ---
[INFO] 
[INFO] --- maven-resources-plugin:2.7:resources (default-resources) @ add-classpath-elements ---
[INFO] Using 'UTF-8' encoding to copy filtered resources.
[INFO] Copying 2 resources
[INFO] 
[INFO] --- maven-compiler-plugin:3.7.0:compile (default-compile) @ add-classpath-elements ---
[INFO] Changes detected - recompiling the module!
[INFO] Compiling 12 source files to /builds/workspace/juliac/mojo/tests-conf/add-classpath-elements/target/classes
[INFO] /builds/workspace/juliac/mojo/tests-conf/add-classpath-elements/target/juliac-generated-src/example/hw/ServerImplFCparametricPrimitiveFCc21f9996.java: Some input files use unchecked or unsafe operations.
[INFO] /builds/workspace/juliac/mojo/tests-conf/add-classpath-elements/target/juliac-generated-src/example/hw/ServerImplFCparametricPrimitiveFCc21f9996.java: Recompile with -Xlint:unchecked for details.
[INFO] 
[INFO] --- maven-compiler-plugin:3.7.0:compile (compile) @ add-classpath-elements ---
[INFO] Not compiling main sources
[INFO] 
[INFO] --- juliac-maven-plugin:2.8-SNAPSHOT:testCompile (juliac-test-compile) @ add-classpath-elements ---
[INFO] 
[INFO] --- maven-resources-plugin:2.7:testResources (default-testResources) @ add-classpath-elements ---
[INFO] Using 'UTF-8' encoding to copy filtered resources.
[INFO] Copying 1 resource
[INFO] 
[INFO] --- maven-compiler-plugin:3.7.0:testCompile (default-testCompile) @ add-classpath-elements ---
[INFO] Changes detected - recompiling the module!
[INFO] Compiling 6 source files to /builds/workspace/juliac/mojo/tests-conf/add-classpath-elements/target/test-classes
[INFO] /builds/workspace/juliac/mojo/tests-conf/add-classpath-elements/target/generated-test-sources/juliac/example/hw/ServerImplFCparametricPrimitiveFC41750587.java: Some input files use unchecked or unsafe operations.
[INFO] /builds/workspace/juliac/mojo/tests-conf/add-classpath-elements/target/generated-test-sources/juliac/example/hw/ServerImplFCparametricPrimitiveFC41750587.java: Recompile with -Xlint:unchecked for details.
[INFO] 
[INFO] --- maven-compiler-plugin:3.7.0:testCompile (testCompile) @ add-classpath-elements ---
[INFO] Changes detected - recompiling the module!
[INFO] Compiling 6 source files to /builds/workspace/juliac/mojo/tests-conf/add-classpath-elements/target/test-classes
[INFO] /builds/workspace/juliac/mojo/tests-conf/add-classpath-elements/target/generated-test-sources/juliac/example/hw/ServerImplFCparametricPrimitiveFC41750587.java: Some input files use unchecked or unsafe operations.
[INFO] /builds/workspace/juliac/mojo/tests-conf/add-classpath-elements/target/generated-test-sources/juliac/example/hw/ServerImplFCparametricPrimitiveFC41750587.java: Recompile with -Xlint:unchecked for details.
[INFO] 
[INFO] --- maven-surefire-plugin:2.22.1:test (default-test) @ add-classpath-elements ---
[INFO] Surefire report directory: /builds/workspace/juliac/mojo/tests-conf/add-classpath-elements/target/surefire-reports
[INFO] 
[INFO] -------------------------------------------------------
[INFO]  T E S T S
[INFO] -------------------------------------------------------
[INFO] Running example.hw.HelloWorldTestCase
CLIENT created
SERVER created
Server: begin printing...
-> Hello world
Server: print done.
[INFO] Tests run: 1, Failures: 0, Errors: 0, Skipped: 0, Time elapsed: 0.063 s - in example.hw.HelloWorldTestCase
[INFO] 
[INFO] Results:
[INFO] 
[INFO] Tests run: 1, Failures: 0, Errors: 0, Skipped: 0
[INFO] 
[INFO] 
[INFO] --- maven-jar-plugin:2.4:jar (default-jar) @ add-classpath-elements ---
[INFO] Building jar: /builds/workspace/juliac/mojo/tests-conf/add-classpath-elements/target/add-classpath-elements-2.8-SNAPSHOT.jar
[INFO] 
[INFO] --- maven-source-plugin:3.0.1:jar-no-fork (default) @ add-classpath-elements ---
[INFO] Building jar: /builds/workspace/juliac/mojo/tests-conf/add-classpath-elements/target/add-classpath-elements-2.8-SNAPSHOT-sources.jar
[INFO]                                                                         
[INFO] ------------------------------------------------------------------------
[INFO] Building Juliac MOJO Conf Tests Generate Proxies 2.8-SNAPSHOT
[INFO] ------------------------------------------------------------------------
[INFO] 
[INFO] --- maven-clean-plugin:2.5:clean (default-clean) @ generate-proxies ---
[INFO] 
[INFO] --- maven-enforcer-plugin:1.0-beta-1:enforce (enforce-maven) @ generate-proxies ---
[INFO] 
[INFO] --- juliac-maven-plugin:2.8-SNAPSHOT:compile (juliac-compile) @ generate-proxies ---
[INFO] 
[INFO] --- maven-resources-plugin:2.7:resources (default-resources) @ generate-proxies ---
[INFO] Using 'UTF-8' encoding to copy filtered resources.
[INFO] skip non existing resourceDirectory /builds/workspace/juliac/mojo/tests-conf/generate-proxies/src/main/resources
[INFO] 
[INFO] --- maven-compiler-plugin:3.7.0:compile (default-compile) @ generate-proxies ---
[INFO] Changes detected - recompiling the module!
[INFO] Compiling 3 source files to /builds/workspace/juliac/mojo/tests-conf/generate-proxies/target/classes
[INFO] 
[INFO] --- maven-resources-plugin:2.7:testResources (default-testResources) @ generate-proxies ---
[INFO] Using 'UTF-8' encoding to copy filtered resources.
[INFO] skip non existing resourceDirectory /builds/workspace/juliac/mojo/tests-conf/generate-proxies/src/test/resources
[INFO] 
[INFO] --- maven-compiler-plugin:3.7.0:testCompile (default-testCompile) @ generate-proxies ---
[INFO] No sources to compile
[INFO] 
[INFO] --- maven-surefire-plugin:2.22.1:test (default-test) @ generate-proxies ---
[INFO] No tests to run.
[INFO] 
[INFO] --- maven-jar-plugin:2.4:jar (default-jar) @ generate-proxies ---
[INFO] Building jar: /builds/workspace/juliac/mojo/tests-conf/generate-proxies/target/generate-proxies-2.8-SNAPSHOT.jar
[INFO] 
[INFO] --- maven-source-plugin:3.0.1:jar-no-fork (default) @ generate-proxies ---
[INFO] Building jar: /builds/workspace/juliac/mojo/tests-conf/generate-proxies/target/generate-proxies-2.8-SNAPSHOT-sources.jar
[INFO]                                                                         
[INFO] ------------------------------------------------------------------------
[INFO] Building Juliac MOJO Conf Tests Graceful Exit 2.8-SNAPSHOT
[INFO] ------------------------------------------------------------------------
[INFO] 
[INFO] --- maven-clean-plugin:2.5:clean (default-clean) @ juliac-mojo-tests-conf-graceful-exit ---
[INFO] 
[INFO] --- maven-enforcer-plugin:1.0-beta-1:enforce (enforce-maven) @ juliac-mojo-tests-conf-graceful-exit ---
[INFO] 
[INFO] --- juliac-maven-plugin:2.8-SNAPSHOT:compile (juliac-compile) @ juliac-mojo-tests-conf-graceful-exit ---
[INFO] 
[INFO] --- maven-resources-plugin:2.7:resources (default-resources) @ juliac-mojo-tests-conf-graceful-exit ---
[INFO] Using 'UTF-8' encoding to copy filtered resources.
[INFO] skip non existing resourceDirectory /builds/workspace/juliac/mojo/tests-conf/graceful-exit/src/main/resources
[INFO] 
[INFO] --- maven-compiler-plugin:3.7.0:compile (default-compile) @ juliac-mojo-tests-conf-graceful-exit ---
[INFO] Nothing to compile - all classes are up to date
[INFO] 
[INFO] --- maven-resources-plugin:2.7:testResources (default-testResources) @ juliac-mojo-tests-conf-graceful-exit ---
[INFO] Using 'UTF-8' encoding to copy filtered resources.
[INFO] skip non existing resourceDirectory /builds/workspace/juliac/mojo/tests-conf/graceful-exit/src/test/resources
[INFO] 
[INFO] --- maven-compiler-plugin:3.7.0:testCompile (default-testCompile) @ juliac-mojo-tests-conf-graceful-exit ---
[INFO] No sources to compile
[INFO] 
[INFO] --- maven-surefire-plugin:2.22.1:test (default-test) @ juliac-mojo-tests-conf-graceful-exit ---
[INFO] No tests to run.
[INFO] 
[INFO] --- maven-jar-plugin:2.4:jar (default-jar) @ juliac-mojo-tests-conf-graceful-exit ---
[INFO] Building jar: /builds/workspace/juliac/mojo/tests-conf/graceful-exit/target/juliac-mojo-tests-conf-graceful-exit-2.8-SNAPSHOT.jar
[INFO] 
[INFO] --- maven-source-plugin:3.0.1:jar-no-fork (default) @ juliac-mojo-tests-conf-graceful-exit ---
[INFO] No sources in project. Archive not created.
[INFO] ------------------------------------------------------------------------
[INFO] Reactor Summary:
[INFO] 
[INFO] Juliac ............................................. SUCCESS [  0.552 s]
[INFO] Juliac API ......................................... SUCCESS [  2.988 s]
[INFO] Juliac Commons ..................................... SUCCESS [  3.577 s]
[INFO] Juliac Runtime Parent .............................. SUCCESS [  0.008 s]
[INFO] Juliac Runtime OO .................................. SUCCESS [  0.363 s]
[INFO] Juliac Core ........................................ SUCCESS [  2.103 s]
[INFO] Juliac Extensions .................................. SUCCESS [  0.018 s]
[INFO] Juliac Adlet ....................................... SUCCESS [  0.024 s]
[INFO] Juliac Adlet API ................................... SUCCESS [  0.275 s]
[INFO] Juliac Adlet Core .................................. SUCCESS [  0.641 s]
[INFO] Juliac Fraclet ..................................... SUCCESS [  0.016 s]
[INFO] Juliac Fraclet Mixins .............................. SUCCESS [  0.293 s]
[INFO] Juliac Adlet Core Service .......................... SUCCESS [  0.052 s]
[INFO] Juliac Modules ..................................... SUCCESS [  0.003 s]
[INFO] Juliac Module Spoon ................................ SUCCESS [  0.005 s]
[INFO] Juliac Spoon Core .................................. SUCCESS [  6.754 s]
[INFO] Juliac Spoon Core Service .......................... SUCCESS [  0.092 s]
[INFO] Juliac Adlet Mixins ................................ SUCCESS [  7.281 s]
[INFO] Juliac Fraclet Runtime ............................. SUCCESS [  0.013 s]
[INFO] Juliac Fraclet Runtime COMP ........................ SUCCESS [  0.123 s]
[INFO] Juliac Adlet Membranes ............................. SUCCESS [  1.354 s]
[INFO] Juliac Julia ....................................... SUCCESS [  0.003 s]
[INFO] Juliac Julia Core .................................. SUCCESS [  1.588 s]
[INFO] Juliac Fraclet Core ................................ SUCCESS [  0.121 s]
[INFO] Juliac Adlet ADL Parent ............................ SUCCESS [  0.003 s]
[INFO] Juliac Adlet ADL Core .............................. SUCCESS [  0.199 s]
[INFO] Juliac Adlet ADL Service ........................... SUCCESS [  0.141 s]
[INFO] Juliac Runtime COMP ................................ SUCCESS [  0.121 s]
[INFO] Juliac Julia Modules ............................... SUCCESS [  0.010 s]
[INFO] Juliac Julia Optimization Level COMP ............... SUCCESS [  0.014 s]
[INFO] Juliac Julia Optimization Level COMP Core .......... SUCCESS [  0.191 s]
[INFO] Juliac Fraclet Modules ............................. SUCCESS [  0.006 s]
[INFO] Juliac Fraclet Opt Level COMP ...................... SUCCESS [  0.015 s]
[INFO] Juliac Fraclet Opt Level COMP Core ................. SUCCESS [  0.159 s]
[INFO] Juliac Adlet Modules ............................... SUCCESS [  0.003 s]
[INFO] Juliac Adlet Opt Level COMP ........................ SUCCESS [  0.007 s]
[INFO] Juliac Adlet Opt Level COMP Core ................... SUCCESS [  0.290 s]
[INFO] Juliac Adlet Opt Level COMP Service ................ SUCCESS [  0.092 s]
[INFO] Juliac Adlet Opt Level COMP Membranes .............. SUCCESS [  2.948 s]
[INFO] Juliac Adlet Opt Level COMP Conformance Tests ...... SUCCESS [  0.004 s]
[INFO] Juliac Adlet Opt Level COMP Tests Mixins ........... SUCCESS [  4.960 s]
[INFO] Juliac Adlet Opt Level COMP Tests Membranes ........ SUCCESS [  2.782 s]
[INFO] Juliac Adlet Opt Level COMP Tests Run .............. SUCCESS [  5.390 s]
[INFO] Juliac Adlet Opt Level MERGE_CTRL .................. SUCCESS [  0.011 s]
[INFO] Juliac Adlet Opt Level MERGE_CTRL Core ............. SUCCESS [  0.258 s]
[INFO] Juliac Spoon Classloader Core ...................... SUCCESS [  2.291 s]
[INFO] Juliac Spoon Classloader Service ................... SUCCESS [  0.041 s]
[INFO] Juliac Julia Module Fractal ADL .................... SUCCESS [  0.004 s]
[INFO] Juliac Julia Fractal ADL Core ...................... SUCCESS [  0.301 s]
[INFO] Juliac Fraclet Opt Level ULTRA_MERGE ............... SUCCESS [  0.005 s]
[INFO] Juliac Fraclet Opt Level ULTRA_MERGE Core .......... SUCCESS [  0.191 s]
[INFO] Juliac Adlet Opt Level ULTRA_MERGE ................. SUCCESS [  0.003 s]
[INFO] Juliac Adlet Opt Level ULTRA_MERGE Core ............ SUCCESS [  0.150 s]
[INFO] Juliac Adlet Opt Level ULTRA_MERGE Service ......... SUCCESS [  0.083 s]
[INFO] Juliac Adlet Opt Level MERGE_CTRL Membranes ........ SUCCESS [ 12.257 s]
[INFO] Juliac Adlet Opt Level MERGE_CTRL Service .......... SUCCESS [  0.118 s]
[INFO] Juliac Adlet Opt Level MERGE_CTRL Conformance Tests  SUCCESS [  0.003 s]
[INFO] Juliac Adlet Opt Level MERGE_CTRL Tests Membranes .. SUCCESS [ 13.384 s]
[INFO] Juliac Adlet Opt Level MERGE_CTRL Tests Run ........ SUCCESS [  4.798 s]
[INFO] Juliac Adlet Examples .............................. SUCCESS [  0.017 s]
[INFO] Juliac Adlet Examples Advanced ..................... SUCCESS [  0.014 s]
[INFO] Juliac Adlet Example Comanche MERGE_CTRL ........... SUCCESS [  5.787 s]
[INFO] Juliac Adlet Example Comanche ULTRA_MERGE .......... SUCCESS [  6.791 s]
[INFO] Juliac Adlet Example HelloWorld ULTRA_MERGE ........ SUCCESS [  3.292 s]
[INFO] Juliac Adlet Example Comanche ...................... SUCCESS [  5.174 s]
[INFO] Juliac Adlet Example HelloWorld .................... SUCCESS [  2.245 s]
[INFO] Juliac Dream ....................................... SUCCESS [  0.003 s]
[INFO] Juliac Dream Interceptor Source Code Generator ..... SUCCESS [  0.066 s]
[INFO] Juliac Dream Pre-mixed Control Membranes ........... SUCCESS [  0.003 s]
[INFO] Juliac Julia Optimization Level OO ................. SUCCESS [  0.002 s]
[INFO] Juliac Julia Optimization Level OO Core ............ SUCCESS [  0.126 s]
[INFO] Juliac Julia Optimization Level OO Service ......... SUCCESS [  0.043 s]
[INFO] Juliac Dream Pre-mixed Control Membranes - OO ...... SUCCESS [  6.098 s]
[INFO] Juliac Julia Optimization Level OO Pre-mixed ....... SUCCESS [  3.631 s]
[INFO] Juliac Dream Examples .............................. SUCCESS [  0.004 s]
[INFO] Juliac Examples Dream Spooned ...................... SUCCESS [  0.003 s]
[INFO] Juliac Julia Fractal ADL Service ................... SUCCESS [  0.064 s]
[INFO] Juliac Dream Example Spooned Cosmos HelloWorld ..... SUCCESS [  2.108 s]
[INFO] Juliac Dream Example Spooned HelloWorld ............ SUCCESS [  0.833 s]
[INFO] Juliac Dream Example Spooned Activity .............. SUCCESS [  0.716 s]
[INFO] Juliac Fraclet Fractal ADL ......................... SUCCESS [  0.108 s]
[INFO] Juliac Fraclet Fractal ADL Service ................. SUCCESS [  0.101 s]
[INFO] Juliac Fraclet Core Service ........................ SUCCESS [  0.068 s]
[INFO] Juliac Fraclet Opt Level COMP Service .............. SUCCESS [  0.038 s]
[INFO] Juliac Fraclet Opt Level COMP Mixed ................ SUCCESS [  4.607 s]
[INFO] Juliac Fraclet Opt Level OO ........................ SUCCESS [  0.005 s]
[INFO] Juliac Fraclet Opt Level OO Core ................... SUCCESS [  0.071 s]
[INFO] Juliac Fraclet Opt Level OO Service ................ SUCCESS [  0.028 s]
[INFO] Juliac Fraclet Opt Level OO Mixed .................. SUCCESS [  3.053 s]
[INFO] Juliac Java Compiler API ........................... SUCCESS [  0.160 s]
[INFO] Juliac Fraclet Opt Level OO Conf Tests ............. SUCCESS [ 10.858 s]
[INFO] Juliac Fraclet Opt Level ULTRA_MERGE Service ....... SUCCESS [  0.066 s]
[INFO] Juliac Fraclet Examples ............................ SUCCESS [  0.004 s]
[INFO] Juliac Fraclet Examples Advanced ................... SUCCESS [  0.003 s]
[INFO] Juliac Fraclet Example Ultra-Merge Comanche ........ SUCCESS [  6.050 s]
[INFO] Juliac Fraclet Example Ultra-Merge HelloWorld ...... SUCCESS [  2.951 s]
[INFO] Juliac Fraclet Example HelloWorld .................. SUCCESS [  2.115 s]
[INFO] Juliac Julia Optimization Level COMP Service ....... SUCCESS [  0.041 s]
[INFO] Juliac Julia Optimization Level COMP Pre-mixed ..... SUCCESS [  3.801 s]
[INFO] Juliac Julia Optimization Level COMP Conf Tests .... SUCCESS [ 11.431 s]
[INFO] Juliac Julia Optimization Level MERGE_ALL .......... SUCCESS [  0.016 s]
[INFO] Juliac Julia Optimization Level MERGE_ALL Core ..... SUCCESS [  0.295 s]
[INFO] Juliac Julia Optimization Level MERGE_ALL Conf Tests SUCCESS [ 14.551 s]
[INFO] Juliac Julia Optimization Level OO Conf Tests ...... SUCCESS [  9.245 s]
[INFO] Juliac Examples .................................... SUCCESS [  0.014 s]
[INFO] Juliac Example HelloWorld .......................... SUCCESS [  2.021 s]
[INFO] Juliac Example Comanche ............................ SUCCESS [  4.657 s]
[INFO] Juliac Example HelloWorld With Custom COMP Membrane  SUCCESS [  4.401 s]
[INFO] Juliac Examples Advanced ........................... SUCCESS [  0.003 s]
[INFO] Juliac Example Foobar Cases ........................ SUCCESS [  0.001 s]
[INFO] Juliac Example Proxy Parameters .................... SUCCESS [  2.459 s]
[INFO] Juliac Example HelloWorld Binary ................... SUCCESS [  0.015 s]
[INFO] Juliac Example HelloWorld Binary - Business Code ... SUCCESS [  0.091 s]
[INFO] Juliac Example HelloWorld Binary - Assembly ........ SUCCESS [  1.762 s]
[INFO] Juliac Example Large Component Assembly ............ SUCCESS [  3.861 s]
[INFO] Juliac Example HelloWorld With Different Opt Levels  SUCCESS [  3.738 s]
[INFO] Juliac OSA ......................................... SUCCESS [  0.010 s]
[INFO] Juliac OSA Runtime ................................. SUCCESS [  0.527 s]
[INFO] Juliac OSA ADL ..................................... SUCCESS [  0.360 s]
[INFO] Juliac OSA Membranes ............................... SUCCESS [  4.587 s]
[INFO] Juliac OSA Examples ................................ SUCCESS [  0.005 s]
[INFO] Juliac OSA Example Models .......................... SUCCESS [  1.715 s]
[INFO] Juliac OSA Example Experiences ..................... SUCCESS [  0.915 s]
[INFO] Juliac OSGi ........................................ SUCCESS [  0.004 s]
[INFO] Juliac OSGi Bootstrap .............................. SUCCESS [  0.085 s]
[INFO] Juliac OSGi Bundles ................................ SUCCESS [  0.003 s]
[INFO] Juliac OSGi Bundle Juliac Runtime OO ............... SUCCESS [  2.651 s]
[INFO] Juliac OSGi Revisions Helpers Parent ............... SUCCESS [  0.015 s]
[INFO] Juliac OSGi Revision Api ........................... SUCCESS [  0.190 s]
[INFO] Juliac OSGi R4 Helpers ............................. SUCCESS [  0.502 s]
[INFO] Juliac OSGi Runtime ................................ SUCCESS [  0.003 s]
[INFO] Juliac OSGi Runtime Core ........................... SUCCESS [  1.458 s]
[INFO] Juliac OSGi R3 Helpers ............................. SUCCESS [  0.227 s]
[INFO] Juliac OSGi Runtime Equinox ........................ SUCCESS [  0.214 s]
[INFO] Juliac OSGi Runtime Felix .......................... SUCCESS [  0.205 s]
[INFO] Juliac OSGi Runtime Knopflerfish ................... SUCCESS [  0.113 s]
[INFO] Juliac OSGi Runtime JBoss .......................... SUCCESS [  1.149 s]
[INFO] Juliac OSGi Mixins ................................. SUCCESS [  0.111 s]
[INFO] Juliac OSGi ADL Parser ............................. SUCCESS [  0.172 s]
[INFO] Juliac OSGi ADL Parser Service ..................... SUCCESS [  0.062 s]
[INFO] Juliac OSGi Modules ................................ SUCCESS [  0.002 s]
[INFO] Juliac OSGi Optimization Level OO .................. SUCCESS [  0.002 s]
[INFO] Juliac OSGi Optimization Level OO Core ............. SUCCESS [  0.266 s]
[INFO] Juliac OSGi Optimization Level OO Service .......... SUCCESS [  0.267 s]
[INFO] Juliac OSGi Optimization Level OO Mixed ............ SUCCESS [  2.491 s]
[INFO] Juliac OSGi Examples ............................... SUCCESS [  0.003 s]
[INFO] Juliac OSGi Example HelloWorld ..................... SUCCESS [  0.002 s]
[INFO] Juliac OSGi Example HelloWorld - Interfaces ........ SUCCESS [  0.512 s]
[INFO] Juliac OSGi Example HelloWorld - Client ............ SUCCESS [  4.706 s]
[INFO] Juliac OSGi Example HelloWorld - Server ............ SUCCESS [  0.397 s]
[INFO] Juliac OSGi Felix Example HelloWorld - Assembly .... SUCCESS [  0.751 s]
[INFO] Juliac Scala ....................................... SUCCESS [  0.011 s]
[INFO] Juliac Scala Mixins ................................ SUCCESS [  7.083 s]
[INFO] Juliac Scala Conformance Tests ..................... SUCCESS [  6.784 s]
[INFO] Juliac Scala Examples .............................. SUCCESS [  0.013 s]
[INFO] Juliac Scala Example HelloWorld .................... SUCCESS [  6.617 s]
[INFO] Tinfi .............................................. SUCCESS [  0.010 s]
[INFO] Tinfi Runtime Parent ............................... SUCCESS [  0.014 s]
[INFO] Tinfi Runtime API .................................. SUCCESS [  0.152 s]
[INFO] Tinfi Runtime OO ................................... SUCCESS [  1.793 s]
[INFO] Tinfi Mixin Layers ................................. SUCCESS [  0.354 s]
[INFO] Tinfi Modules ...................................... SUCCESS [  0.005 s]
[INFO] Tinfi Opt Level OO ................................. SUCCESS [  0.007 s]
[INFO] Tinfi Opt Level OO Core ............................ SUCCESS [  1.323 s]
[INFO] Tinfi ADL Parser SCA ............................... SUCCESS [  0.005 s]
[INFO] Tinfi ADL Parser SCA Core .......................... SUCCESS [  3.027 s]
[INFO] Tinfi ADL Parser SCA Service ....................... SUCCESS [  0.126 s]
[INFO] Tinfi ADL Parser SCA OSGi .......................... SUCCESS [  0.006 s]
[INFO] Tinfi ADL Parser SCA OSGi Core ..................... SUCCESS [  0.277 s]
[INFO] Tinfi ADL Parser SCA OSGi Service .................. SUCCESS [  0.072 s]
[INFO] Tinfi ADL Parser Tinfilet .......................... SUCCESS [  0.003 s]
[INFO] Tinfi ADL Parser Tinfilet Core ..................... SUCCESS [  0.172 s]
[INFO] Tinfi ADL Parser Tinfilet Service .................. SUCCESS [  0.274 s]
[INFO] Tinfi Runtime COMP ................................. SUCCESS [  0.132 s]
[INFO] Tinfi Opt Level COMP ............................... SUCCESS [  0.004 s]
[INFO] Tinfi Opt Level COMP Mixins ........................ SUCCESS [  9.573 s]
[INFO] Tinfi Opt Level COMP Core .......................... SUCCESS [  0.317 s]
[INFO] Tinfi Opt Level COMP Service ....................... SUCCESS [  0.105 s]
[INFO] Tinfi Opt Level COMP Conf Tests .................... FAILURE [  9.675 s]
[INFO] Tinfi Opt Level OO Service ......................... SUCCESS [  0.156 s]
[INFO] Tinfi Opt Level OO Pre-mixed ....................... SUCCESS [  6.804 s]
[INFO] Tinfi Opt Level OO Pre-mixed Embedded .............. SUCCESS [  5.874 s]
[INFO] Tinfi Opt Level OO Conf Tests Fraclet .............. SUCCESS [ 14.185 s]
[INFO] Tinfi Opt Level OO Conf Tests OASIS SCA 1.1 ........ SUCCESS [ 11.688 s]
[INFO] Tinfi Opt Level OO Conf Tests OSOA SCA 1.0 ......... SUCCESS [ 14.312 s]
[INFO] Tinfi Opt Level OO Light ........................... SUCCESS [  0.035 s]
[INFO] Tinfi Opt Level OO Light Core ...................... SUCCESS [  0.264 s]
[INFO] Tinfi Opt Level OO Light Service ................... SUCCESS [  0.054 s]
[INFO] Tinfi Opt Level OO Light Conf Tests ................ SUCCESS [  9.441 s]
[INFO] Tinfi Opt Level OO OSGi ............................ SUCCESS [  0.005 s]
[INFO] Tinfi Opt Level OO OSGi Core ....................... SUCCESS [  0.208 s]
[INFO] Tinfi Opt Level OO OSGi Service .................... SUCCESS [  0.042 s]
[INFO] Tinfi Opt Level OO OSGi Pre-mixed .................. SUCCESS [  4.536 s]
[INFO] Tinfi Opt Level ULTRA_MERGE Parent ................. SUCCESS [  0.011 s]
[INFO] Tinfi Opt Level ULTRA_MERGE Core ................... SUCCESS [  0.369 s]
[INFO] Tinfi Opt Level ULTRA_MERGE Service ................ SUCCESS [  0.058 s]
[INFO] Tinfi Examples ..................................... SUCCESS [  0.022 s]
[INFO] Tinfi Example HelloWorld ........................... SUCCESS [  1.155 s]
[INFO] Tinfi Example FooBar Cases ......................... SUCCESS [  0.006 s]
[INFO] Tinfi Example Property of Type Class ............... SUCCESS [  2.150 s]
[INFO] Tinfi Example Proxy Parameters ..................... SUCCESS [  0.711 s]
[INFO] Tinfi Example HelloWorld Binary .................... SUCCESS [  0.019 s]
[INFO] Tinfi Example HelloWorld Binary - Business ......... SUCCESS [  0.148 s]
[INFO] Tinfi Example HelloWorld Binary - Assembly ......... SUCCESS [  2.175 s]
[INFO] Tinfi Example HelloWorld COMP Mode ................. SUCCESS [ 11.350 s]
[INFO] Tinfi Example HelloWorld Composite ................. SUCCESS [  2.607 s]
[INFO] Tinfi Example HelloWorld Fraclet ................... SUCCESS [  0.763 s]
[INFO] Tinfi Example HelloWorld JDK 1.3 ................... SUCCESS [  1.259 s]
[INFO] Tinfi Example HelloWorld Light ..................... SUCCESS [  7.226 s]
[INFO] Tinfi Examples Advanced ............................ SUCCESS [  0.006 s]
[INFO] Tinfi Example HelloWorld OSGi ...................... SUCCESS [  0.009 s]
[INFO] Tinfi Example HelloWorld OSGi - Interfaces ......... SUCCESS [  0.355 s]
[INFO] Tinfi Example HelloWorld OSGi - Client ............. SUCCESS [  0.480 s]
[INFO] Tinfi Example HelloWorld OSGi - Server ............. SUCCESS [  0.098 s]
[INFO] Tinfi Example HelloWorld OSGi - Assembly ........... SUCCESS [  0.942 s]
[INFO] Tinfi Example HelloWorld POJO ...................... SUCCESS [  2.019 s]
[INFO] Tinfi Example HelloWorld Tinfilet .................. SUCCESS [  7.903 s]
[INFO] Tinfi Example HelloWorld With Intent ............... SUCCESS [  1.990 s]
[INFO] Tinfi Example HelloWorld Ultra-Merge ............... SUCCESS [  3.647 s]
[INFO] Juliac MOJO Parent ................................. SUCCESS [  0.015 s]
[INFO] Juliac MOJO Maven 2 ................................ SUCCESS [  1.375 s]
[INFO] Juliac MOJO Conf Tests ............................. SUCCESS [  0.028 s]
[INFO] Juliac MOJO Conf Tests Add Classpath Elements ...... SUCCESS [  4.069 s]
[INFO] Juliac MOJO Conf Tests Generate Proxies ............ SUCCESS [  0.269 s]
[INFO] Juliac MOJO Conf Tests Graceful Exit ............... SUCCESS [  0.075 s]
[INFO] ------------------------------------------------------------------------
[INFO] BUILD FAILURE
[INFO] ------------------------------------------------------------------------
[INFO] Total time: 06:46 min
[INFO] Finished at: 2020-03-29T18:16:58+02:00
[INFO] Final Memory: 275M/500M
[INFO] ------------------------------------------------------------------------
[ERROR] Failed to execute goal org.apache.maven.plugins:maven-surefire-plugin:2.22.1:test (default-test) on project frascati-tinfi-tests-comp: There are test failures.
[ERROR] 
[ERROR] Please refer to /builds/workspace/juliac/extension/tinfi/module/opt-comp/tests-conf/target/surefire-reports for the individual test results.
[ERROR] Please refer to dump files (if any exist) [date].dump, [date]-jvmRun[N].dump and [date].dumpstream.
[ERROR] -> [Help 1]
org.apache.maven.lifecycle.LifecycleExecutionException: Failed to execute goal org.apache.maven.plugins:maven-surefire-plugin:2.22.1:test (default-test) on project frascati-tinfi-tests-comp: There are test failures.

Please refer to /builds/workspace/juliac/extension/tinfi/module/opt-comp/tests-conf/target/surefire-reports for the individual test results.
Please refer to dump files (if any exist) [date].dump, [date]-jvmRun[N].dump and [date].dumpstream.
	at org.apache.maven.lifecycle.internal.MojoExecutor.execute(MojoExecutor.java:212)
	at org.apache.maven.lifecycle.internal.MojoExecutor.execute(MojoExecutor.java:153)
	at org.apache.maven.lifecycle.internal.MojoExecutor.execute(MojoExecutor.java:145)
	at org.apache.maven.lifecycle.internal.LifecycleModuleBuilder.buildProject(LifecycleModuleBuilder.java:116)
	at org.apache.maven.lifecycle.internal.LifecycleModuleBuilder.buildProject(LifecycleModuleBuilder.java:80)
	at org.apache.maven.lifecycle.internal.builder.singlethreaded.SingleThreadedBuilder.build(SingleThreadedBuilder.java:51)
	at org.apache.maven.lifecycle.internal.LifecycleStarter.execute(LifecycleStarter.java:128)
	at org.apache.maven.DefaultMaven.doExecute(DefaultMaven.java:307)
	at org.apache.maven.DefaultMaven.doExecute(DefaultMaven.java:193)
	at org.apache.maven.DefaultMaven.execute(DefaultMaven.java:106)
	at org.apache.maven.cli.MavenCli.execute(MavenCli.java:863)
	at org.apache.maven.cli.MavenCli.doMain(MavenCli.java:288)
	at org.apache.maven.cli.MavenCli.main(MavenCli.java:199)
	at java.base/jdk.internal.reflect.NativeMethodAccessorImpl.invoke0(Native Method)
	at java.base/jdk.internal.reflect.NativeMethodAccessorImpl.invoke(NativeMethodAccessorImpl.java:62)
	at java.base/jdk.internal.reflect.DelegatingMethodAccessorImpl.invoke(DelegatingMethodAccessorImpl.java:43)
	at java.base/java.lang.reflect.Method.invoke(Method.java:564)
	at org.codehaus.plexus.classworlds.launcher.Launcher.launchEnhanced(Launcher.java:289)
	at org.codehaus.plexus.classworlds.launcher.Launcher.launch(Launcher.java:229)
	at org.codehaus.plexus.classworlds.launcher.Launcher.mainWithExitCode(Launcher.java:415)
	at org.codehaus.plexus.classworlds.launcher.Launcher.main(Launcher.java:356)
Caused by: org.apache.maven.plugin.MojoFailureException: There are test failures.

Please refer to /builds/workspace/juliac/extension/tinfi/module/opt-comp/tests-conf/target/surefire-reports for the individual test results.
Please refer to dump files (if any exist) [date].dump, [date]-jvmRun[N].dump and [date].dumpstream.
	at org.apache.maven.plugin.surefire.SurefireHelper.throwException(SurefireHelper.java:289)
	at org.apache.maven.plugin.surefire.SurefireHelper.reportExecution(SurefireHelper.java:161)
	at org.apache.maven.plugin.surefire.SurefirePlugin.handleSummary(SurefirePlugin.java:364)
	at org.apache.maven.plugin.surefire.AbstractSurefireMojo.executeAfterPreconditionsChecked(AbstractSurefireMojo.java:1041)
	at org.apache.maven.plugin.surefire.AbstractSurefireMojo.execute(AbstractSurefireMojo.java:857)
	at org.apache.maven.plugin.DefaultBuildPluginManager.executeMojo(DefaultBuildPluginManager.java:134)
	at org.apache.maven.lifecycle.internal.MojoExecutor.execute(MojoExecutor.java:207)
	... 20 more
[ERROR] 
[ERROR] Re-run Maven using the -X switch to enable full debug logging.
[ERROR] 
[ERROR] For more information about the errors and possible solutions, please read the following articles:
[ERROR] [Help 1] http://cwiki.apache.org/confluence/display/MAVEN/MojoFailureException
[ERROR] 
[ERROR] After correcting the problems, you can resume the build with the command
[ERROR]   mvn <goals> -rf :frascati-tinfi-tests-comp
Build step 'Execute shell' marked build as failure
Sending e-mails to: spoon-devel@lists.gforge.inria.fr
Finished: FAILURE