FailedConsole Output

Started by timer
Running as SYSTEM
[EnvInject] - Loading node environment variables.
Building remotely on sos-builder01 (lin) in workspace /builds/workspace/nopol
[WS-CLEANUP] Deleting project workspace...
[WS-CLEANUP] Deferred wipeout is used...
No credentials specified
Cloning the remote Git repository
Cloning repository https://github.com/SpoonLabs/nopol.git
 > git init /builds/workspace/nopol # timeout=10
Fetching upstream changes from https://github.com/SpoonLabs/nopol.git
 > git --version # timeout=10
 > git fetch --tags --progress https://github.com/SpoonLabs/nopol.git +refs/heads/*:refs/remotes/origin/*
 > git config remote.origin.url https://github.com/SpoonLabs/nopol.git # timeout=10
 > git config --add remote.origin.fetch +refs/heads/*:refs/remotes/origin/* # timeout=10
 > git config remote.origin.url https://github.com/SpoonLabs/nopol.git # timeout=10
Fetching upstream changes from https://github.com/SpoonLabs/nopol.git
 > git fetch --tags --progress https://github.com/SpoonLabs/nopol.git +refs/heads/*:refs/remotes/origin/*
 > git rev-parse refs/remotes/origin/master^{commit} # timeout=10
 > git rev-parse refs/remotes/origin/origin/master^{commit} # timeout=10
Checking out Revision 162f357b83468a4fd33a7d922beedf2f61f6013c (refs/remotes/origin/master)
 > git config core.sparsecheckout # timeout=10
 > git checkout -f 162f357b83468a4fd33a7d922beedf2f61f6013c
Commit message: "Update README.md"
 > git rev-list --no-walk 162f357b83468a4fd33a7d922beedf2f61f6013c # timeout=10
[nopol] $ /bin/sh -xe /tmp/jenkins8677751230865128732.sh
+ rm -rf /builds/.m2/repository/fr/inria/gforge/spoon
[nopol] $ /bin/sh -xe /tmp/jenkins3519195240301105699.sh
+ cd test-projects
+ mvn test -DskipTests
Picked up JAVA_TOOL_OPTIONS: -Dfile.encoding=UTF8
[INFO] Scanning for projects...
[INFO]                                                                         
[INFO] ------------------------------------------------------------------------
[INFO] Building test-projects 0.0.1-SNAPSHOT
[INFO] ------------------------------------------------------------------------
[INFO] 
[INFO] --- maven-resources-plugin:2.6:resources (default-resources) @ test-projects ---
[WARNING] Using platform encoding (UTF8 actually) to copy filtered resources, i.e. build is platform dependent!
[INFO] skip non existing resourceDirectory /builds/workspace/nopol/test-projects/src/main/resources
[INFO] 
[INFO] --- maven-compiler-plugin:3.2:compile (default-compile) @ test-projects ---
[INFO] Changes detected - recompiling the module!
[WARNING] File encoding has not been set, using platform encoding UTF8, i.e. build is platform dependent!
[INFO] Compiling 28 source files to /builds/workspace/nopol/test-projects/target/classes
[INFO] 
[INFO] --- maven-resources-plugin:2.6:testResources (default-testResources) @ test-projects ---
[WARNING] Using platform encoding (UTF8 actually) to copy filtered resources, i.e. build is platform dependent!
[INFO] skip non existing resourceDirectory /builds/workspace/nopol/test-projects/src/test/resources
[INFO] 
[INFO] --- maven-compiler-plugin:3.2:testCompile (default-testCompile) @ test-projects ---
[INFO] Changes detected - recompiling the module!
[WARNING] File encoding has not been set, using platform encoding UTF8, i.e. build is platform dependent!
[INFO] Compiling 28 source files to /builds/workspace/nopol/test-projects/target/test-classes
[INFO] 
[INFO] --- maven-surefire-plugin:2.17:test (default-test) @ test-projects ---
[INFO] Tests are skipped.
[INFO] ------------------------------------------------------------------------
[INFO] BUILD SUCCESS
[INFO] ------------------------------------------------------------------------
[INFO] Total time: 4.234 s
[INFO] Finished at: 2020-02-11T10:38:34+01:00
[INFO] Final Memory: 15M/120M
[INFO] ------------------------------------------------------------------------
+ cd ../nopol
+ mvn versions:use-latest-versions -DallowSnapshots=true
Picked up JAVA_TOOL_OPTIONS: -Dfile.encoding=UTF8
[INFO] Scanning for projects...
[WARNING] 
[WARNING] Some problems were encountered while building the effective model for fr.inria.gforge.spirals:nopol:jar:0.2-SNAPSHOT
[WARNING] 'build.pluginManagement.plugins.plugin.(groupId:artifactId)' must be unique but found duplicate declaration of plugin org.apache.maven.plugins:maven-compiler-plugin @ line 344, column 25
[WARNING] 'build.pluginManagement.plugins.plugin.(groupId:artifactId)' must be unique but found duplicate declaration of plugin org.apache.maven.plugins:maven-install-plugin @ line 352, column 25
[WARNING] 'build.pluginManagement.plugins.plugin.(groupId:artifactId)' must be unique but found duplicate declaration of plugin org.apache.maven.plugins:maven-clean-plugin @ line 360, column 25
[WARNING] 'repositories.repository.id' must not contain any of these characters \/:"<>|?* but found / @ line 407, column 17
[WARNING] 
[WARNING] It is highly recommended to fix these problems because they threaten the stability of your build.
[WARNING] 
[WARNING] For this reason, future Maven versions might no longer support building such malformed projects.
[WARNING] 
[INFO]                                                                         
[INFO] ------------------------------------------------------------------------
[INFO] Building Nopol 0.2-SNAPSHOT
[INFO] ------------------------------------------------------------------------
[INFO] 
[INFO] --- versions-maven-plugin:2.4:use-latest-versions (default-cli) @ nopol ---
[INFO] Major version changes allowed
[INFO] artifact com.google.guava:guava: checking for updates from sachaproject.gforge.inria.fr-release
[INFO] artifact com.google.guava:guava: checking for updates from gforge.inria.fr-snapshot
[INFO] artifact com.google.guava:guava: checking for updates from tdurieux.github.io/maven-repository/snapshots/
[INFO] artifact com.google.guava:guava: checking for updates from central
[INFO] Updated com.google.guava:guava:jar:15.0 to version 28.2-jre
[INFO] artifact org.slf4j:slf4j-api: checking for updates from sachaproject.gforge.inria.fr-release
[INFO] artifact org.slf4j:slf4j-api: checking for updates from gforge.inria.fr-snapshot
[INFO] artifact org.slf4j:slf4j-api: checking for updates from tdurieux.github.io/maven-repository/snapshots/
[INFO] artifact org.slf4j:slf4j-api: checking for updates from central
[INFO] Updated org.slf4j:slf4j-api:jar:${slf4j.version} to version 2.0.0-alpha1
[INFO] artifact org.slf4j:jul-to-slf4j: checking for updates from sachaproject.gforge.inria.fr-release
[INFO] artifact org.slf4j:jul-to-slf4j: checking for updates from gforge.inria.fr-snapshot
[INFO] artifact org.slf4j:jul-to-slf4j: checking for updates from tdurieux.github.io/maven-repository/snapshots/
[INFO] artifact org.slf4j:jul-to-slf4j: checking for updates from central
[INFO] Updated org.slf4j:jul-to-slf4j:jar:${slf4j.version} to version 2.0.0-alpha1
[INFO] Major version changes allowed
[INFO] artifact junit:junit: checking for updates from sachaproject.gforge.inria.fr-release
[INFO] artifact junit:junit: checking for updates from tdurieux.github.io/maven-repository/snapshots/
[INFO] Updated junit:junit:jar:4.11 to version 4.13
[INFO] artifact org.reflections:reflections: checking for updates from sachaproject.gforge.inria.fr-release
[INFO] artifact org.reflections:reflections: checking for updates from gforge.inria.fr-snapshot
[INFO] artifact org.reflections:reflections: checking for updates from tdurieux.github.io/maven-repository/snapshots/
[INFO] artifact org.reflections:reflections: checking for updates from central
[INFO] Updated org.reflections:reflections:jar:0.9.9-RC1 to version 0.9.12
[INFO] artifact ch.qos.logback:logback-classic: checking for updates from sachaproject.gforge.inria.fr-release
[INFO] artifact ch.qos.logback:logback-classic: checking for updates from gforge.inria.fr-snapshot
[INFO] artifact ch.qos.logback:logback-classic: checking for updates from tdurieux.github.io/maven-repository/snapshots/
[INFO] artifact ch.qos.logback:logback-classic: checking for updates from central
[INFO] Updated ch.qos.logback:logback-classic:jar:1.0.13 to version 1.3.0-alpha5
[INFO] artifact com.google.code.findbugs:jsr305: checking for updates from sachaproject.gforge.inria.fr-release
[INFO] artifact com.google.code.findbugs:jsr305: checking for updates from gforge.inria.fr-snapshot
[INFO] artifact com.google.code.findbugs:jsr305: checking for updates from tdurieux.github.io/maven-repository/snapshots/
[INFO] artifact com.google.code.findbugs:jsr305: checking for updates from central
[INFO] Updated com.google.code.findbugs:jsr305:jar:2.0.1 to version 3.0.2
[INFO] artifact org.hamcrest:hamcrest-core: checking for updates from sachaproject.gforge.inria.fr-release
[INFO] artifact org.hamcrest:hamcrest-core: checking for updates from tdurieux.github.io/maven-repository/snapshots/
[INFO] Updated org.hamcrest:hamcrest-core:jar:1.3 to version 2.2
[INFO] artifact gov.nasa.jpf:jpf: checking for updates from sachaproject.gforge.inria.fr-release
[INFO] artifact gov.nasa.jpf:jpf: checking for updates from gforge.inria.fr-snapshot
[INFO] artifact gov.nasa.jpf:jpf: checking for updates from tdurieux.github.io/maven-repository/snapshots/
[INFO] artifact gov.nasa.jpf:jpf: checking for updates from central
[INFO] artifact gov.nasa.jpf:jpf-symbc: checking for updates from sachaproject.gforge.inria.fr-release
[INFO] artifact gov.nasa.jpf:jpf-symbc: checking for updates from gforge.inria.fr-snapshot
[INFO] artifact gov.nasa.jpf:jpf-symbc: checking for updates from tdurieux.github.io/maven-repository/snapshots/
[INFO] artifact gov.nasa.jpf:jpf-symbc: checking for updates from central
[INFO] artifact com.microsoft.z3:z3: checking for updates from sachaproject.gforge.inria.fr-release
[INFO] artifact com.microsoft.z3:z3: checking for updates from gforge.inria.fr-snapshot
[INFO] artifact com.microsoft.z3:z3: checking for updates from tdurieux.github.io/maven-repository/snapshots/
[INFO] artifact com.microsoft.z3:z3: checking for updates from central
[INFO] artifact fr.inria.gforge.spoon:spoon-core: checking for updates from sachaproject.gforge.inria.fr-release
[INFO] artifact fr.inria.gforge.spoon:spoon-core: checking for updates from gforge.inria.fr-snapshot
[INFO] artifact fr.inria.gforge.spoon:spoon-core: checking for updates from tdurieux.github.io/maven-repository/snapshots/
[INFO] Updated fr.inria.gforge.spoon:spoon-core:jar:7.5.0-SNAPSHOT to version 8.1.0-SNAPSHOT
[INFO] artifact org.smtlib:smtlib: checking for updates from sachaproject.gforge.inria.fr-release
[INFO] artifact org.smtlib:smtlib: checking for updates from gforge.inria.fr-snapshot
[INFO] artifact org.smtlib:smtlib: checking for updates from tdurieux.github.io/maven-repository/snapshots/
[INFO] artifact org.smtlib:smtlib: checking for updates from central
[INFO] artifact com.sun:tools: checking for updates from sachaproject.gforge.inria.fr-release
[INFO] artifact com.sun:tools: checking for updates from gforge.inria.fr-snapshot
[INFO] artifact com.sun:tools: checking for updates from tdurieux.github.io/maven-repository/snapshots/
[INFO] artifact com.sun:tools: checking for updates from central
[INFO] artifact com.gzoltar:gzoltar: checking for updates from sachaproject.gforge.inria.fr-release
[INFO] artifact com.gzoltar:gzoltar: checking for updates from gforge.inria.fr-snapshot
[INFO] artifact com.gzoltar:gzoltar: checking for updates from tdurieux.github.io/maven-repository/snapshots/
[INFO] artifact com.gzoltar:gzoltar: checking for updates from central
[INFO] artifact commons-cli:commons-cli: checking for updates from sachaproject.gforge.inria.fr-release
[INFO] artifact commons-cli:commons-cli: checking for updates from gforge.inria.fr-snapshot
[INFO] artifact commons-cli:commons-cli: checking for updates from tdurieux.github.io/maven-repository/snapshots/
[INFO] Updated commons-cli:commons-cli:jar:1.3 to version 1.4
[INFO] artifact fil.iagl.cocospoon:CocoSpoon: checking for updates from sachaproject.gforge.inria.fr-release
[INFO] artifact fil.iagl.cocospoon:CocoSpoon: checking for updates from gforge.inria.fr-snapshot
[INFO] artifact fil.iagl.cocospoon:CocoSpoon: checking for updates from tdurieux.github.io/maven-repository/snapshots/
[INFO] artifact com.cloudbees:diff4j: checking for updates from sachaproject.gforge.inria.fr-release
[INFO] artifact com.cloudbees:diff4j: checking for updates from tdurieux.github.io/maven-repository/snapshots/
[INFO] Updated com.cloudbees:diff4j:jar:1.2 to version 1.3
[INFO] artifact org.json:json: checking for updates from sachaproject.gforge.inria.fr-release
[INFO] artifact org.json:json: checking for updates from tdurieux.github.io/maven-repository/snapshots/
[INFO] Updated org.json:json:jar:20160810 to version 20190722
[INFO] ------------------------------------------------------------------------
[INFO] BUILD SUCCESS
[INFO] ------------------------------------------------------------------------
[INFO] Total time: 12.769 s
[INFO] Finished at: 2020-02-11T10:38:50+01:00
[INFO] Final Memory: 21M/182M
[INFO] ------------------------------------------------------------------------
+ mvn -U dependency:resolve
Picked up JAVA_TOOL_OPTIONS: -Dfile.encoding=UTF8
[INFO] Scanning for projects...
[WARNING] 
[WARNING] Some problems were encountered while building the effective model for fr.inria.gforge.spirals:nopol:jar:0.2-SNAPSHOT
[WARNING] 'build.pluginManagement.plugins.plugin.(groupId:artifactId)' must be unique but found duplicate declaration of plugin org.apache.maven.plugins:maven-compiler-plugin @ line 344, column 25
[WARNING] 'build.pluginManagement.plugins.plugin.(groupId:artifactId)' must be unique but found duplicate declaration of plugin org.apache.maven.plugins:maven-install-plugin @ line 352, column 25
[WARNING] 'build.pluginManagement.plugins.plugin.(groupId:artifactId)' must be unique but found duplicate declaration of plugin org.apache.maven.plugins:maven-clean-plugin @ line 360, column 25
[WARNING] 'repositories.repository.id' must not contain any of these characters \/:"<>|?* but found / @ line 407, column 17
[WARNING] 
[WARNING] It is highly recommended to fix these problems because they threaten the stability of your build.
[WARNING] 
[WARNING] For this reason, future Maven versions might no longer support building such malformed projects.
[WARNING] 
[INFO]                                                                         
[INFO] ------------------------------------------------------------------------
[INFO] Building Nopol 0.2-SNAPSHOT
[INFO] ------------------------------------------------------------------------
Downloading: http://sachaproject.gforge.inria.fr/repositories/releases/fr/inria/gforge/spoon/spoon-core/8.1.0-SNAPSHOT/maven-metadata.xml
Downloading: http://maven.inria.fr/artifactory/spoon-public-snapshot/fr/inria/gforge/spoon/spoon-core/8.1.0-SNAPSHOT/maven-metadata.xml
Downloading: https://tdurieux.github.io/maven-repository/snapshots/fr/inria/gforge/spoon/spoon-core/8.1.0-SNAPSHOT/maven-metadata.xml
[WARNING] Could not apply configuration for gforge.inria.fr-snapshot to wagon org.apache.maven.wagon.providers.http.HttpWagon:Cannot find 'preferredAuthentications' in class org.apache.maven.wagon.providers.http.HttpWagon

1017/1017 B   
              
Downloaded: http://maven.inria.fr/artifactory/spoon-public-snapshot/fr/inria/gforge/spoon/spoon-core/8.1.0-SNAPSHOT/maven-metadata.xml (1017 B at 2.5 KB/sec)
              
Downloading: http://sachaproject.gforge.inria.fr/repositories/releases/fr/inria/gforge/spoon/spoon-core/8.1.0-SNAPSHOT/spoon-core-8.1.0-20200211.093604-122.pom
              
Downloading: http://maven.inria.fr/artifactory/spoon-public-snapshot/fr/inria/gforge/spoon/spoon-core/8.1.0-SNAPSHOT/spoon-core-8.1.0-20200211.093604-122.pom
[WARNING] Could not apply configuration for gforge.inria.fr-snapshot to wagon org.apache.maven.wagon.providers.http.HttpWagon:Cannot find 'preferredAuthentications' in class org.apache.maven.wagon.providers.http.HttpWagon
4/8 KB        
8/8 KB   
8/8 KB   
         
Downloaded: http://maven.inria.fr/artifactory/spoon-public-snapshot/fr/inria/gforge/spoon/spoon-core/8.1.0-SNAPSHOT/spoon-core-8.1.0-20200211.093604-122.pom (8 KB at 197.8 KB/sec)
Downloading: http://sachaproject.gforge.inria.fr/repositories/releases/fr/inria/gforge/spoon/spoon-pom/1.0/spoon-pom-1.0.pom
         
Downloading: http://maven.inria.fr/artifactory/spoon-public-snapshot/fr/inria/gforge/spoon/spoon-pom/1.0/spoon-pom-1.0.pom
[WARNING] Could not apply configuration for gforge.inria.fr-snapshot to wagon org.apache.maven.wagon.providers.http.HttpWagon:Cannot find 'preferredAuthentications' in class org.apache.maven.wagon.providers.http.HttpWagon
         
Downloading: https://tdurieux.github.io/maven-repository/snapshots/fr/inria/gforge/spoon/spoon-pom/1.0/spoon-pom-1.0.pom
         
Downloading: https://repo.maven.apache.org/maven2/fr/inria/gforge/spoon/spoon-pom/1.0/spoon-pom-1.0.pom
2/21 KB   
3/21 KB   
5/21 KB   
6/21 KB   
7/21 KB   
9/21 KB   
10/21 KB   
11/21 KB   
13/21 KB   
14/21 KB   
15/21 KB   
17/21 KB   
18/21 KB   
19/21 KB   
21/21 KB   
21/21 KB   
           
Downloaded: https://repo.maven.apache.org/maven2/fr/inria/gforge/spoon/spoon-pom/1.0/spoon-pom-1.0.pom (21 KB at 64.3 KB/sec)
Downloading: http://maven.inria.fr/artifactory/spoon-public-snapshot/fil/iagl/cocospoon/CocoSpoon/1.0.0-SNAPSHOT/maven-metadata.xml
Downloading: http://sachaproject.gforge.inria.fr/repositories/releases/fil/iagl/cocospoon/CocoSpoon/1.0.0-SNAPSHOT/maven-metadata.xml
Downloading: https://tdurieux.github.io/maven-repository/snapshots/fil/iagl/cocospoon/CocoSpoon/1.0.0-SNAPSHOT/maven-metadata.xml
[WARNING] Could not apply configuration for gforge.inria.fr-snapshot to wagon org.apache.maven.wagon.providers.http.HttpWagon:Cannot find 'preferredAuthentications' in class org.apache.maven.wagon.providers.http.HttpWagon
           
           
1005 B     
         
Downloaded: https://tdurieux.github.io/maven-repository/snapshots/fil/iagl/cocospoon/CocoSpoon/1.0.0-SNAPSHOT/maven-metadata.xml (1005 B at 1.9 KB/sec)
Downloading: http://sachaproject.gforge.inria.fr/repositories/releases/fr/inria/gforge/spoon/spoon-core/6.2.0/spoon-core-6.2.0.pom
         
Downloading: http://maven.inria.fr/artifactory/spoon-public-snapshot/fr/inria/gforge/spoon/spoon-core/6.2.0/spoon-core-6.2.0.pom
[WARNING] Could not apply configuration for gforge.inria.fr-snapshot to wagon org.apache.maven.wagon.providers.http.HttpWagon:Cannot find 'preferredAuthentications' in class org.apache.maven.wagon.providers.http.HttpWagon
         
Downloading: https://tdurieux.github.io/maven-repository/snapshots/fr/inria/gforge/spoon/spoon-core/6.2.0/spoon-core-6.2.0.pom
         
Downloading: https://repo.maven.apache.org/maven2/fr/inria/gforge/spoon/spoon-core/6.2.0/spoon-core-6.2.0.pom
2/20 KB   
3/20 KB   
5/20 KB   
6/20 KB   
7/20 KB   
9/20 KB   
10/20 KB   
11/20 KB   
13/20 KB   
14/20 KB   
15/20 KB   
17/20 KB   
18/20 KB   
19/20 KB   
20/20 KB   
           
Downloaded: https://repo.maven.apache.org/maven2/fr/inria/gforge/spoon/spoon-core/6.2.0/spoon-core-6.2.0.pom (20 KB at 872.4 KB/sec)
Downloading: http://maven.inria.fr/artifactory/spoon-public-snapshot/fr/inria/gforge/spoon/spoon-core/8.1.0-SNAPSHOT/spoon-core-8.1.0-20200211.093604-122.jar
[WARNING] Could not apply configuration for gforge.inria.fr-snapshot to wagon org.apache.maven.wagon.providers.http.HttpWagon:Cannot find 'preferredAuthentications' in class org.apache.maven.wagon.providers.http.HttpWagon
4/1698 KB   
8/1698 KB   
12/1698 KB   
13/1698 KB   
17/1698 KB   
21/1698 KB   
25/1698 KB   
28/1698 KB   
32/1698 KB   
35/1698 KB   
39/1698 KB   
42/1698 KB   
46/1698 KB   
50/1698 KB   
53/1698 KB   
54/1698 KB   
58/1698 KB   
59/1698 KB   
63/1698 KB   
64/1698 KB   
68/1698 KB   
71/1698 KB   
75/1698 KB   
76/1698 KB   
78/1698 KB   
81/1698 KB   
85/1698 KB   
88/1698 KB   
90/1698 KB   
94/1698 KB   
97/1698 KB   
98/1698 KB   
102/1698 KB   
106/1698 KB   
110/1698 KB   
111/1698 KB   
114/1698 KB   
118/1698 KB   
118/1698 KB   
122/1698 KB   
124/1698 KB   
125/1698 KB   
129/1698 KB   
132/1698 KB   
135/1698 KB   
139/1698 KB   
139/1698 KB   
142/1698 KB   
146/1698 KB   
146/1698 KB   
150/1698 KB   
152/1698 KB   
155/1698 KB   
159/1698 KB   
163/1698 KB   
163/1698 KB   
167/1698 KB   
170/1698 KB   
174/1698 KB   
176/1698 KB   
179/1698 KB   
182/1698 KB   
186/1698 KB   
187/1698 KB   
191/1698 KB   
194/1698 KB   
196/1698 KB   
200/1698 KB   
201/1698 KB   
203/1698 KB   
207/1698 KB   
207/1698 KB   
211/1698 KB   
211/1698 KB   
213/1698 KB   
217/1698 KB   
220/1698 KB   
221/1698 KB   
225/1698 KB   
229/1698 KB   
231/1698 KB   
234/1698 KB   
238/1698 KB   
242/1698 KB   
242/1698 KB   
245/1698 KB   
249/1698 KB   
253/1698 KB   
257/1698 KB   
261/1698 KB   
264/1698 KB   
268/1698 KB   
269/1698 KB   
271/1698 KB   
275/1698 KB   
276/1698 KB   
280/1698 KB   
284/1698 KB   
286/1698 KB   
290/1698 KB   
292/1698 KB   
295/1698 KB   
298/1698 KB   
302/1698 KB   
306/1698 KB   
310/1698 KB   
314/1698 KB   
318/1698 KB   
322/1698 KB   
326/1698 KB   
330/1698 KB   
334/1698 KB   
338/1698 KB   
342/1698 KB   
346/1698 KB   
350/1698 KB   
354/1698 KB   
358/1698 KB   
362/1698 KB   
366/1698 KB   
370/1698 KB   
374/1698 KB   
378/1698 KB   
382/1698 KB   
386/1698 KB   
390/1698 KB   
394/1698 KB   
398/1698 KB   
402/1698 KB   
406/1698 KB   
410/1698 KB   
414/1698 KB   
418/1698 KB   
422/1698 KB   
426/1698 KB   
430/1698 KB   
434/1698 KB   
438/1698 KB   
442/1698 KB   
446/1698 KB   
450/1698 KB   
454/1698 KB   
458/1698 KB   
462/1698 KB   
466/1698 KB   
470/1698 KB   
474/1698 KB   
478/1698 KB   
482/1698 KB   
486/1698 KB   
490/1698 KB   
494/1698 KB   
498/1698 KB   
502/1698 KB   
506/1698 KB   
510/1698 KB   
514/1698 KB   
518/1698 KB   
522/1698 KB   
526/1698 KB   
530/1698 KB   
534/1698 KB   
538/1698 KB   
542/1698 KB   
546/1698 KB   
550/1698 KB   
554/1698 KB   
558/1698 KB   
562/1698 KB   
566/1698 KB   
570/1698 KB   
574/1698 KB   
578/1698 KB   
582/1698 KB   
586/1698 KB   
590/1698 KB   
594/1698 KB   
598/1698 KB   
602/1698 KB   
606/1698 KB   
610/1698 KB   
614/1698 KB   
618/1698 KB   
622/1698 KB   
626/1698 KB   
630/1698 KB   
634/1698 KB   
638/1698 KB   
642/1698 KB   
646/1698 KB   
650/1698 KB   
654/1698 KB   
658/1698 KB   
662/1698 KB   
666/1698 KB   
670/1698 KB   
674/1698 KB   
678/1698 KB   
682/1698 KB   
686/1698 KB   
690/1698 KB   
694/1698 KB   
698/1698 KB   
702/1698 KB   
706/1698 KB   
710/1698 KB   
714/1698 KB   
718/1698 KB   
722/1698 KB   
726/1698 KB   
730/1698 KB   
734/1698 KB   
738/1698 KB   
742/1698 KB   
746/1698 KB   
750/1698 KB   
754/1698 KB   
758/1698 KB   
762/1698 KB   
766/1698 KB   
770/1698 KB   
774/1698 KB   
778/1698 KB   
782/1698 KB   
786/1698 KB   
790/1698 KB   
794/1698 KB   
798/1698 KB   
802/1698 KB   
806/1698 KB   
810/1698 KB   
814/1698 KB   
818/1698 KB   
822/1698 KB   
826/1698 KB   
830/1698 KB   
834/1698 KB   
838/1698 KB   
842/1698 KB   
846/1698 KB   
850/1698 KB   
854/1698 KB   
858/1698 KB   
862/1698 KB   
866/1698 KB   
870/1698 KB   
874/1698 KB   
878/1698 KB   
882/1698 KB   
886/1698 KB   
890/1698 KB   
894/1698 KB   
898/1698 KB   
902/1698 KB   
906/1698 KB   
910/1698 KB   
914/1698 KB   
918/1698 KB   
922/1698 KB   
926/1698 KB   
930/1698 KB   
934/1698 KB   
938/1698 KB   
942/1698 KB   
946/1698 KB   
950/1698 KB   
954/1698 KB   
958/1698 KB   
962/1698 KB   
966/1698 KB   
970/1698 KB   
974/1698 KB   
978/1698 KB   
982/1698 KB   
986/1698 KB   
990/1698 KB   
994/1698 KB   
998/1698 KB   
1002/1698 KB   
1006/1698 KB   
1010/1698 KB   
1014/1698 KB   
1018/1698 KB   
1022/1698 KB   
1026/1698 KB   
1030/1698 KB   
1034/1698 KB   
1038/1698 KB   
1042/1698 KB   
1046/1698 KB   
1050/1698 KB   
1054/1698 KB   
1058/1698 KB   
1062/1698 KB   
1066/1698 KB   
1070/1698 KB   
1074/1698 KB   
1078/1698 KB   
1082/1698 KB   
1086/1698 KB   
1090/1698 KB   
1094/1698 KB   
1098/1698 KB   
1102/1698 KB   
1106/1698 KB   
1110/1698 KB   
1114/1698 KB   
1118/1698 KB   
1122/1698 KB   
1126/1698 KB   
1130/1698 KB   
1134/1698 KB   
1138/1698 KB   
1142/1698 KB   
1146/1698 KB   
1150/1698 KB   
1154/1698 KB   
1158/1698 KB   
1162/1698 KB   
1166/1698 KB   
1170/1698 KB   
1174/1698 KB   
1178/1698 KB   
1182/1698 KB   
1186/1698 KB   
1190/1698 KB   
1194/1698 KB   
1198/1698 KB   
1202/1698 KB   
1206/1698 KB   
1210/1698 KB   
1214/1698 KB   
1218/1698 KB   
1222/1698 KB   
1226/1698 KB   
1230/1698 KB   
1234/1698 KB   
1238/1698 KB   
1242/1698 KB   
1246/1698 KB   
1250/1698 KB   
1254/1698 KB   
1258/1698 KB   
1262/1698 KB   
1266/1698 KB   
1270/1698 KB   
1274/1698 KB   
1278/1698 KB   
1282/1698 KB   
1286/1698 KB   
1290/1698 KB   
1294/1698 KB   
1298/1698 KB   
1302/1698 KB   
1306/1698 KB   
1310/1698 KB   
1314/1698 KB   
1318/1698 KB   
1322/1698 KB   
1326/1698 KB   
1330/1698 KB   
1334/1698 KB   
1338/1698 KB   
1342/1698 KB   
1346/1698 KB   
1350/1698 KB   
1354/1698 KB   
1358/1698 KB   
1362/1698 KB   
1366/1698 KB   
1370/1698 KB   
1374/1698 KB   
1378/1698 KB   
1382/1698 KB   
1386/1698 KB   
1390/1698 KB   
1394/1698 KB   
1398/1698 KB   
1402/1698 KB   
1406/1698 KB   
1410/1698 KB   
1414/1698 KB   
1418/1698 KB   
1422/1698 KB   
1426/1698 KB   
1430/1698 KB   
1434/1698 KB   
1438/1698 KB   
1442/1698 KB   
1446/1698 KB   
1450/1698 KB   
1454/1698 KB   
1458/1698 KB   
1462/1698 KB   
1466/1698 KB   
1470/1698 KB   
1474/1698 KB   
1478/1698 KB   
1482/1698 KB   
1486/1698 KB   
1490/1698 KB   
1494/1698 KB   
1498/1698 KB   
1502/1698 KB   
1506/1698 KB   
1510/1698 KB   
1514/1698 KB   
1518/1698 KB   
1522/1698 KB   
1526/1698 KB   
1530/1698 KB   
1534/1698 KB   
1538/1698 KB   
1542/1698 KB   
1546/1698 KB   
1550/1698 KB   
1554/1698 KB   
1558/1698 KB   
1562/1698 KB   
1566/1698 KB   
1570/1698 KB   
1574/1698 KB   
1578/1698 KB   
1582/1698 KB   
1586/1698 KB   
1590/1698 KB   
1594/1698 KB   
1598/1698 KB   
1602/1698 KB   
1606/1698 KB   
1610/1698 KB   
1614/1698 KB   
1618/1698 KB   
1622/1698 KB   
1626/1698 KB   
1630/1698 KB   
1634/1698 KB   
1638/1698 KB   
1642/1698 KB   
1646/1698 KB   
1650/1698 KB   
1654/1698 KB   
1658/1698 KB   
1662/1698 KB   
1666/1698 KB   
1670/1698 KB   
1674/1698 KB   
1678/1698 KB   
1682/1698 KB   
1686/1698 KB   
1690/1698 KB   
1694/1698 KB   
1698/1698 KB   
1698/1698 KB   
               
Downloaded: http://maven.inria.fr/artifactory/spoon-public-snapshot/fr/inria/gforge/spoon/spoon-core/8.1.0-SNAPSHOT/spoon-core-8.1.0-20200211.093604-122.jar (1698 KB at 7382.1 KB/sec)
[INFO] 
[INFO] --- maven-dependency-plugin:2.8:resolve (default-cli) @ nopol ---
[INFO] 
[INFO] The following files have been resolved:
[INFO]    com.google.code.findbugs:jsr305:jar:3.0.2:compile
[INFO]    gov.nasa.jpf:jpf:jar:1154:provided
[INFO]    commons-cli:commons-cli:jar:1.4:compile
[INFO]    org.smtlib:smtlib:jar:0.9.7.1:compile
[INFO]    com.martiansoftware:jsap:jar:2.1:compile
[INFO]    junit:junit:jar:4.13:compile
[INFO]    org.checkerframework:checker-qual:jar:2.10.0:compile
[INFO]    org.easytesting:fest-util:jar:1.1.6:compile
[INFO]    com.google.guava:listenablefuture:jar:9999.0-empty-to-avoid-conflict-with-guava:compile
[INFO]    org.reflections:reflections:jar:0.9.12:compile
[INFO]    ch.qos.logback:logback-classic:jar:1.3.0-alpha5:runtime
[INFO]    com.google.errorprone:error_prone_annotations:jar:2.3.4:compile
[INFO]    com.microsoft.z3:z3:jar:0.0.1:compile
[INFO]    javax.activation:activation:jar:1.1:runtime
[INFO]    fr.inria.gforge.spoon:spoon-core:jar:8.1.0-SNAPSHOT:compile
[INFO]    com.cloudbees:diff4j:jar:1.3:compile
[INFO]    com.google.guava:guava:jar:28.2-jre:compile
[INFO]    org.apache.logging.log4j:log4j-api:jar:2.13.0:compile
[INFO]    gov.nasa.jpf:jpf-symbc:jar:576:provided
[INFO]    ch.qos.logback:logback-core:jar:1.3.0-alpha5:runtime
[INFO]    org.apache.maven.shared:maven-invoker:jar:3.0.1:compile
[INFO]    org.eclipse.jdt:org.eclipse.jdt.core:jar:3.16.0:compile
[INFO]    commons-io:commons-io:jar:2.6:compile
[INFO]    com.fasterxml.jackson.core:jackson-annotations:jar:2.9.10:compile
[INFO]    com.sun:tools:jar:1.4.2:system
[INFO]    com.google.j2objc:j2objc-annotations:jar:1.3:compile
[INFO]    com.fasterxml.jackson.core:jackson-core:jar:2.9.10:compile
[INFO]    com.sun.mail:javax.mail:jar:1.6.2:runtime
[INFO]    org.slf4j:slf4j-api:jar:2.0.0-alpha1:compile
[INFO]    org.codehaus.plexus:plexus-component-annotations:jar:1.7.1:compile
[INFO]    org.hamcrest:hamcrest:jar:2.2:compile
[INFO]    org.apache.commons:commons-lang3:jar:3.8.1:compile
[INFO]    com.fasterxml.jackson.core:jackson-databind:jar:2.9.10.1:compile
[INFO]    com.google.guava:failureaccess:jar:1.0.1:compile
[INFO]    org.jvnet.localizer:localizer:jar:1.12:compile
[INFO]    com.gzoltar:gzoltar:jar:0.1.1:compile
[INFO]    org.hamcrest:hamcrest-core:jar:2.2:compile
[INFO]    org.apache.commons:commons-compress:jar:1.19:compile
[INFO]    org.codehaus.plexus:plexus-utils:jar:3.0.24:compile
[INFO]    edu.washington.cs.types.checker:checker-framework:jar:1.7.0:runtime
[INFO]    org.tukaani:xz:jar:1.8:compile
[INFO]    org.apache.logging.log4j:log4j-to-slf4j:jar:2.13.0:compile
[INFO]    fil.iagl.cocospoon:CocoSpoon:jar:1.0.0-SNAPSHOT:compile
[INFO]    org.apache.maven:maven-model:jar:3.5.0:compile
[INFO]    org.javassist:javassist:jar:3.26.0-GA:compile
[INFO]    org.apache.maven.shared:maven-shared-utils:jar:3.2.1:compile
[INFO]    org.json:json:jar:20190722:compile
[INFO]    org.easytesting:fest-assert:jar:1.4:compile
[INFO] 
[INFO] ------------------------------------------------------------------------
[INFO] BUILD SUCCESS
[INFO] ------------------------------------------------------------------------
[INFO] Total time: 6.967 s
[INFO] Finished at: 2020-02-11T10:39:00+01:00
[INFO] Final Memory: 19M/126M
[INFO] ------------------------------------------------------------------------
+ mvn package
Picked up JAVA_TOOL_OPTIONS: -Dfile.encoding=UTF8
[INFO] Scanning for projects...
[WARNING] 
[WARNING] Some problems were encountered while building the effective model for fr.inria.gforge.spirals:nopol:jar:0.2-SNAPSHOT
[WARNING] 'build.pluginManagement.plugins.plugin.(groupId:artifactId)' must be unique but found duplicate declaration of plugin org.apache.maven.plugins:maven-compiler-plugin @ line 344, column 25
[WARNING] 'build.pluginManagement.plugins.plugin.(groupId:artifactId)' must be unique but found duplicate declaration of plugin org.apache.maven.plugins:maven-install-plugin @ line 352, column 25
[WARNING] 'build.pluginManagement.plugins.plugin.(groupId:artifactId)' must be unique but found duplicate declaration of plugin org.apache.maven.plugins:maven-clean-plugin @ line 360, column 25
[WARNING] 'repositories.repository.id' must not contain any of these characters \/:"<>|?* but found / @ line 407, column 17
[WARNING] 
[WARNING] It is highly recommended to fix these problems because they threaten the stability of your build.
[WARNING] 
[WARNING] For this reason, future Maven versions might no longer support building such malformed projects.
[WARNING] 
[INFO]                                                                         
[INFO] ------------------------------------------------------------------------
[INFO] Building Nopol 0.2-SNAPSHOT
[INFO] ------------------------------------------------------------------------
[INFO] 
[INFO] --- jacoco-maven-plugin:0.8.3:prepare-agent (default) @ nopol ---
[INFO] argLine set to -javaagent:/builds/.m2/repository/org/jacoco/org.jacoco.agent/0.8.3/org.jacoco.agent-0.8.3-runtime.jar=destfile=/builds/workspace/nopol/nopol/target/jacoco.exec,excludes=com.sun.tools.jdi.**
[INFO] 
[INFO] --- maven-resources-plugin:2.6:resources (default-resources) @ nopol ---
[INFO] Using 'UTF-8' encoding to copy filtered resources.
[INFO] Copying 4 resources
[INFO] 
[INFO] --- maven-compiler-plugin:3.0:compile (default-compile) @ nopol ---
[INFO] Changes detected - recompiling the module!
[INFO] Compiling 296 source files to /builds/workspace/nopol/nopol/target/classes
[INFO] -------------------------------------------------------------
[ERROR] COMPILATION ERROR : 
[INFO] -------------------------------------------------------------
[ERROR] /builds/workspace/nopol/nopol/src/main/java/fr/inria/lille/repair/synthesis/collect/spoon/MethodCollector.java:[3,24] cannot access spoon.processing.AbstractProcessor
  bad class file: /builds/.m2/repository/fr/inria/gforge/spoon/spoon-core/8.1.0-SNAPSHOT/spoon-core-8.1.0-SNAPSHOT.jar(spoon/processing/AbstractProcessor.class)
    unable to access file: corrupted zip file
    Please remove or make sure it appears in the correct subdirectory of the classpath.
[INFO] 1 error
[INFO] -------------------------------------------------------------
[INFO] ------------------------------------------------------------------------
[INFO] BUILD FAILURE
[INFO] ------------------------------------------------------------------------
[INFO] Total time: 5.775 s
[INFO] Finished at: 2020-02-11T10:39:10+01:00
[INFO] Final Memory: 25M/180M
[INFO] ------------------------------------------------------------------------
[ERROR] Failed to execute goal org.apache.maven.plugins:maven-compiler-plugin:3.0:compile (default-compile) on project nopol: Compilation failure
[ERROR] /builds/workspace/nopol/nopol/src/main/java/fr/inria/lille/repair/synthesis/collect/spoon/MethodCollector.java:[3,24] cannot access spoon.processing.AbstractProcessor
[ERROR] bad class file: /builds/.m2/repository/fr/inria/gforge/spoon/spoon-core/8.1.0-SNAPSHOT/spoon-core-8.1.0-SNAPSHOT.jar(spoon/processing/AbstractProcessor.class)
[ERROR] unable to access file: corrupted zip file
[ERROR] Please remove or make sure it appears in the correct subdirectory of the classpath.
[ERROR] -> [Help 1]
[ERROR] 
[ERROR] To see the full stack trace of the errors, re-run Maven with the -e switch.
[ERROR] Re-run Maven using the -X switch to enable full debug logging.
[ERROR] 
[ERROR] For more information about the errors and possible solutions, please read the following articles:
[ERROR] [Help 1] http://cwiki.apache.org/confluence/display/MAVEN/MojoFailureException
Build step 'Execute shell' marked build as failure
Recording test results
ERROR: Step ‘Publish JUnit test result report’ failed: No test report files were found. Configuration error?
Sending e-mails to: spoon-devel@lists.gforge.inria.fr
[WS-CLEANUP] Deleting project workspace...
[WS-CLEANUP] Deferred wipeout is used...
[WS-CLEANUP] done
Finished: FAILURE