FailedConsole Output

Started by timer
Running as SYSTEM
[EnvInject] - Loading node environment variables.
Building remotely on sos-builder01 (lin) in workspace /builds/workspace/npefix
[WS-CLEANUP] Deleting project workspace...
[WS-CLEANUP] Deferred wipeout is used...
[WS-CLEANUP] Done
No credentials specified
Cloning the remote Git repository
Cloning repository https://github.com/Spirals-Team/npefix.git
 > git init /builds/workspace/npefix # timeout=10
Fetching upstream changes from https://github.com/Spirals-Team/npefix.git
 > git --version # timeout=10
 > git fetch --tags --progress https://github.com/Spirals-Team/npefix.git +refs/heads/*:refs/remotes/origin/*
 > git config remote.origin.url https://github.com/Spirals-Team/npefix.git # timeout=10
 > git config --add remote.origin.fetch +refs/heads/*:refs/remotes/origin/* # timeout=10
 > git config remote.origin.url https://github.com/Spirals-Team/npefix.git # timeout=10
Fetching upstream changes from https://github.com/Spirals-Team/npefix.git
 > git fetch --tags --progress https://github.com/Spirals-Team/npefix.git +refs/heads/*:refs/remotes/origin/*
 > git rev-parse refs/remotes/origin/master^{commit} # timeout=10
 > git rev-parse refs/remotes/origin/origin/master^{commit} # timeout=10
Checking out Revision 8d7b6ba9358d6f6c08f44dd80e49c5c3f733b7fe (refs/remotes/origin/master)
 > git config core.sparsecheckout # timeout=10
 > git checkout -f 8d7b6ba9358d6f6c08f44dd80e49c5c3f733b7fe
Commit message: "fix travis CI"
 > git rev-list --no-walk 8d7b6ba9358d6f6c08f44dd80e49c5c3f733b7fe # timeout=10
[npefix] $ /bin/sh -xe /tmp/jenkins6502314892562709498.sh
+ rm -rf /builds/.m2/repository/fr/inria/gforge/spoon
[npefix] $ /bin/sh -xe /tmp/jenkins3066715129807962540.sh
+ mvn versions:use-latest-versions -DallowSnapshots=true
Picked up JAVA_TOOL_OPTIONS: -Dfile.encoding=UTF8
[INFO] Scanning for projects...
[INFO] Inspecting build with total of 1 modules...
[INFO] Installing Nexus Staging features:
[INFO]   ... total of 1 executions of maven-deploy-plugin replaced with nexus-staging-maven-plugin
[INFO]                                                                         
[INFO] ------------------------------------------------------------------------
[INFO] Building npefix 0.8-SNAPSHOT
[INFO] ------------------------------------------------------------------------
[INFO] 
[INFO] --- versions-maven-plugin:2.4:use-latest-versions (default-cli) @ npefix ---
[INFO] Major version changes allowed
[INFO] artifact junit:junit: checking for updates from gforge.inria.fr-snapshot
[INFO] Updated junit:junit:jar:4.11 to version 4.13-SNAPSHOT
[INFO] artifact org.json:json: checking for updates from gforge.inria.fr-snapshot
[INFO] artifact org.json:json: checking for updates from central
[WARNING] repository metadata for: 'artifact org.json:json' could not be retrieved from repository: central due to an error: repo.maven.apache.org: Temporary failure in name resolution
[INFO] Updated org.json:json:jar:20160212 to version 20190722
[INFO] artifact org.hamcrest:hamcrest-core: checking for updates from gforge.inria.fr-snapshot
[INFO] artifact org.hamcrest:hamcrest-core: checking for updates from central
[WARNING] repository metadata for: 'artifact org.hamcrest:hamcrest-core' could not be retrieved from repository: central due to an error: repo.maven.apache.org
[INFO] Updated org.hamcrest:hamcrest-core:jar:1.3 to version 2.2
[INFO] artifact fr.inria.gforge.spoon:spoon-core: checking for updates from gforge.inria.fr-snapshot
[INFO] Updated fr.inria.gforge.spoon:spoon-core:jar:7.5.0-SNAPSHOT to version 8.1.0-SNAPSHOT
[INFO] artifact org.slf4j:slf4j-simple: checking for updates from gforge.inria.fr-snapshot
[INFO] artifact org.slf4j:slf4j-simple: checking for updates from central
[WARNING] repository metadata for: 'artifact org.slf4j:slf4j-simple' could not be retrieved from repository: central due to an error: repo.maven.apache.org
[INFO] Updated org.slf4j:slf4j-simple:jar:1.7.6 to version 2.0.0-alpha1
[INFO] artifact log4j:log4j: checking for updates from gforge.inria.fr-snapshot
[INFO] artifact log4j:log4j: checking for updates from central
[WARNING] repository metadata for: 'artifact log4j:log4j' could not be retrieved from repository: central due to an error: repo.maven.apache.org
[INFO] artifact com.cloudbees:diff4j: checking for updates from gforge.inria.fr-snapshot
[INFO] artifact com.cloudbees:diff4j: checking for updates from central
[WARNING] repository metadata for: 'artifact com.cloudbees:diff4j' could not be retrieved from repository: central due to an error: repo.maven.apache.org
[INFO] Updated com.cloudbees:diff4j:jar:1.2 to version 1.3
[INFO] artifact org.eclipse.core:org.eclipse.core.runtime: checking for updates from gforge.inria.fr-snapshot
[INFO] artifact org.eclipse.core:org.eclipse.core.runtime: checking for updates from central
[WARNING] repository metadata for: 'artifact org.eclipse.core:org.eclipse.core.runtime' could not be retrieved from repository: central due to an error: repo.maven.apache.org
[INFO] Updated org.eclipse.core:org.eclipse.core.runtime:jar:3.6.0.v20100505 to version 3.7.0
[INFO] artifact org.eclipse.core:org.eclipse.core.resources: checking for updates from gforge.inria.fr-snapshot
[INFO] artifact org.eclipse.core:org.eclipse.core.resources: checking for updates from central
[WARNING] repository metadata for: 'artifact org.eclipse.core:org.eclipse.core.resources' could not be retrieved from repository: central due to an error: repo.maven.apache.org
[INFO] Updated org.eclipse.core:org.eclipse.core.resources:jar:3.6.0.v20100526-0737 to version 3.7.100
[INFO] artifact org.glassfish.tyrus.bundles:tyrus-standalone-client: checking for updates from gforge.inria.fr-snapshot
[INFO] artifact org.glassfish.tyrus.bundles:tyrus-standalone-client: checking for updates from central
[WARNING] repository metadata for: 'artifact org.glassfish.tyrus.bundles:tyrus-standalone-client' could not be retrieved from repository: central due to an error: repo.maven.apache.org
[INFO] Updated org.glassfish.tyrus.bundles:tyrus-standalone-client:jar:1.13.1 to version 1.15
[INFO] artifact org.apache.maven:maven-model: checking for updates from gforge.inria.fr-snapshot
[INFO] artifact org.apache.maven:maven-model: checking for updates from central
[WARNING] repository metadata for: 'artifact org.apache.maven:maven-model' could not be retrieved from repository: central due to an error: repo.maven.apache.org
[INFO] Updated org.apache.maven:maven-model:jar:3.5.0 to version 3.6.3
[INFO] ------------------------------------------------------------------------
[INFO] BUILD SUCCESS
[INFO] ------------------------------------------------------------------------
[INFO] Total time: 13.540 s
[INFO] Finished at: 2019-12-04T05:24:17+01:00
[INFO] Final Memory: 22M/192M
[INFO] ------------------------------------------------------------------------
+ mvn test
Picked up JAVA_TOOL_OPTIONS: -Dfile.encoding=UTF8
[INFO] Scanning for projects...
[INFO] Inspecting build with total of 1 modules...
[INFO] Installing Nexus Staging features:
[INFO]   ... total of 1 executions of maven-deploy-plugin replaced with nexus-staging-maven-plugin
[INFO]                                                                         
[INFO] ------------------------------------------------------------------------
[INFO] Building npefix 0.8-SNAPSHOT
[INFO] ------------------------------------------------------------------------
Downloading: http://maven.inria.fr/artifactory/spoon-public-snapshot/junit/junit/4.13-SNAPSHOT/maven-metadata.xml
[WARNING] Could not apply configuration for gforge.inria.fr-snapshot to wagon org.apache.maven.wagon.providers.http.HttpWagon:Cannot find 'preferredAuthentications' in class org.apache.maven.wagon.providers.http.HttpWagon

Downloading: http://maven.inria.fr/artifactory/spoon-public-snapshot/fr/inria/gforge/spoon/spoon-core/8.1.0-SNAPSHOT/maven-metadata.xml
[WARNING] Could not apply configuration for gforge.inria.fr-snapshot to wagon org.apache.maven.wagon.providers.http.HttpWagon:Cannot find 'preferredAuthentications' in class org.apache.maven.wagon.providers.http.HttpWagon
1013/1013 B   
              
Downloaded: http://maven.inria.fr/artifactory/spoon-public-snapshot/fr/inria/gforge/spoon/spoon-core/8.1.0-SNAPSHOT/maven-metadata.xml (1013 B at 12.7 KB/sec)
Downloading: http://maven.inria.fr/artifactory/spoon-public-snapshot/fr/inria/gforge/spoon/spoon-core/8.1.0-SNAPSHOT/spoon-core-8.1.0-20191203.234211-31.pom
[WARNING] Could not apply configuration for gforge.inria.fr-snapshot to wagon org.apache.maven.wagon.providers.http.HttpWagon:Cannot find 'preferredAuthentications' in class org.apache.maven.wagon.providers.http.HttpWagon
4/7 KB        
7/7 KB   
         
Downloaded: http://maven.inria.fr/artifactory/spoon-public-snapshot/fr/inria/gforge/spoon/spoon-core/8.1.0-SNAPSHOT/spoon-core-8.1.0-20191203.234211-31.pom (7 KB at 152.8 KB/sec)
Downloading: http://maven.inria.fr/artifactory/spoon-public-snapshot/fr/inria/gforge/spoon/spoon-pom/1.0/spoon-pom-1.0.pom
[WARNING] Could not apply configuration for gforge.inria.fr-snapshot to wagon org.apache.maven.wagon.providers.http.HttpWagon:Cannot find 'preferredAuthentications' in class org.apache.maven.wagon.providers.http.HttpWagon
         
Downloading: https://repo.maven.apache.org/maven2/fr/inria/gforge/spoon/spoon-pom/1.0/spoon-pom-1.0.pom
         
[INFO] ------------------------------------------------------------------------
[INFO] BUILD FAILURE
[INFO] ------------------------------------------------------------------------
[INFO] Total time: 12.509 s
[INFO] Finished at: 2019-12-04T05:24:31+01:00
[INFO] Final Memory: 15M/174M
[INFO] ------------------------------------------------------------------------
[ERROR] Failed to execute goal on project npefix: Could not resolve dependencies for project fr.inria.gforge.spirals:npefix:jar:0.8-SNAPSHOT: Failed to collect dependencies at fr.inria.gforge.spoon:spoon-core:jar:8.1.0-SNAPSHOT: Failed to read artifact descriptor for fr.inria.gforge.spoon:spoon-core:jar:8.1.0-SNAPSHOT: Could not transfer artifact fr.inria.gforge.spoon:spoon-pom:pom:1.0 from/to central (https://repo.maven.apache.org/maven2): repo.maven.apache.org: Temporary failure in name resolution: Unknown host repo.maven.apache.org: Temporary failure in name resolution -> [Help 1]
[ERROR] 
[ERROR] To see the full stack trace of the errors, re-run Maven with the -e switch.
[ERROR] Re-run Maven using the -X switch to enable full debug logging.
[ERROR] 
[ERROR] For more information about the errors and possible solutions, please read the following articles:
[ERROR] [Help 1] http://cwiki.apache.org/confluence/display/MAVEN/DependencyResolutionException
Build step 'Execute shell' marked build as failure
Sending e-mails to: spoon-devel@lists.gforge.inria.fr
Finished: FAILURE