FailedConsole Output

Started by timer
Running as SYSTEM
[EnvInject] - Loading node environment variables.
Building remotely on sos-builder01 (lin) in workspace /builds/workspace/spoon-control-flow
[WS-CLEANUP] Deleting project workspace...
[WS-CLEANUP] Deferred wipeout is used...
[WS-CLEANUP] Done
No credentials specified
Wiping out workspace first.
Cloning the remote Git repository
Cloning repository https://github.com/INRIA/spoon.git
 > git init /builds/workspace/spoon-control-flow # timeout=10
Fetching upstream changes from https://github.com/INRIA/spoon.git
 > git --version # timeout=10
 > git fetch --tags --progress https://github.com/INRIA/spoon.git +refs/heads/*:refs/remotes/origin/* # timeout=10
 > git config remote.origin.url https://github.com/INRIA/spoon.git # timeout=10
 > git config --add remote.origin.fetch +refs/heads/*:refs/remotes/origin/* # timeout=10
 > git config remote.origin.url https://github.com/INRIA/spoon.git # timeout=10
Fetching upstream changes from https://github.com/INRIA/spoon.git
 > git fetch --tags --progress https://github.com/INRIA/spoon.git +refs/heads/*:refs/remotes/origin/* # timeout=10
 > git rev-parse refs/remotes/origin/master^{commit} # timeout=10
 > git rev-parse refs/remotes/origin/origin/master^{commit} # timeout=10
Checking out Revision 10be8603527b30dedf5191c7bbb3d28775741e85 (refs/remotes/origin/master)
 > git config core.sparsecheckout # timeout=10
 > git checkout -f 10be8603527b30dedf5191c7bbb3d28775741e85 # timeout=10
Commit message: "chore(changelog.js): small fix in changelog generator (#3311)"
 > git rev-list --no-walk 10be8603527b30dedf5191c7bbb3d28775741e85 # timeout=10
[spoon-control-flow] $ /bin/sh -xe /tmp/jenkins1714504649454232442.sh
+ cd spoon-control-flow
+ mvn versions:use-latest-versions -DallowSnapshots=true -Dincludes=fr.inria.gforge.spoon
Picked up JAVA_TOOL_OPTIONS: -Dfile.encoding=UTF8
[INFO] Scanning for projects...
[INFO] Inspecting build with total of 1 modules...
[INFO] Installing Nexus Staging features:
[INFO]   ... total of 1 executions of maven-deploy-plugin replaced with nexus-staging-maven-plugin
[WARNING] The POM for org.eclipse.m2e:lifecycle-mapping:jar:1.0.0 is missing, no dependency information available
[WARNING] Failed to retrieve plugin descriptor for org.eclipse.m2e:lifecycle-mapping:1.0.0: Plugin org.eclipse.m2e:lifecycle-mapping:1.0.0 or one of its dependencies could not be resolved: Failure to find org.eclipse.m2e:lifecycle-mapping:jar:1.0.0 in https://repo.maven.apache.org/maven2 was cached in the local repository, resolution will not be reattempted until the update interval of central has elapsed or updates are forced
[INFO]                                                                         
[INFO] ------------------------------------------------------------------------
[INFO] Building control-flow 0.0.1
[INFO] ------------------------------------------------------------------------
[WARNING] The POM for org.eclipse.m2e:lifecycle-mapping:jar:1.0.0 is missing, no dependency information available
[WARNING] Failed to retrieve plugin descriptor for org.eclipse.m2e:lifecycle-mapping:1.0.0: Plugin org.eclipse.m2e:lifecycle-mapping:1.0.0 or one of its dependencies could not be resolved: Failure to find org.eclipse.m2e:lifecycle-mapping:jar:1.0.0 in https://repo.maven.apache.org/maven2 was cached in the local repository, resolution will not be reattempted until the update interval of central has elapsed or updates are forced
[INFO] 
[INFO] --- versions-maven-plugin:2.4:use-latest-versions (default-cli) @ control-flow ---
[INFO] Major version changes allowed
[INFO] artifact fr.inria.gforge.spoon:spoon-core: checking for updates from maven.inria.fr-snapshot
[WARNING] repository metadata for: 'artifact fr.inria.gforge.spoon:spoon-core' could not be retrieved from repository: maven.inria.fr-snapshot due to an error: sun.security.validator.ValidatorException: PKIX path building failed: sun.security.provider.certpath.SunCertPathBuilderException: unable to find valid certification path to requested target
[INFO] ------------------------------------------------------------------------
[INFO] BUILD SUCCESS
[INFO] ------------------------------------------------------------------------
[INFO] Total time: 6.177 s
[INFO] Finished at: 2020-03-26T11:09:17+01:00
[INFO] Final Memory: 24M/191M
[INFO] ------------------------------------------------------------------------
+ mvn clean test
Picked up JAVA_TOOL_OPTIONS: -Dfile.encoding=UTF8
[INFO] Scanning for projects...
[INFO] Inspecting build with total of 1 modules...
[INFO] Installing Nexus Staging features:
[INFO]   ... total of 1 executions of maven-deploy-plugin replaced with nexus-staging-maven-plugin
[INFO]                                                                         
[INFO] ------------------------------------------------------------------------
[INFO] Building control-flow 0.0.1
[INFO] ------------------------------------------------------------------------
Downloading: https://maven.irisa.fr/artifactory/spoon-public-snapshot/fr/inria/gforge/spoon/spoon-core/8.1.0-SNAPSHOT/maven-metadata.xml

[WARNING] Could not transfer metadata fr.inria.gforge.spoon:spoon-core:8.1.0-SNAPSHOT/maven-metadata.xml from/to maven.inria.fr-snapshot (https://maven.irisa.fr/artifactory/spoon-public-snapshot): sun.security.validator.ValidatorException: PKIX path building failed: sun.security.provider.certpath.SunCertPathBuilderException: unable to find valid certification path to requested target
[WARNING] Failure to transfer fr.inria.gforge.spoon:spoon-core:8.1.0-SNAPSHOT/maven-metadata.xml from https://maven.irisa.fr/artifactory/spoon-public-snapshot was cached in the local repository, resolution will not be reattempted until the update interval of maven.inria.fr-snapshot has elapsed or updates are forced. Original error: Could not transfer metadata fr.inria.gforge.spoon:spoon-core:8.1.0-SNAPSHOT/maven-metadata.xml from/to maven.inria.fr-snapshot (https://maven.irisa.fr/artifactory/spoon-public-snapshot): sun.security.validator.ValidatorException: PKIX path building failed: sun.security.provider.certpath.SunCertPathBuilderException: unable to find valid certification path to requested target
Downloading: https://maven.irisa.fr/artifactory/spoon-public-snapshot/fr/inria/gforge/spoon/spoon-core/8.1.0-SNAPSHOT/spoon-core-8.1.0-SNAPSHOT.pom

[INFO] ------------------------------------------------------------------------
[INFO] BUILD FAILURE
[INFO] ------------------------------------------------------------------------
[INFO] Total time: 2.133 s
[INFO] Finished at: 2020-03-26T11:09:20+01:00
[INFO] Final Memory: 15M/174M
[INFO] ------------------------------------------------------------------------
[ERROR] Failed to execute goal on project control-flow: Could not resolve dependencies for project fr.inria.gforge.spoon:control-flow:jar:0.0.1: Failed to collect dependencies at fr.inria.gforge.spoon:spoon-core:jar:8.1.0-SNAPSHOT: Failed to read artifact descriptor for fr.inria.gforge.spoon:spoon-core:jar:8.1.0-SNAPSHOT: Could not transfer artifact fr.inria.gforge.spoon:spoon-core:pom:8.1.0-SNAPSHOT from/to maven.inria.fr-snapshot (https://maven.irisa.fr/artifactory/spoon-public-snapshot): sun.security.validator.ValidatorException: PKIX path building failed: sun.security.provider.certpath.SunCertPathBuilderException: unable to find valid certification path to requested target -> [Help 1]
[ERROR] 
[ERROR] To see the full stack trace of the errors, re-run Maven with the -e switch.
[ERROR] Re-run Maven using the -X switch to enable full debug logging.
[ERROR] 
[ERROR] For more information about the errors and possible solutions, please read the following articles:
[ERROR] [Help 1] http://cwiki.apache.org/confluence/display/MAVEN/DependencyResolutionException
Build step 'Execute shell' marked build as failure
Finished: FAILURE