FailedConsole Output

Started by timer
Running as SYSTEM
[EnvInject] - Loading node environment variables.
Building remotely on sos-builder01 (lin) in workspace /builds/workspace/spoon-control-flow
[WS-CLEANUP] Deleting project workspace...
[WS-CLEANUP] Deferred wipeout is used...
[WS-CLEANUP] Done
No credentials specified
Wiping out workspace first.
Cloning the remote Git repository
Cloning repository https://github.com/INRIA/spoon.git
 > git init /builds/workspace/spoon-control-flow # timeout=10
Fetching upstream changes from https://github.com/INRIA/spoon.git
 > git --version # timeout=10
 > git fetch --tags --progress https://github.com/INRIA/spoon.git +refs/heads/*:refs/remotes/origin/* # timeout=10
 > git config remote.origin.url https://github.com/INRIA/spoon.git # timeout=10
 > git config --add remote.origin.fetch +refs/heads/*:refs/remotes/origin/* # timeout=10
 > git config remote.origin.url https://github.com/INRIA/spoon.git # timeout=10
Fetching upstream changes from https://github.com/INRIA/spoon.git
 > git fetch --tags --progress https://github.com/INRIA/spoon.git +refs/heads/*:refs/remotes/origin/* # timeout=10
 > git rev-parse refs/remotes/origin/master^{commit} # timeout=10
 > git rev-parse refs/remotes/origin/origin/master^{commit} # timeout=10
Checking out Revision a7d013d5d57f7e9ada2ec3d50ce3091a683e1053 (refs/remotes/origin/master)
 > git config core.sparsecheckout # timeout=10
 > git checkout -f a7d013d5d57f7e9ada2ec3d50ce3091a683e1053 # timeout=10
Commit message: "chore(deps): update dependency org.revapi:revapi-java to v0.21.1 (#3464)"
 > git rev-list --no-walk 307d2f93a03c0544b6d137a118f3644894edc7a3 # timeout=10
[spoon-control-flow] $ /bin/sh -xe /tmp/jenkins8606139083476727768.sh
+ cd spoon-control-flow
+ mvn versions:use-latest-versions -DallowSnapshots=true -Dincludes=fr.inria.gforge.spoon
Picked up JAVA_TOOL_OPTIONS: -Dfile.encoding=UTF8
[INFO] Scanning for projects...
[INFO] Inspecting build with total of 1 modules...
[INFO] Installing Nexus Staging features:
[INFO]   ... total of 1 executions of maven-deploy-plugin replaced with nexus-staging-maven-plugin
Downloading: https://repo.maven.apache.org/maven2/org/revapi/revapi-maven-plugin/0.11.5/revapi-maven-plugin-0.11.5.pom
2/14 KB   
3/14 KB   
5/14 KB   
6/14 KB   
7/14 KB   
9/14 KB   
10/14 KB   
11/14 KB   
13/14 KB   
14/14 KB   
14/14 KB   
           
Downloaded: https://repo.maven.apache.org/maven2/org/revapi/revapi-maven-plugin/0.11.5/revapi-maven-plugin-0.11.5.pom (14 KB at 24.4 KB/sec)
Downloading: https://repo.maven.apache.org/maven2/org/revapi/revapi-build/40/revapi-build-40.pom
2/22 KB    
3/22 KB   
5/22 KB   
6/22 KB   
7/22 KB   
9/22 KB   
10/22 KB   
11/22 KB   
13/22 KB   
14/22 KB   
15/22 KB   
17/22 KB   
18/22 KB   
19/22 KB   
21/22 KB   
22/22 KB   
22/22 KB   
           
Downloaded: https://repo.maven.apache.org/maven2/org/revapi/revapi-build/40/revapi-build-40.pom (22 KB at 516.0 KB/sec)
Downloading: https://repo.maven.apache.org/maven2/org/revapi/revapi-parent/12/revapi-parent-12.pom
2/16 KB    
3/16 KB   
5/16 KB   
6/16 KB   
7/16 KB   
9/16 KB   
10/16 KB   
11/16 KB   
13/16 KB   
14/16 KB   
15/16 KB   
16/16 KB   
           
Downloaded: https://repo.maven.apache.org/maven2/org/revapi/revapi-parent/12/revapi-parent-12.pom (16 KB at 579.3 KB/sec)
Downloading: https://repo.maven.apache.org/maven2/org/revapi/revapi-maven-plugin/0.11.5/revapi-maven-plugin-0.11.5.jar
2/141 KB   
3/141 KB   
5/141 KB   
6/141 KB   
7/141 KB   
9/141 KB   
10/141 KB   
11/141 KB   
13/141 KB   
14/141 KB   
15/141 KB   
17/141 KB   
18/141 KB   
19/141 KB   
21/141 KB   
22/141 KB   
23/141 KB   
25/141 KB   
26/141 KB   
27/141 KB   
29/141 KB   
30/141 KB   
31/141 KB   
33/141 KB   
34/141 KB   
35/141 KB   
37/141 KB   
38/141 KB   
39/141 KB   
41/141 KB   
42/141 KB   
43/141 KB   
45/141 KB   
46/141 KB   
47/141 KB   
49/141 KB   
50/141 KB   
51/141 KB   
53/141 KB   
54/141 KB   
55/141 KB   
57/141 KB   
58/141 KB   
59/141 KB   
61/141 KB   
62/141 KB   
63/141 KB   
65/141 KB   
66/141 KB   
67/141 KB   
69/141 KB   
70/141 KB   
71/141 KB   
73/141 KB   
74/141 KB   
75/141 KB   
77/141 KB   
78/141 KB   
79/141 KB   
81/141 KB   
82/141 KB   
84/141 KB   
85/141 KB   
86/141 KB   
88/141 KB   
89/141 KB   
90/141 KB   
92/141 KB   
93/141 KB   
94/141 KB   
96/141 KB   
97/141 KB   
98/141 KB   
100/141 KB   
101/141 KB   
102/141 KB   
104/141 KB   
105/141 KB   
106/141 KB   
108/141 KB   
109/141 KB   
110/141 KB   
112/141 KB   
113/141 KB   
114/141 KB   
116/141 KB   
117/141 KB   
118/141 KB   
120/141 KB   
121/141 KB   
122/141 KB   
124/141 KB   
125/141 KB   
126/141 KB   
128/141 KB   
129/141 KB   
130/141 KB   
132/141 KB   
133/141 KB   
134/141 KB   
136/141 KB   
137/141 KB   
138/141 KB   
140/141 KB   
141/141 KB   
141/141 KB   
             
Downloaded: https://repo.maven.apache.org/maven2/org/revapi/revapi-maven-plugin/0.11.5/revapi-maven-plugin-0.11.5.jar (141 KB at 1134.2 KB/sec)
[WARNING] The POM for org.eclipse.m2e:lifecycle-mapping:jar:1.0.0 is missing, no dependency information available
[WARNING] Failed to retrieve plugin descriptor for org.eclipse.m2e:lifecycle-mapping:1.0.0: Plugin org.eclipse.m2e:lifecycle-mapping:1.0.0 or one of its dependencies could not be resolved: Failure to find org.eclipse.m2e:lifecycle-mapping:jar:1.0.0 in https://repo.maven.apache.org/maven2 was cached in the local repository, resolution will not be reattempted until the update interval of central has elapsed or updates are forced
[INFO]                                                                         
[INFO] ------------------------------------------------------------------------
[INFO] Building control-flow 0.0.1
[INFO] ------------------------------------------------------------------------
[WARNING] The POM for org.eclipse.m2e:lifecycle-mapping:jar:1.0.0 is missing, no dependency information available
[WARNING] Failed to retrieve plugin descriptor for org.eclipse.m2e:lifecycle-mapping:1.0.0: Plugin org.eclipse.m2e:lifecycle-mapping:1.0.0 or one of its dependencies could not be resolved: Failure to find org.eclipse.m2e:lifecycle-mapping:jar:1.0.0 in https://repo.maven.apache.org/maven2 was cached in the local repository, resolution will not be reattempted until the update interval of central has elapsed or updates are forced
[INFO] 
[INFO] --- versions-maven-plugin:2.4:use-latest-versions (default-cli) @ control-flow ---
[INFO] Major version changes allowed
[INFO] artifact fr.inria.gforge.spoon:spoon-core: checking for updates from maven.inria.fr-snapshot
[WARNING] repository metadata for: 'artifact fr.inria.gforge.spoon:spoon-core' could not be retrieved from repository: maven.inria.fr-snapshot due to an error: sun.security.validator.ValidatorException: PKIX path building failed: sun.security.provider.certpath.SunCertPathBuilderException: unable to find valid certification path to requested target
[INFO] ------------------------------------------------------------------------
[INFO] BUILD SUCCESS
[INFO] ------------------------------------------------------------------------
[INFO] Total time: 7.028 s
[INFO] Finished at: 2020-07-08T11:09:18+02:00
[INFO] Final Memory: 24M/180M
[INFO] ------------------------------------------------------------------------
+ mvn clean test
Picked up JAVA_TOOL_OPTIONS: -Dfile.encoding=UTF8
[INFO] Scanning for projects...
[INFO] Inspecting build with total of 1 modules...
[INFO] Installing Nexus Staging features:
[INFO]   ... total of 1 executions of maven-deploy-plugin replaced with nexus-staging-maven-plugin
[INFO]                                                                         
[INFO] ------------------------------------------------------------------------
[INFO] Building control-flow 0.0.1
[INFO] ------------------------------------------------------------------------
Downloading: https://maven.irisa.fr/artifactory/spoon-public-snapshot/fr/inria/gforge/spoon/spoon-core/8.1.0-SNAPSHOT/maven-metadata.xml

[WARNING] Could not transfer metadata fr.inria.gforge.spoon:spoon-core:8.1.0-SNAPSHOT/maven-metadata.xml from/to maven.inria.fr-snapshot (https://maven.irisa.fr/artifactory/spoon-public-snapshot): sun.security.validator.ValidatorException: PKIX path building failed: sun.security.provider.certpath.SunCertPathBuilderException: unable to find valid certification path to requested target
[WARNING] Failure to transfer fr.inria.gforge.spoon:spoon-core:8.1.0-SNAPSHOT/maven-metadata.xml from https://maven.irisa.fr/artifactory/spoon-public-snapshot was cached in the local repository, resolution will not be reattempted until the update interval of maven.inria.fr-snapshot has elapsed or updates are forced. Original error: Could not transfer metadata fr.inria.gforge.spoon:spoon-core:8.1.0-SNAPSHOT/maven-metadata.xml from/to maven.inria.fr-snapshot (https://maven.irisa.fr/artifactory/spoon-public-snapshot): sun.security.validator.ValidatorException: PKIX path building failed: sun.security.provider.certpath.SunCertPathBuilderException: unable to find valid certification path to requested target
Downloading: https://maven.irisa.fr/artifactory/spoon-public-snapshot/fr/inria/gforge/spoon/spoon-core/8.1.0-SNAPSHOT/spoon-core-8.1.0-SNAPSHOT.pom

[INFO] ------------------------------------------------------------------------
[INFO] BUILD FAILURE
[INFO] ------------------------------------------------------------------------
[INFO] Total time: 1.950 s
[INFO] Finished at: 2020-07-08T11:09:21+02:00
[INFO] Final Memory: 16M/168M
[INFO] ------------------------------------------------------------------------
[ERROR] Failed to execute goal on project control-flow: Could not resolve dependencies for project fr.inria.gforge.spoon:control-flow:jar:0.0.1: Failed to collect dependencies at fr.inria.gforge.spoon:spoon-core:jar:8.1.0-SNAPSHOT: Failed to read artifact descriptor for fr.inria.gforge.spoon:spoon-core:jar:8.1.0-SNAPSHOT: Could not transfer artifact fr.inria.gforge.spoon:spoon-core:pom:8.1.0-SNAPSHOT from/to maven.inria.fr-snapshot (https://maven.irisa.fr/artifactory/spoon-public-snapshot): sun.security.validator.ValidatorException: PKIX path building failed: sun.security.provider.certpath.SunCertPathBuilderException: unable to find valid certification path to requested target -> [Help 1]
[ERROR] 
[ERROR] To see the full stack trace of the errors, re-run Maven with the -e switch.
[ERROR] Re-run Maven using the -X switch to enable full debug logging.
[ERROR] 
[ERROR] For more information about the errors and possible solutions, please read the following articles:
[ERROR] [Help 1] http://cwiki.apache.org/confluence/display/MAVEN/DependencyResolutionException
Build step 'Execute shell' marked build as failure
Finished: FAILURE