FailedConsole Output

Started by timer
Running as SYSTEM
[EnvInject] - Loading node environment variables.
Building remotely on sos-builder01 (lin) in workspace /builds/workspace/Jsoup
[WS-CLEANUP] Deleting project workspace...
[WS-CLEANUP] Deferred wipeout is used...
[WS-CLEANUP] Done
No credentials specified
Cloning the remote Git repository
Cloning repository https://github.com/jhy/jsoup.git
 > git init /builds/workspace/Jsoup # timeout=10
Fetching upstream changes from https://github.com/jhy/jsoup.git
 > git --version # timeout=10
 > git fetch --tags --progress https://github.com/jhy/jsoup.git +refs/heads/*:refs/remotes/origin/* # timeout=10
 > git config remote.origin.url https://github.com/jhy/jsoup.git # timeout=10
 > git config --add remote.origin.fetch +refs/heads/*:refs/remotes/origin/* # timeout=10
 > git config remote.origin.url https://github.com/jhy/jsoup.git # timeout=10
Fetching upstream changes from https://github.com/jhy/jsoup.git
 > git fetch --tags --progress https://github.com/jhy/jsoup.git +refs/heads/*:refs/remotes/origin/* # timeout=10
 > git rev-parse refs/remotes/origin/master^{commit} # timeout=10
 > git rev-parse refs/remotes/origin/origin/master^{commit} # timeout=10
Checking out Revision 89580cc3d25d0d89ac1f46b349e5cd315883dc79 (refs/remotes/origin/master)
 > git config core.sparsecheckout # timeout=10
 > git checkout -f 89580cc3d25d0d89ac1f46b349e5cd315883dc79 # timeout=10
Commit message: "JUnit 5 dependency aggregator. (#1336)"
 > git rev-list --no-walk 89580cc3d25d0d89ac1f46b349e5cd315883dc79 # timeout=10
[Jsoup] $ /bin/sh -xe /tmp/jenkins649985337961302968.sh
+ + stdbufcurl http://spoon.gforge.inria.fr/jenkins/build.sh
 -i 50k bash
  % Total    % Received % Xferd  Average Speed   Time    Time     Time  Current
                                 Dload  Upload   Total   Spent    Left  Speed

  0     0    0     0    0     0      0      0 --:--:-- --:--:-- --:--:--     0
100 21193  100 21193    0     0   492k      0 --:--:-- --:--:-- --:--:--  504k
 
-------------------------------------------------------
Initizalizes project
-------------------------------------------------------
 
HEAD is now at 89580cc JUnit 5 dependency aggregator. (#1336)

--- Displays variables used in the build ---
Artifact id: jsoup
Version: 1.14.1-SNAPSHOT
Modules job:
- Jsoup
Has checkstyle: true
Has enforcer: true
Git version id: 89580cc3d25d0d89ac1f46b349e5cd315883dc79
Java version: Picked up JAVA_TOOL_OPTIONS: -Dfile.encoding=UTF8
java version "1.8.0_151"
Java(TM) SE Runtime Environment (build 1.8.0_151-b12)
Java HotSpot(TM) 64-Bit Server VM (build 25.151-b12, mixed mode)
Java home: /builds/tools/hudson.model.JDK/JDK_8.0.151
 
-------------------------------------------------------
Compiles project (at the root project if it's a multi module project) without spoon
-------------------------------------------------------
 
Picked up JAVA_TOOL_OPTIONS: -Dfile.encoding=UTF8
[INFO] Scanning for projects...
[INFO]                                                                         
[INFO] ------------------------------------------------------------------------
[INFO] Building jsoup Java HTML Parser 1.14.1-SNAPSHOT
[INFO] ------------------------------------------------------------------------
[INFO] 
[INFO] --- maven-clean-plugin:2.5:clean (default-clean) @ jsoup ---
[INFO] 
[INFO] --- maven-resources-plugin:3.0.1:resources (default-resources) @ jsoup ---
[INFO] Using 'UTF-8' encoding to copy filtered resources.
[INFO] Copying 3 resources to META-INF/
[INFO] 
[INFO] --- maven-compiler-plugin:3.8.0:compile (default-compile) @ jsoup ---
[INFO] Compiling 67 source files to /builds/workspace/Jsoup/target/classes
[INFO] 
[INFO] --- animal-sniffer-maven-plugin:1.16:check (animal-sniffer) @ jsoup ---
[INFO] Checking unresolved references to net.sf.androidscents.signature:android-api-level-10:2.3.3_r2
[INFO] 
[INFO] >>> maven-bundle-plugin:2.5.4:manifest (bundle-manifest) > process-classes @ jsoup >>>
[INFO] 
[INFO] --- maven-resources-plugin:3.0.1:resources (default-resources) @ jsoup ---
[INFO] Using 'UTF-8' encoding to copy filtered resources.
[INFO] Copying 3 resources to META-INF/
[INFO] 
[INFO] --- maven-compiler-plugin:3.8.0:compile (default-compile) @ jsoup ---
[INFO] Nothing to compile - all classes are up to date
[INFO] 
[INFO] --- animal-sniffer-maven-plugin:1.16:check (animal-sniffer) @ jsoup ---
[INFO] Checking unresolved references to net.sf.androidscents.signature:android-api-level-10:2.3.3_r2
[INFO] 
[INFO] <<< maven-bundle-plugin:2.5.4:manifest (bundle-manifest) < process-classes @ jsoup <<<
[INFO] 
[INFO] --- maven-bundle-plugin:2.5.4:manifest (bundle-manifest) @ jsoup ---
[INFO] 
[INFO] --- maven-resources-plugin:3.0.1:testResources (default-testResources) @ jsoup ---
[INFO] Using 'UTF-8' encoding to copy filtered resources.
[INFO] Copying 35 resources
[INFO] 
[INFO] --- maven-compiler-plugin:3.8.0:testCompile (default-testCompile) @ jsoup ---
[INFO] Compiling 53 source files to /builds/workspace/Jsoup/target/test-classes
[INFO] 
[INFO] --- maven-surefire-plugin:3.0.0-M3:test (default-test) @ jsoup ---
[INFO] 
[INFO] -------------------------------------------------------
[INFO]  T E S T S
[INFO] -------------------------------------------------------
[INFO] Running org.jsoup.safety.CleanerTest
[INFO] Tests run: 36, Failures: 0, Errors: 0, Skipped: 0, Time elapsed: 0.401 s - in org.jsoup.safety.CleanerTest
[INFO] Running org.jsoup.parser.TokeniserStateTest
[INFO] Tests run: 20, Failures: 0, Errors: 0, Skipped: 0, Time elapsed: 0.098 s - in org.jsoup.parser.TokeniserStateTest
[INFO] Running org.jsoup.parser.CharacterReaderTest
[INFO] Tests run: 23, Failures: 0, Errors: 0, Skipped: 0, Time elapsed: 0.051 s - in org.jsoup.parser.CharacterReaderTest
[INFO] Running org.jsoup.parser.XmlTreeBuilderTest
[WARNING] Tests run: 25, Failures: 0, Errors: 0, Skipped: 1, Time elapsed: 0.066 s - in org.jsoup.parser.XmlTreeBuilderTest
[INFO] Running org.jsoup.parser.ParserTest
[INFO] Tests run: 2, Failures: 0, Errors: 0, Skipped: 0, Time elapsed: 0.004 s - in org.jsoup.parser.ParserTest
[INFO] Running org.jsoup.parser.HtmlParserTest
[WARNING] Tests run: 147, Failures: 0, Errors: 0, Skipped: 1, Time elapsed: 0.37 s - in org.jsoup.parser.HtmlParserTest
[INFO] Running org.jsoup.parser.TokenQueueTest
[INFO] Tests run: 9, Failures: 0, Errors: 0, Skipped: 0, Time elapsed: 0.003 s - in org.jsoup.parser.TokenQueueTest
[INFO] Running org.jsoup.parser.HtmlTreeBuilderTest
[INFO] Tests run: 1, Failures: 0, Errors: 0, Skipped: 0, Time elapsed: 0.001 s - in org.jsoup.parser.HtmlTreeBuilderTest
[INFO] Running org.jsoup.parser.AttributeParseTest
[INFO] Tests run: 8, Failures: 0, Errors: 0, Skipped: 0, Time elapsed: 0.003 s - in org.jsoup.parser.AttributeParseTest
[INFO] Running org.jsoup.parser.TokeniserTest
[INFO] Tests run: 12, Failures: 0, Errors: 0, Skipped: 0, Time elapsed: 0.049 s - in org.jsoup.parser.TokeniserTest
[INFO] Running org.jsoup.parser.HtmlTreeBuilderStateTest
[INFO] Tests run: 1, Failures: 0, Errors: 0, Skipped: 0, Time elapsed: 0.002 s - in org.jsoup.parser.HtmlTreeBuilderStateTest
[INFO] Running org.jsoup.parser.ParserSettingsTest
[INFO] Tests run: 6, Failures: 0, Errors: 0, Skipped: 0, Time elapsed: 0.01 s - in org.jsoup.parser.ParserSettingsTest
[INFO] Running org.jsoup.parser.TagTest
[INFO] Tests run: 12, Failures: 0, Errors: 0, Skipped: 0, Time elapsed: 0.01 s - in org.jsoup.parser.TagTest
[INFO] Running org.jsoup.integration.ParseTest
[INFO] Tests run: 15, Failures: 0, Errors: 0, Skipped: 0, Time elapsed: 0.213 s - in org.jsoup.integration.ParseTest
[INFO] Running org.jsoup.integration.ConnectTest
2020-04-20 03:23:22.595:INFO::main: Logging initialized @2717ms to org.eclipse.jetty.util.log.StdErrLog
2020-04-20 03:23:22.793:INFO:oejs.Server:main: jetty-9.4.26.v20200117; built: 2020-01-17T12:35:33.676Z; git: 7b38981d25d14afb4a12ff1f2596756144edf695; jvm 1.8.0_151-b12
2020-04-20 03:23:23.022:INFO:oejs.AbstractConnector:main: Started ServerConnector@2584b82d{HTTP/1.1,[http/1.1]}{0.0.0.0:41479}
2020-04-20 03:23:23.026:INFO:oejs.Server:main: Started @3147ms
2020-04-20 03:23:24.132:INFO:oejs.AbstractConnector:main: Stopped ServerConnector@2584b82d{HTTP/1.1,[http/1.1]}{0.0.0.0:0}
[INFO] Tests run: 32, Failures: 0, Errors: 0, Skipped: 0, Time elapsed: 1.679 s - in org.jsoup.integration.ConnectTest
[INFO] Running org.jsoup.integration.UrlConnectTest
[WARNING] Tests run: 1, Failures: 0, Errors: 0, Skipped: 1, Time elapsed: 0.001 s - in org.jsoup.integration.UrlConnectTest
[INFO] Running org.jsoup.nodes.DocumentTest
[WARNING] Tests run: 30, Failures: 0, Errors: 0, Skipped: 1, Time elapsed: 0.037 s - in org.jsoup.nodes.DocumentTest
[INFO] Running org.jsoup.nodes.EntitiesTest
[INFO] Tests run: 15, Failures: 0, Errors: 0, Skipped: 0, Time elapsed: 0.005 s - in org.jsoup.nodes.EntitiesTest
[INFO] Running org.jsoup.nodes.AttributesTest
[INFO] Tests run: 13, Failures: 0, Errors: 0, Skipped: 0, Time elapsed: 0.003 s - in org.jsoup.nodes.AttributesTest
[INFO] Running org.jsoup.nodes.TextNodeTest
[INFO] Tests run: 10, Failures: 0, Errors: 0, Skipped: 0, Time elapsed: 0.009 s - in org.jsoup.nodes.TextNodeTest
[INFO] Running org.jsoup.nodes.DocumentTypeTest
[INFO] Tests run: 5, Failures: 0, Errors: 0, Skipped: 0, Time elapsed: 0.002 s - in org.jsoup.nodes.DocumentTypeTest
[INFO] Running org.jsoup.nodes.LeafNodeTest
[INFO] Tests run: 1, Failures: 0, Errors: 0, Skipped: 0, Time elapsed: 0.002 s - in org.jsoup.nodes.LeafNodeTest
[INFO] Running org.jsoup.nodes.NodeTest
[INFO] Tests run: 25, Failures: 0, Errors: 0, Skipped: 0, Time elapsed: 0.009 s - in org.jsoup.nodes.NodeTest
[INFO] Running org.jsoup.nodes.ElementTest
[INFO] Tests run: 108, Failures: 0, Errors: 0, Skipped: 0, Time elapsed: 0.09 s - in org.jsoup.nodes.ElementTest
[INFO] Running org.jsoup.nodes.AttributeTest
[INFO] Tests run: 7, Failures: 0, Errors: 0, Skipped: 0, Time elapsed: 0.002 s - in org.jsoup.nodes.AttributeTest
[INFO] Running org.jsoup.nodes.CommentTest
[INFO] Tests run: 7, Failures: 0, Errors: 0, Skipped: 0, Time elapsed: 0.011 s - in org.jsoup.nodes.CommentTest
[INFO] Running org.jsoup.nodes.FormElementTest
[INFO] Tests run: 11, Failures: 0, Errors: 0, Skipped: 0, Time elapsed: 0.002 s - in org.jsoup.nodes.FormElementTest
[INFO] Running org.jsoup.select.SelectorTest
[INFO] Tests run: 82, Failures: 0, Errors: 0, Skipped: 0, Time elapsed: 0.077 s - in org.jsoup.select.SelectorTest
[INFO] Running org.jsoup.select.QueryParserTest
[INFO] Tests run: 7, Failures: 0, Errors: 0, Skipped: 0, Time elapsed: 0.002 s - in org.jsoup.select.QueryParserTest
[INFO] Running org.jsoup.select.ElementsTest
[INFO] Tests run: 39, Failures: 0, Errors: 0, Skipped: 0, Time elapsed: 0.022 s - in org.jsoup.select.ElementsTest
[INFO] Running org.jsoup.select.CssTest
[INFO] Tests run: 17, Failures: 0, Errors: 0, Skipped: 0, Time elapsed: 0.049 s - in org.jsoup.select.CssTest
[INFO] Running org.jsoup.select.TraversorTest
[INFO] Tests run: 5, Failures: 0, Errors: 0, Skipped: 0, Time elapsed: 0.023 s - in org.jsoup.select.TraversorTest
[INFO] Running org.jsoup.helper.W3CDomTest
[INFO] Tests run: 8, Failures: 0, Errors: 0, Skipped: 0, Time elapsed: 2.451 s - in org.jsoup.helper.W3CDomTest
[INFO] Running org.jsoup.helper.DataUtilTest
[INFO] Tests run: 19, Failures: 0, Errors: 0, Skipped: 0, Time elapsed: 0.025 s - in org.jsoup.helper.DataUtilTest
[INFO] Running org.jsoup.helper.HttpConnectionTest
[INFO] Tests run: 24, Failures: 0, Errors: 0, Skipped: 0, Time elapsed: 0.017 s - in org.jsoup.helper.HttpConnectionTest
[INFO] Running org.jsoup.internal.ConstrainableInputStreamTest
[WARNING] Tests run: 1, Failures: 0, Errors: 0, Skipped: 1, Time elapsed: 0.001 s - in org.jsoup.internal.ConstrainableInputStreamTest
[INFO] Running org.jsoup.internal.StringUtilTest
[INFO] Tests run: 9, Failures: 0, Errors: 0, Skipped: 0, Time elapsed: 0.005 s - in org.jsoup.internal.StringUtilTest
[INFO] 
[INFO] Results:
[INFO] 
[WARNING] Tests run: 793, Failures: 0, Errors: 0, Skipped: 5
[INFO] 
[INFO] 
[INFO] --- maven-jar-plugin:3.0.2:jar (default-jar) @ jsoup ---
[INFO] Building jar: /builds/workspace/Jsoup/target/jsoup-1.14.1-SNAPSHOT.jar
[INFO] 
[INFO] --- maven-failsafe-plugin:3.0.0-M3:integration-test (default) @ jsoup ---
[INFO] 
[INFO] -------------------------------------------------------
[INFO]  T E S T S
[INFO] -------------------------------------------------------
[INFO] Running org.jsoup.parser.ParserIT
[INFO] Tests run: 2, Failures: 0, Errors: 0, Skipped: 0, Time elapsed: 35.827 s - in org.jsoup.parser.ParserIT
[INFO] Running org.jsoup.integration.ConnectIT
2020-04-20 03:24:04.814:INFO::Thread-1: Logging initialized @36700ms to org.eclipse.jetty.util.log.StdErrLog
2020-04-20 03:24:04.878:INFO:oejs.Server:Thread-1: jetty-9.4.26.v20200117; built: 2020-01-17T12:35:33.676Z; git: 7b38981d25d14afb4a12ff1f2596756144edf695; jvm 1.8.0_151-b12
2020-04-20 03:24:04.929:INFO:oejs.AbstractConnector:Thread-1: Started ServerConnector@c7491a2{HTTP/1.1,[http/1.1]}{0.0.0.0:35549}
2020-04-20 03:24:04.933:INFO:oejs.Server:Thread-1: Started @36819ms
2020-04-20 03:24:12.088:INFO:oejsh.ContextHandler:qtp1803507348-18: org.jsoup.integration.servlets.SlowRider-59df2ead: Remote connection lost
2020-04-20 03:24:23.129:INFO:oejsh.ContextHandler:qtp1803507348-19: org.jsoup.integration.servlets.SlowRider-59df2ead: Remote connection lost
[INFO] Tests run: 5, Failures: 0, Errors: 0, Skipped: 0, Time elapsed: 19.404 s - in org.jsoup.integration.ConnectIT
[INFO] Running org.jsoup.nodes.ElementIT
[INFO] Tests run: 2, Failures: 0, Errors: 0, Skipped: 0, Time elapsed: 0.843 s - in org.jsoup.nodes.ElementIT
[INFO] 
[INFO] Results:
[INFO] 
[INFO] Tests run: 9, Failures: 0, Errors: 0, Skipped: 0
[INFO] 
[INFO] 
[INFO] --- maven-javadoc-plugin:3.1.0:jar (attach-javadoc) @ jsoup ---
[INFO] 
Loading source files for package org.jsoup...
Loading source files for package org.jsoup.safety...
Loading source files for package org.jsoup.examples...
Loading source files for package org.jsoup.parser...
Loading source files for package org.jsoup.nodes...
Loading source files for package org.jsoup.select...
Loading source files for package org.jsoup.helper...
Loading source files for package org.jsoup.internal...
Constructing Javadoc information...
Standard Doclet version 1.8.0_151
Building tree for all the packages and classes...
Generating /builds/workspace/Jsoup/target/apidocs/org/jsoup/Connection.html...
Generating /builds/workspace/Jsoup/target/apidocs/org/jsoup/Connection.Base.html...
Generating /builds/workspace/Jsoup/target/apidocs/org/jsoup/Connection.KeyVal.html...
Generating /builds/workspace/Jsoup/target/apidocs/org/jsoup/Connection.Method.html...
Generating /builds/workspace/Jsoup/target/apidocs/org/jsoup/Connection.Request.html...
Generating /builds/workspace/Jsoup/target/apidocs/org/jsoup/Connection.Response.html...
Generating /builds/workspace/Jsoup/target/apidocs/org/jsoup/HttpStatusException.html...
Generating /builds/workspace/Jsoup/target/apidocs/org/jsoup/Jsoup.html...
Generating /builds/workspace/Jsoup/target/apidocs/org/jsoup/SerializationException.html...
Generating /builds/workspace/Jsoup/target/apidocs/org/jsoup/UncheckedIOException.html...
Generating /builds/workspace/Jsoup/target/apidocs/org/jsoup/UnsupportedMimeTypeException.html...
Generating /builds/workspace/Jsoup/target/apidocs/org/jsoup/safety/Cleaner.html...
Generating /builds/workspace/Jsoup/target/apidocs/org/jsoup/safety/Whitelist.html...
Generating /builds/workspace/Jsoup/target/apidocs/org/jsoup/examples/HtmlToPlainText.html...
Generating /builds/workspace/Jsoup/target/apidocs/org/jsoup/examples/ListLinks.html...
Generating /builds/workspace/Jsoup/target/apidocs/org/jsoup/examples/Wikipedia.html...
Generating /builds/workspace/Jsoup/target/apidocs/org/jsoup/parser/CharacterReader.html...
Generating /builds/workspace/Jsoup/target/apidocs/org/jsoup/parser/HtmlTreeBuilder.html...
Generating /builds/workspace/Jsoup/target/apidocs/org/jsoup/parser/ParseError.html...
Generating /builds/workspace/Jsoup/target/apidocs/org/jsoup/parser/ParseErrorList.html...
Generating /builds/workspace/Jsoup/target/apidocs/org/jsoup/parser/Parser.html...
Generating /builds/workspace/Jsoup/target/apidocs/org/jsoup/parser/ParseSettings.html...
Generating /builds/workspace/Jsoup/target/apidocs/org/jsoup/parser/Tag.html...
Generating /builds/workspace/Jsoup/target/apidocs/org/jsoup/parser/TokenQueue.html...
Generating /builds/workspace/Jsoup/target/apidocs/org/jsoup/parser/XmlTreeBuilder.html...
Generating /builds/workspace/Jsoup/target/apidocs/org/jsoup/nodes/Attribute.html...
Generating /builds/workspace/Jsoup/target/apidocs/org/jsoup/nodes/Attributes.html...
Generating /builds/workspace/Jsoup/target/apidocs/org/jsoup/nodes/CDataNode.html...
Generating /builds/workspace/Jsoup/target/apidocs/org/jsoup/nodes/Comment.html...
Generating /builds/workspace/Jsoup/target/apidocs/org/jsoup/nodes/DataNode.html...
Generating /builds/workspace/Jsoup/target/apidocs/org/jsoup/nodes/Document.html...
Generating /builds/workspace/Jsoup/target/apidocs/org/jsoup/nodes/Document.OutputSettings.html...
Generating /builds/workspace/Jsoup/target/apidocs/org/jsoup/nodes/Document.OutputSettings.Syntax.html...
Generating /builds/workspace/Jsoup/target/apidocs/org/jsoup/nodes/Document.QuirksMode.html...
Generating /builds/workspace/Jsoup/target/apidocs/org/jsoup/nodes/DocumentType.html...
Generating /builds/workspace/Jsoup/target/apidocs/org/jsoup/nodes/Element.html...
Generating /builds/workspace/Jsoup/target/apidocs/org/jsoup/nodes/Entities.html...
Generating /builds/workspace/Jsoup/target/apidocs/org/jsoup/nodes/Entities.EscapeMode.html...
Generating /builds/workspace/Jsoup/target/apidocs/org/jsoup/nodes/FormElement.html...
Generating /builds/workspace/Jsoup/target/apidocs/org/jsoup/nodes/Node.html...
Generating /builds/workspace/Jsoup/target/apidocs/org/jsoup/nodes/PseudoTextElement.html...
Generating /builds/workspace/Jsoup/target/apidocs/org/jsoup/nodes/TextNode.html...
Generating /builds/workspace/Jsoup/target/apidocs/org/jsoup/nodes/XmlDeclaration.html...
Generating /builds/workspace/Jsoup/target/apidocs/org/jsoup/select/Collector.html...
Generating /builds/workspace/Jsoup/target/apidocs/org/jsoup/select/Elements.html...
Generating /builds/workspace/Jsoup/target/apidocs/org/jsoup/select/Evaluator.html...
Generating /builds/workspace/Jsoup/target/apidocs/org/jsoup/select/Evaluator.AllElements.html...
Generating /builds/workspace/Jsoup/target/apidocs/org/jsoup/select/Evaluator.Attribute.html...
Generating /builds/workspace/Jsoup/target/apidocs/org/jsoup/select/Evaluator.AttributeKeyPair.html...
Generating /builds/workspace/Jsoup/target/apidocs/org/jsoup/select/Evaluator.AttributeStarting.html...
Generating /builds/workspace/Jsoup/target/apidocs/org/jsoup/select/Evaluator.AttributeWithValue.html...
Generating /builds/workspace/Jsoup/target/apidocs/org/jsoup/select/Evaluator.AttributeWithValueContaining.html...
Generating /builds/workspace/Jsoup/target/apidocs/org/jsoup/select/Evaluator.AttributeWithValueEnding.html...
Generating /builds/workspace/Jsoup/target/apidocs/org/jsoup/select/Evaluator.AttributeWithValueMatching.html...
Generating /builds/workspace/Jsoup/target/apidocs/org/jsoup/select/Evaluator.AttributeWithValueNot.html...
Generating /builds/workspace/Jsoup/target/apidocs/org/jsoup/select/Evaluator.AttributeWithValueStarting.html...
Generating /builds/workspace/Jsoup/target/apidocs/org/jsoup/select/Evaluator.Class.html...
Generating /builds/workspace/Jsoup/target/apidocs/org/jsoup/select/Evaluator.ContainsData.html...
Generating /builds/workspace/Jsoup/target/apidocs/org/jsoup/select/Evaluator.ContainsOwnText.html...
Generating /builds/workspace/Jsoup/target/apidocs/org/jsoup/select/Evaluator.ContainsText.html...
Generating /builds/workspace/Jsoup/target/apidocs/org/jsoup/select/Evaluator.CssNthEvaluator.html...
Generating /builds/workspace/Jsoup/target/apidocs/org/jsoup/select/Evaluator.Id.html...
Generating /builds/workspace/Jsoup/target/apidocs/org/jsoup/select/Evaluator.IndexEquals.html...
Generating /builds/workspace/Jsoup/target/apidocs/org/jsoup/select/Evaluator.IndexEvaluator.html...
Generating /builds/workspace/Jsoup/target/apidocs/org/jsoup/select/Evaluator.IndexGreaterThan.html...
Generating /builds/workspace/Jsoup/target/apidocs/org/jsoup/select/Evaluator.IndexLessThan.html...
Generating /builds/workspace/Jsoup/target/apidocs/org/jsoup/select/Evaluator.IsEmpty.html...
Generating /builds/workspace/Jsoup/target/apidocs/org/jsoup/select/Evaluator.IsFirstChild.html...
Generating /builds/workspace/Jsoup/target/apidocs/org/jsoup/select/Evaluator.IsFirstOfType.html...
Generating /builds/workspace/Jsoup/target/apidocs/org/jsoup/select/Evaluator.IsLastChild.html...
Generating /builds/workspace/Jsoup/target/apidocs/org/jsoup/select/Evaluator.IsLastOfType.html...
Generating /builds/workspace/Jsoup/target/apidocs/org/jsoup/select/Evaluator.IsNthChild.html...
Generating /builds/workspace/Jsoup/target/apidocs/org/jsoup/select/Evaluator.IsNthLastChild.html...
Generating /builds/workspace/Jsoup/target/apidocs/org/jsoup/select/Evaluator.IsNthLastOfType.html...
Generating /builds/workspace/Jsoup/target/apidocs/org/jsoup/select/Evaluator.IsNthOfType.html...
Generating /builds/workspace/Jsoup/target/apidocs/org/jsoup/select/Evaluator.IsOnlyChild.html...
Generating /builds/workspace/Jsoup/target/apidocs/org/jsoup/select/Evaluator.IsOnlyOfType.html...
Generating /builds/workspace/Jsoup/target/apidocs/org/jsoup/select/Evaluator.IsRoot.html...
Generating /builds/workspace/Jsoup/target/apidocs/org/jsoup/select/Evaluator.Matches.html...
Generating /builds/workspace/Jsoup/target/apidocs/org/jsoup/select/Evaluator.MatchesOwn.html...
Generating /builds/workspace/Jsoup/target/apidocs/org/jsoup/select/Evaluator.MatchText.html...
Generating /builds/workspace/Jsoup/target/apidocs/org/jsoup/select/Evaluator.Tag.html...
Generating /builds/workspace/Jsoup/target/apidocs/org/jsoup/select/Evaluator.TagEndsWith.html...
Generating /builds/workspace/Jsoup/target/apidocs/org/jsoup/select/NodeFilter.html...
Generating /builds/workspace/Jsoup/target/apidocs/org/jsoup/select/NodeFilter.FilterResult.html...
Generating /builds/workspace/Jsoup/target/apidocs/org/jsoup/select/NodeTraversor.html...
Generating /builds/workspace/Jsoup/target/apidocs/org/jsoup/select/NodeVisitor.html...
Generating /builds/workspace/Jsoup/target/apidocs/org/jsoup/select/QueryParser.html...
Generating /builds/workspace/Jsoup/target/apidocs/org/jsoup/select/Selector.html...
Generating /builds/workspace/Jsoup/target/apidocs/org/jsoup/select/Selector.SelectorParseException.html...
Generating /builds/workspace/Jsoup/target/apidocs/org/jsoup/helper/ChangeNotifyingArrayList.html...
Generating /builds/workspace/Jsoup/target/apidocs/org/jsoup/helper/DataUtil.html...
Generating /builds/workspace/Jsoup/target/apidocs/org/jsoup/helper/HttpConnection.html...
Generating /builds/workspace/Jsoup/target/apidocs/org/jsoup/helper/HttpConnection.KeyVal.html...
Generating /builds/workspace/Jsoup/target/apidocs/org/jsoup/helper/HttpConnection.Request.html...
Generating /builds/workspace/Jsoup/target/apidocs/org/jsoup/helper/HttpConnection.Response.html...
Generating /builds/workspace/Jsoup/target/apidocs/org/jsoup/helper/Validate.html...
Generating /builds/workspace/Jsoup/target/apidocs/org/jsoup/helper/W3CDom.html...
Generating /builds/workspace/Jsoup/target/apidocs/org/jsoup/helper/W3CDom.W3CBuilder.html...
Generating /builds/workspace/Jsoup/target/apidocs/org/jsoup/internal/ConstrainableInputStream.html...
Generating /builds/workspace/Jsoup/target/apidocs/org/jsoup/internal/Normalizer.html...
Generating /builds/workspace/Jsoup/target/apidocs/org/jsoup/internal/StringUtil.html...
Generating /builds/workspace/Jsoup/target/apidocs/overview-frame.html...
Generating /builds/workspace/Jsoup/target/apidocs/org/jsoup/package-frame.html...
Generating /builds/workspace/Jsoup/target/apidocs/org/jsoup/package-summary.html...
Generating /builds/workspace/Jsoup/target/apidocs/org/jsoup/package-tree.html...
Generating /builds/workspace/Jsoup/target/apidocs/org/jsoup/examples/package-frame.html...
Generating /builds/workspace/Jsoup/target/apidocs/org/jsoup/examples/package-summary.html...
Generating /builds/workspace/Jsoup/target/apidocs/org/jsoup/examples/package-tree.html...
Generating /builds/workspace/Jsoup/target/apidocs/org/jsoup/helper/package-frame.html...
Generating /builds/workspace/Jsoup/target/apidocs/org/jsoup/helper/package-summary.html...
Generating /builds/workspace/Jsoup/target/apidocs/org/jsoup/helper/package-tree.html...
Generating /builds/workspace/Jsoup/target/apidocs/org/jsoup/internal/package-frame.html...
Generating /builds/workspace/Jsoup/target/apidocs/org/jsoup/internal/package-summary.html...
Generating /builds/workspace/Jsoup/target/apidocs/org/jsoup/internal/package-tree.html...
Generating /builds/workspace/Jsoup/target/apidocs/org/jsoup/nodes/package-frame.html...
Generating /builds/workspace/Jsoup/target/apidocs/org/jsoup/nodes/package-summary.html...
Generating /builds/workspace/Jsoup/target/apidocs/org/jsoup/nodes/package-tree.html...
Generating /builds/workspace/Jsoup/target/apidocs/org/jsoup/parser/package-frame.html...
Generating /builds/workspace/Jsoup/target/apidocs/org/jsoup/parser/package-summary.html...
Generating /builds/workspace/Jsoup/target/apidocs/org/jsoup/parser/package-tree.html...
Generating /builds/workspace/Jsoup/target/apidocs/org/jsoup/safety/package-frame.html...
Generating /builds/workspace/Jsoup/target/apidocs/org/jsoup/safety/package-summary.html...
Generating /builds/workspace/Jsoup/target/apidocs/org/jsoup/safety/package-tree.html...
Generating /builds/workspace/Jsoup/target/apidocs/org/jsoup/select/package-frame.html...
Generating /builds/workspace/Jsoup/target/apidocs/org/jsoup/select/package-summary.html...
Generating /builds/workspace/Jsoup/target/apidocs/org/jsoup/select/package-tree.html...
Generating /builds/workspace/Jsoup/target/apidocs/constant-values.html...
Generating /builds/workspace/Jsoup/target/apidocs/serialized-form.html...
Generating /builds/workspace/Jsoup/target/apidocs/org/jsoup/class-use/Connection.html...
Generating /builds/workspace/Jsoup/target/apidocs/org/jsoup/class-use/Connection.Method.html...
Generating /builds/workspace/Jsoup/target/apidocs/org/jsoup/class-use/Connection.Base.html...
Generating /builds/workspace/Jsoup/target/apidocs/org/jsoup/class-use/Connection.Request.html...
Generating /builds/workspace/Jsoup/target/apidocs/org/jsoup/class-use/Connection.Response.html...
Generating /builds/workspace/Jsoup/target/apidocs/org/jsoup/class-use/Connection.KeyVal.html...
Generating /builds/workspace/Jsoup/target/apidocs/org/jsoup/class-use/UnsupportedMimeTypeException.html...
Generating /builds/workspace/Jsoup/target/apidocs/org/jsoup/class-use/UncheckedIOException.html...
Generating /builds/workspace/Jsoup/target/apidocs/org/jsoup/class-use/SerializationException.html...
Generating /builds/workspace/Jsoup/target/apidocs/org/jsoup/class-use/Jsoup.html...
Generating /builds/workspace/Jsoup/target/apidocs/org/jsoup/class-use/HttpStatusException.html...
Generating /builds/workspace/Jsoup/target/apidocs/org/jsoup/safety/class-use/Whitelist.html...
Generating /builds/workspace/Jsoup/target/apidocs/org/jsoup/safety/class-use/Cleaner.html...
Generating /builds/workspace/Jsoup/target/apidocs/org/jsoup/examples/class-use/Wikipedia.html...
Generating /builds/workspace/Jsoup/target/apidocs/org/jsoup/examples/class-use/HtmlToPlainText.html...
Generating /builds/workspace/Jsoup/target/apidocs/org/jsoup/examples/class-use/ListLinks.html...
Generating /builds/workspace/Jsoup/target/apidocs/org/jsoup/parser/class-use/TokenQueue.html...
Generating /builds/workspace/Jsoup/target/apidocs/org/jsoup/parser/class-use/XmlTreeBuilder.html...
Generating /builds/workspace/Jsoup/target/apidocs/org/jsoup/parser/class-use/ParseSettings.html...
Generating /builds/workspace/Jsoup/target/apidocs/org/jsoup/parser/class-use/Parser.html...
Generating /builds/workspace/Jsoup/target/apidocs/org/jsoup/parser/class-use/ParseErrorList.html...
Generating /builds/workspace/Jsoup/target/apidocs/org/jsoup/parser/class-use/Tag.html...
Generating /builds/workspace/Jsoup/target/apidocs/org/jsoup/parser/class-use/HtmlTreeBuilder.html...
Generating /builds/workspace/Jsoup/target/apidocs/org/jsoup/parser/class-use/CharacterReader.html...
Generating /builds/workspace/Jsoup/target/apidocs/org/jsoup/parser/class-use/ParseError.html...
Generating /builds/workspace/Jsoup/target/apidocs/org/jsoup/nodes/class-use/FormElement.html...
Generating /builds/workspace/Jsoup/target/apidocs/org/jsoup/nodes/class-use/Attribute.html...
Generating /builds/workspace/Jsoup/target/apidocs/org/jsoup/nodes/class-use/XmlDeclaration.html...
Generating /builds/workspace/Jsoup/target/apidocs/org/jsoup/nodes/class-use/DataNode.html...
Generating /builds/workspace/Jsoup/target/apidocs/org/jsoup/nodes/class-use/Document.html...
Generating /builds/workspace/Jsoup/target/apidocs/org/jsoup/nodes/class-use/Document.OutputSettings.html...
Generating /builds/workspace/Jsoup/target/apidocs/org/jsoup/nodes/class-use/Document.OutputSettings.Syntax.html...
Generating /builds/workspace/Jsoup/target/apidocs/org/jsoup/nodes/class-use/Document.QuirksMode.html...
Generating /builds/workspace/Jsoup/target/apidocs/org/jsoup/nodes/class-use/DocumentType.html...
Generating /builds/workspace/Jsoup/target/apidocs/org/jsoup/nodes/class-use/Entities.html...
Generating /builds/workspace/Jsoup/target/apidocs/org/jsoup/nodes/class-use/Entities.EscapeMode.html...
Generating /builds/workspace/Jsoup/target/apidocs/org/jsoup/nodes/class-use/CDataNode.html...
Generating /builds/workspace/Jsoup/target/apidocs/org/jsoup/nodes/class-use/Attributes.html...
Generating /builds/workspace/Jsoup/target/apidocs/org/jsoup/nodes/class-use/TextNode.html...
Generating /builds/workspace/Jsoup/target/apidocs/org/jsoup/nodes/class-use/PseudoTextElement.html...
Generating /builds/workspace/Jsoup/target/apidocs/org/jsoup/nodes/class-use/Comment.html...
Generating /builds/workspace/Jsoup/target/apidocs/org/jsoup/nodes/class-use/Node.html...
Generating /builds/workspace/Jsoup/target/apidocs/org/jsoup/nodes/class-use/Element.html...
Generating /builds/workspace/Jsoup/target/apidocs/org/jsoup/select/class-use/NodeFilter.html...
Generating /builds/workspace/Jsoup/target/apidocs/org/jsoup/select/class-use/NodeFilter.FilterResult.html...
Generating /builds/workspace/Jsoup/target/apidocs/org/jsoup/select/class-use/Selector.html...
Generating /builds/workspace/Jsoup/target/apidocs/org/jsoup/select/class-use/Selector.SelectorParseException.html...
Generating /builds/workspace/Jsoup/target/apidocs/org/jsoup/select/class-use/NodeTraversor.html...
Generating /builds/workspace/Jsoup/target/apidocs/org/jsoup/select/class-use/Collector.html...
Generating /builds/workspace/Jsoup/target/apidocs/org/jsoup/select/class-use/Evaluator.html...
Generating /builds/workspace/Jsoup/target/apidocs/org/jsoup/select/class-use/Evaluator.Tag.html...
Generating /builds/workspace/Jsoup/target/apidocs/org/jsoup/select/class-use/Evaluator.TagEndsWith.html...
Generating /builds/workspace/Jsoup/target/apidocs/org/jsoup/select/class-use/Evaluator.Id.html...
Generating /builds/workspace/Jsoup/target/apidocs/org/jsoup/select/class-use/Evaluator.Class.html...
Generating /builds/workspace/Jsoup/target/apidocs/org/jsoup/select/class-use/Evaluator.Attribute.html...
Generating /builds/workspace/Jsoup/target/apidocs/org/jsoup/select/class-use/Evaluator.AttributeStarting.html...
Generating /builds/workspace/Jsoup/target/apidocs/org/jsoup/select/class-use/Evaluator.AttributeWithValue.html...
Generating /builds/workspace/Jsoup/target/apidocs/org/jsoup/select/class-use/Evaluator.AttributeWithValueNot.html...
Generating /builds/workspace/Jsoup/target/apidocs/org/jsoup/select/class-use/Evaluator.AttributeWithValueStarting.html...
Generating /builds/workspace/Jsoup/target/apidocs/org/jsoup/select/class-use/Evaluator.AttributeWithValueEnding.html...
Generating /builds/workspace/Jsoup/target/apidocs/org/jsoup/select/class-use/Evaluator.AttributeWithValueContaining.html...
Generating /builds/workspace/Jsoup/target/apidocs/org/jsoup/select/class-use/Evaluator.AttributeWithValueMatching.html...
Generating /builds/workspace/Jsoup/target/apidocs/org/jsoup/select/class-use/Evaluator.AttributeKeyPair.html...
Generating /builds/workspace/Jsoup/target/apidocs/org/jsoup/select/class-use/Evaluator.AllElements.html...
Generating /builds/workspace/Jsoup/target/apidocs/org/jsoup/select/class-use/Evaluator.IndexLessThan.html...
Generating /builds/workspace/Jsoup/target/apidocs/org/jsoup/select/class-use/Evaluator.IndexGreaterThan.html...
Generating /builds/workspace/Jsoup/target/apidocs/org/jsoup/select/class-use/Evaluator.IndexEquals.html...
Generating /builds/workspace/Jsoup/target/apidocs/org/jsoup/select/class-use/Evaluator.IsLastChild.html...
Generating /builds/workspace/Jsoup/target/apidocs/org/jsoup/select/class-use/Evaluator.IsFirstOfType.html...
Generating /builds/workspace/Jsoup/target/apidocs/org/jsoup/select/class-use/Evaluator.IsLastOfType.html...
Generating /builds/workspace/Jsoup/target/apidocs/org/jsoup/select/class-use/Evaluator.CssNthEvaluator.html...
Generating /builds/workspace/Jsoup/target/apidocs/org/jsoup/select/class-use/Evaluator.IsNthChild.html...
Generating /builds/workspace/Jsoup/target/apidocs/org/jsoup/select/class-use/Evaluator.IsNthLastChild.html...
Generating /builds/workspace/Jsoup/target/apidocs/org/jsoup/select/class-use/Evaluator.IsNthOfType.html...
Generating /builds/workspace/Jsoup/target/apidocs/org/jsoup/select/class-use/Evaluator.IsNthLastOfType.html...
Generating /builds/workspace/Jsoup/target/apidocs/org/jsoup/select/class-use/Evaluator.IsFirstChild.html...
Generating /builds/workspace/Jsoup/target/apidocs/org/jsoup/select/class-use/Evaluator.IsRoot.html...
Generating /builds/workspace/Jsoup/target/apidocs/org/jsoup/select/class-use/Evaluator.IsOnlyChild.html...
Generating /builds/workspace/Jsoup/target/apidocs/org/jsoup/select/class-use/Evaluator.IsOnlyOfType.html...
Generating /builds/workspace/Jsoup/target/apidocs/org/jsoup/select/class-use/Evaluator.IsEmpty.html...
Generating /builds/workspace/Jsoup/target/apidocs/org/jsoup/select/class-use/Evaluator.IndexEvaluator.html...
Generating /builds/workspace/Jsoup/target/apidocs/org/jsoup/select/class-use/Evaluator.ContainsText.html...
Generating /builds/workspace/Jsoup/target/apidocs/org/jsoup/select/class-use/Evaluator.ContainsData.html...
Generating /builds/workspace/Jsoup/target/apidocs/org/jsoup/select/class-use/Evaluator.ContainsOwnText.html...
Generating /builds/workspace/Jsoup/target/apidocs/org/jsoup/select/class-use/Evaluator.Matches.html...
Generating /builds/workspace/Jsoup/target/apidocs/org/jsoup/select/class-use/Evaluator.MatchesOwn.html...
Generating /builds/workspace/Jsoup/target/apidocs/org/jsoup/select/class-use/Evaluator.MatchText.html...
Generating /builds/workspace/Jsoup/target/apidocs/org/jsoup/select/class-use/NodeVisitor.html...
Generating /builds/workspace/Jsoup/target/apidocs/org/jsoup/select/class-use/QueryParser.html...
Generating /builds/workspace/Jsoup/target/apidocs/org/jsoup/select/class-use/Elements.html...
Generating /builds/workspace/Jsoup/target/apidocs/org/jsoup/helper/class-use/ChangeNotifyingArrayList.html...
Generating /builds/workspace/Jsoup/target/apidocs/org/jsoup/helper/class-use/HttpConnection.html...
Generating /builds/workspace/Jsoup/target/apidocs/org/jsoup/helper/class-use/HttpConnection.Request.html...
Generating /builds/workspace/Jsoup/target/apidocs/org/jsoup/helper/class-use/HttpConnection.Response.html...
Generating /builds/workspace/Jsoup/target/apidocs/org/jsoup/helper/class-use/HttpConnection.KeyVal.html...
Generating /builds/workspace/Jsoup/target/apidocs/org/jsoup/helper/class-use/Validate.html...
Generating /builds/workspace/Jsoup/target/apidocs/org/jsoup/helper/class-use/W3CDom.html...
Generating /builds/workspace/Jsoup/target/apidocs/org/jsoup/helper/class-use/W3CDom.W3CBuilder.html...
Generating /builds/workspace/Jsoup/target/apidocs/org/jsoup/helper/class-use/DataUtil.html...
Generating /builds/workspace/Jsoup/target/apidocs/org/jsoup/internal/class-use/StringUtil.html...
Generating /builds/workspace/Jsoup/target/apidocs/org/jsoup/internal/class-use/ConstrainableInputStream.html...
Generating /builds/workspace/Jsoup/target/apidocs/org/jsoup/internal/class-use/Normalizer.html...
Generating /builds/workspace/Jsoup/target/apidocs/org/jsoup/package-use.html...
Generating /builds/workspace/Jsoup/target/apidocs/org/jsoup/examples/package-use.html...
Generating /builds/workspace/Jsoup/target/apidocs/org/jsoup/helper/package-use.html...
Generating /builds/workspace/Jsoup/target/apidocs/org/jsoup/internal/package-use.html...
Generating /builds/workspace/Jsoup/target/apidocs/org/jsoup/nodes/package-use.html...
Generating /builds/workspace/Jsoup/target/apidocs/org/jsoup/parser/package-use.html...
Generating /builds/workspace/Jsoup/target/apidocs/org/jsoup/safety/package-use.html...
Generating /builds/workspace/Jsoup/target/apidocs/org/jsoup/select/package-use.html...
Building index for all the packages and classes...
Generating /builds/workspace/Jsoup/target/apidocs/overview-tree.html...
Generating /builds/workspace/Jsoup/target/apidocs/index-all.html...
Generating /builds/workspace/Jsoup/target/apidocs/deprecated-list.html...
Building index for all classes...
Generating /builds/workspace/Jsoup/target/apidocs/allclasses-frame.html...
Generating /builds/workspace/Jsoup/target/apidocs/allclasses-noframe.html...
Generating /builds/workspace/Jsoup/target/apidocs/index.html...
Generating /builds/workspace/Jsoup/target/apidocs/overview-summary.html...
Generating /builds/workspace/Jsoup/target/apidocs/help-doc.html...
[INFO] Building jar: /builds/workspace/Jsoup/target/jsoup-1.14.1-SNAPSHOT-javadoc.jar
[INFO] 
[INFO] >>> maven-source-plugin:3.0.1:jar (attach-sources) > generate-sources @ jsoup >>>
[INFO] 
[INFO] <<< maven-source-plugin:3.0.1:jar (attach-sources) < generate-sources @ jsoup <<<
[INFO] 
[INFO] --- maven-source-plugin:3.0.1:jar (attach-sources) @ jsoup ---
[INFO] Building jar: /builds/workspace/Jsoup/target/jsoup-1.14.1-SNAPSHOT-sources.jar
[INFO] 
[INFO] --- maven-failsafe-plugin:3.0.0-M3:verify (default) @ jsoup ---
[INFO] 
[INFO] --- maven-install-plugin:2.5.2:install (default-install) @ jsoup ---
[INFO] Installing /builds/workspace/Jsoup/target/jsoup-1.14.1-SNAPSHOT.jar to /builds/.m2/repository/org/jsoup/jsoup/1.14.1-SNAPSHOT/jsoup-1.14.1-SNAPSHOT.jar
[INFO] Installing /builds/workspace/Jsoup/pom.xml to /builds/.m2/repository/org/jsoup/jsoup/1.14.1-SNAPSHOT/jsoup-1.14.1-SNAPSHOT.pom
[INFO] Installing /builds/workspace/Jsoup/target/jsoup-1.14.1-SNAPSHOT-javadoc.jar to /builds/.m2/repository/org/jsoup/jsoup/1.14.1-SNAPSHOT/jsoup-1.14.1-SNAPSHOT-javadoc.jar
[INFO] Installing /builds/workspace/Jsoup/target/jsoup-1.14.1-SNAPSHOT-sources.jar to /builds/.m2/repository/org/jsoup/jsoup/1.14.1-SNAPSHOT/jsoup-1.14.1-SNAPSHOT-sources.jar
[INFO] ------------------------------------------------------------------------
[INFO] BUILD SUCCESS
[INFO] ------------------------------------------------------------------------
[INFO] Total time: 01:26 min
[INFO] Finished at: 2020-04-20T03:24:32+02:00
[INFO] Final Memory: 34M/207M
[INFO] ------------------------------------------------------------------------
 
--- Displays results of the maven compile ---
Time to compile: 88286
Number of tests: 793
Number of tests skipped: 5
Number of failures in tests: 0
Number of errors in tests: 0
 
-------------------------------------------------------
Inserts the maven plugin to spoon the project
-------------------------------------------------------
 
Picked up JAVA_TOOL_OPTIONS: -Dfile.encoding=UTF8
[INFO] Scanning for projects...
[INFO]                                                                         
[INFO] ------------------------------------------------------------------------
[INFO] Building jsoup Java HTML Parser 1.14.1-SNAPSHOT
[INFO] ------------------------------------------------------------------------
[INFO] 
[INFO] --- maven-dependency-plugin:2.8:purge-local-repository (default-cli) @ jsoup ---
[INFO] ------------------------------------------------------------------------
[INFO] BUILD SUCCESS
[INFO] ------------------------------------------------------------------------
[INFO] Total time: 1.759 s
[INFO] Finished at: 2020-04-20T03:24:36+02:00
[INFO] Final Memory: 17M/143M
[INFO] ------------------------------------------------------------------------
Picked up JAVA_TOOL_OPTIONS: -Dfile.encoding=UTF8
[INFO] Scanning for projects...
[INFO]                                                                         
[INFO] ------------------------------------------------------------------------
[INFO] Building jsoup Java HTML Parser 1.14.1-SNAPSHOT
[INFO] ------------------------------------------------------------------------
[INFO] 
[INFO] --- maven-clean-plugin:2.5:clean (default-clean) @ jsoup ---
[INFO] Deleting /builds/workspace/Jsoup/target
[INFO] 
[INFO] --- spoon-maven-plugin:3.1:generate (default) @ jsoup ---
Downloading: https://oss.sonatype.org/content/repositories/snapshots/fr/inria/gforge/spoon/spoon-core/maven-metadata.xml
Downloading: https://repo.maven.apache.org/maven2/fr/inria/gforge/spoon/spoon-core/maven-metadata.xml
Downloading: http://maven.inria.fr/artifactory/spoon-public-snapshot/fr/inria/gforge/spoon/spoon-core/maven-metadata.xml
687/687 B   
            
Downloaded: http://maven.inria.fr/artifactory/spoon-public-snapshot/fr/inria/gforge/spoon/spoon-core/maven-metadata.xml (687 B at 5.0 KB/sec)
2/4 KB      
3/4 KB   
4/4 KB   
         
Downloaded: https://repo.maven.apache.org/maven2/fr/inria/gforge/spoon/spoon-core/maven-metadata.xml (4 KB at 12.9 KB/sec)
         
Downloading: https://repo.maven.apache.org/maven2/fr/inria/gforge/spoon/spoon-core/7.0.0/spoon-core-7.0.0.pom
2/22 KB   
3/22 KB   
5/22 KB   
6/22 KB   
7/22 KB   
9/22 KB   
10/22 KB   
11/22 KB   
13/22 KB   
14/22 KB   
15/22 KB   
17/22 KB   
18/22 KB   
19/22 KB   
21/22 KB   
22/22 KB   
           
Downloaded: https://repo.maven.apache.org/maven2/fr/inria/gforge/spoon/spoon-core/7.0.0/spoon-core-7.0.0.pom (22 KB at 1011.7 KB/sec)
Downloading: http://maven.inria.fr/artifactory/spoon-public-snapshot/fr/inria/gforge/spoon/spoon-core/7.1.0-SNAPSHOT/maven-metadata.xml
Downloading: https://oss.sonatype.org/content/repositories/snapshots/fr/inria/gforge/spoon/spoon-core/7.1.0-SNAPSHOT/maven-metadata.xml
1017/1017 B   
              
Downloaded: http://maven.inria.fr/artifactory/spoon-public-snapshot/fr/inria/gforge/spoon/spoon-core/7.1.0-SNAPSHOT/maven-metadata.xml (1017 B at 19.9 KB/sec)
              
Downloading: http://maven.inria.fr/artifactory/spoon-public-snapshot/fr/inria/gforge/spoon/spoon-core/7.1.0-SNAPSHOT/spoon-core-7.1.0-20181011.225349-264.pom
4/23 KB       
8/23 KB   
12/23 KB   
14/23 KB   
18/23 KB   
22/23 KB   
23/23 KB   
           
Downloaded: http://maven.inria.fr/artifactory/spoon-public-snapshot/fr/inria/gforge/spoon/spoon-core/7.1.0-SNAPSHOT/spoon-core-7.1.0-20181011.225349-264.pom (23 KB at 511.9 KB/sec)
Downloading: https://repo.maven.apache.org/maven2/fr/inria/gforge/spoon/spoon-core/7.1.0/spoon-core-7.1.0.pom
2/23 KB    
3/23 KB   
5/23 KB   
6/23 KB   
7/23 KB   
9/23 KB   
10/23 KB   
11/23 KB   
13/23 KB   
14/23 KB   
15/23 KB   
17/23 KB   
18/23 KB   
19/23 KB   
21/23 KB   
22/23 KB   
23/23 KB   
           
Downloaded: https://repo.maven.apache.org/maven2/fr/inria/gforge/spoon/spoon-core/7.1.0/spoon-core-7.1.0.pom (23 KB at 1047.9 KB/sec)
Downloading: http://maven.inria.fr/artifactory/spoon-public-snapshot/fr/inria/gforge/spoon/spoon-core/7.2.0-SNAPSHOT/maven-metadata.xml
Downloading: https://oss.sonatype.org/content/repositories/snapshots/fr/inria/gforge/spoon/spoon-core/7.2.0-SNAPSHOT/maven-metadata.xml
1017/1017 B   
              
Downloaded: http://maven.inria.fr/artifactory/spoon-public-snapshot/fr/inria/gforge/spoon/spoon-core/7.2.0-SNAPSHOT/maven-metadata.xml (1017 B at 28.4 KB/sec)
              
Downloading: http://maven.inria.fr/artifactory/spoon-public-snapshot/fr/inria/gforge/spoon/spoon-core/7.2.0-SNAPSHOT/spoon-core-7.2.0-20181204.080422-141.pom
4/7 KB        
7/7 KB   
         
Downloaded: http://maven.inria.fr/artifactory/spoon-public-snapshot/fr/inria/gforge/spoon/spoon-core/7.2.0-SNAPSHOT/spoon-core-7.2.0-20181204.080422-141.pom (7 KB at 211.3 KB/sec)
Downloading: https://repo.maven.apache.org/maven2/fr/inria/gforge/spoon/spoon-core/7.2.0/spoon-core-7.2.0.pom
2/7 KB   
3/7 KB   
5/7 KB   
6/7 KB   
7/7 KB   
7/7 KB   
         
Downloaded: https://repo.maven.apache.org/maven2/fr/inria/gforge/spoon/spoon-core/7.2.0/spoon-core-7.2.0.pom (7 KB at 307.0 KB/sec)
Downloading: http://maven.inria.fr/artifactory/spoon-public-snapshot/fr/inria/gforge/spoon/spoon-core/7.3.0-SNAPSHOT/maven-metadata.xml
Downloading: https://oss.sonatype.org/content/repositories/snapshots/fr/inria/gforge/spoon/spoon-core/7.3.0-SNAPSHOT/maven-metadata.xml
1013/1013 B   
              
Downloaded: http://maven.inria.fr/artifactory/spoon-public-snapshot/fr/inria/gforge/spoon/spoon-core/7.3.0-SNAPSHOT/maven-metadata.xml (1013 B at 30.0 KB/sec)
              
Downloading: http://maven.inria.fr/artifactory/spoon-public-snapshot/fr/inria/gforge/spoon/spoon-core/7.3.0-SNAPSHOT/spoon-core-7.3.0-20190210.234149-97.pom
4/7 KB        
7/7 KB   
         
Downloaded: http://maven.inria.fr/artifactory/spoon-public-snapshot/fr/inria/gforge/spoon/spoon-core/7.3.0-SNAPSHOT/spoon-core-7.3.0-20190210.234149-97.pom (7 KB at 206.1 KB/sec)
Downloading: https://repo.maven.apache.org/maven2/fr/inria/gforge/spoon/spoon-core/7.3.0/spoon-core-7.3.0.pom
2/7 KB   
3/7 KB   
5/7 KB   
6/7 KB   
7/7 KB   
         
Downloaded: https://repo.maven.apache.org/maven2/fr/inria/gforge/spoon/spoon-core/7.3.0/spoon-core-7.3.0.pom (7 KB at 313.6 KB/sec)
Downloading: https://repo.maven.apache.org/maven2/fr/inria/gforge/spoon/spoon-core/7.4.0-beta-09/spoon-core-7.4.0-beta-09.pom
2/7 KB   
3/7 KB   
5/7 KB   
6/7 KB   
7/7 KB   
         
Downloaded: https://repo.maven.apache.org/maven2/fr/inria/gforge/spoon/spoon-core/7.4.0-beta-09/spoon-core-7.4.0-beta-09.pom (7 KB at 322.2 KB/sec)
Downloading: https://repo.maven.apache.org/maven2/fr/inria/gforge/spoon/spoon-core/7.4.0-beta-10/spoon-core-7.4.0-beta-10.pom
2/7 KB   
3/7 KB   
5/7 KB   
6/7 KB   
7/7 KB   
         
Downloaded: https://repo.maven.apache.org/maven2/fr/inria/gforge/spoon/spoon-core/7.4.0-beta-10/spoon-core-7.4.0-beta-10.pom (7 KB at 306.8 KB/sec)
Downloading: https://repo.maven.apache.org/maven2/fr/inria/gforge/spoon/spoon-core/7.4.0-beta-11/spoon-core-7.4.0-beta-11.pom
2/7 KB   
3/7 KB   
5/7 KB   
6/7 KB   
7/7 KB   
         
Downloaded: https://repo.maven.apache.org/maven2/fr/inria/gforge/spoon/spoon-core/7.4.0-beta-11/spoon-core-7.4.0-beta-11.pom (7 KB at 379.0 KB/sec)
Downloading: https://repo.maven.apache.org/maven2/fr/inria/gforge/spoon/spoon-core/7.4.0-beta-12/spoon-core-7.4.0-beta-12.pom
2/7 KB   
3/7 KB   
5/7 KB   
6/7 KB   
7/7 KB   
         
Downloaded: https://repo.maven.apache.org/maven2/fr/inria/gforge/spoon/spoon-core/7.4.0-beta-12/spoon-core-7.4.0-beta-12.pom (7 KB at 257.7 KB/sec)
Downloading: https://repo.maven.apache.org/maven2/fr/inria/gforge/spoon/spoon-core/7.4.0-beta-13/spoon-core-7.4.0-beta-13.pom
2/7 KB   
3/7 KB   
5/7 KB   
6/7 KB   
7/7 KB   
         
Downloaded: https://repo.maven.apache.org/maven2/fr/inria/gforge/spoon/spoon-core/7.4.0-beta-13/spoon-core-7.4.0-beta-13.pom (7 KB at 585.8 KB/sec)
Downloading: https://repo.maven.apache.org/maven2/fr/inria/gforge/spoon/spoon-core/7.4.0-beta-14/spoon-core-7.4.0-beta-14.pom
2/7 KB   
3/7 KB   
5/7 KB   
6/7 KB   
7/7 KB   
         
Downloaded: https://repo.maven.apache.org/maven2/fr/inria/gforge/spoon/spoon-core/7.4.0-beta-14/spoon-core-7.4.0-beta-14.pom (7 KB at 402.7 KB/sec)
Downloading: https://repo.maven.apache.org/maven2/fr/inria/gforge/spoon/spoon-core/7.4.0-beta-15/spoon-core-7.4.0-beta-15.pom
2/7 KB   
3/7 KB   
5/7 KB   
6/7 KB   
7/7 KB   
         
Downloaded: https://repo.maven.apache.org/maven2/fr/inria/gforge/spoon/spoon-core/7.4.0-beta-15/spoon-core-7.4.0-beta-15.pom (7 KB at 339.1 KB/sec)
Downloading: https://repo.maven.apache.org/maven2/fr/inria/gforge/spoon/spoon-core/7.4.0-beta-16/spoon-core-7.4.0-beta-16.pom
2/7 KB   
3/7 KB   
5/7 KB   
6/7 KB   
7/7 KB   
         
Downloaded: https://repo.maven.apache.org/maven2/fr/inria/gforge/spoon/spoon-core/7.4.0-beta-16/spoon-core-7.4.0-beta-16.pom (7 KB at 460.2 KB/sec)
Downloading: https://repo.maven.apache.org/maven2/fr/inria/gforge/spoon/spoon-core/7.4.0-beta-17/spoon-core-7.4.0-beta-17.pom
2/7 KB   
3/7 KB   
5/7 KB   
6/7 KB   
7/7 KB   
         
Downloaded: https://repo.maven.apache.org/maven2/fr/inria/gforge/spoon/spoon-core/7.4.0-beta-17/spoon-core-7.4.0-beta-17.pom (7 KB at 429.6 KB/sec)
Downloading: https://repo.maven.apache.org/maven2/fr/inria/gforge/spoon/spoon-core/7.4.0-beta-18/spoon-core-7.4.0-beta-18.pom
2/7 KB   
3/7 KB   
5/7 KB   
6/7 KB   
7/7 KB   
         
Downloaded: https://repo.maven.apache.org/maven2/fr/inria/gforge/spoon/spoon-core/7.4.0-beta-18/spoon-core-7.4.0-beta-18.pom (7 KB at 402.7 KB/sec)
Downloading: https://repo.maven.apache.org/maven2/fr/inria/gforge/spoon/spoon-core/7.4.0-beta-19/spoon-core-7.4.0-beta-19.pom
2/7 KB   
3/7 KB   
5/7 KB   
6/7 KB   
7/7 KB   
         
Downloaded: https://repo.maven.apache.org/maven2/fr/inria/gforge/spoon/spoon-core/7.4.0-beta-19/spoon-core-7.4.0-beta-19.pom (7 KB at 460.2 KB/sec)
Downloading: http://maven.inria.fr/artifactory/spoon-public-snapshot/fr/inria/gforge/spoon/spoon-core/7.4.0-SNAPSHOT/maven-metadata.xml
Downloading: https://oss.sonatype.org/content/repositories/snapshots/fr/inria/gforge/spoon/spoon-core/7.4.0-SNAPSHOT/maven-metadata.xml
1017/1017 B   
              
Downloaded: http://maven.inria.fr/artifactory/spoon-public-snapshot/fr/inria/gforge/spoon/spoon-core/7.4.0-SNAPSHOT/maven-metadata.xml (1017 B at 24.2 KB/sec)
              
Downloading: http://maven.inria.fr/artifactory/spoon-public-snapshot/fr/inria/gforge/spoon/spoon-core/7.4.0-SNAPSHOT/spoon-core-7.4.0-20190510.045100-130.pom
4/7 KB        
5/7 KB   
7/7 KB   
         
Downloaded: http://maven.inria.fr/artifactory/spoon-public-snapshot/fr/inria/gforge/spoon/spoon-core/7.4.0-SNAPSHOT/spoon-core-7.4.0-20190510.045100-130.pom (7 KB at 194.0 KB/sec)
Downloading: https://repo.maven.apache.org/maven2/fr/inria/gforge/spoon/spoon-core/7.4.0/spoon-core-7.4.0.pom
2/7 KB   
3/7 KB   
5/7 KB   
6/7 KB   
7/7 KB   
         
Downloaded: https://repo.maven.apache.org/maven2/fr/inria/gforge/spoon/spoon-core/7.4.0/spoon-core-7.4.0.pom (7 KB at 459.7 KB/sec)
Downloading: https://repo.maven.apache.org/maven2/fr/inria/gforge/spoon/spoon-core/7.5.0-beta-1/spoon-core-7.5.0-beta-1.pom
2/7 KB   
3/7 KB   
5/7 KB   
6/7 KB   
7/7 KB   
         
Downloaded: https://repo.maven.apache.org/maven2/fr/inria/gforge/spoon/spoon-core/7.5.0-beta-1/spoon-core-7.5.0-beta-1.pom (7 KB at 247.8 KB/sec)
Downloading: https://repo.maven.apache.org/maven2/fr/inria/gforge/spoon/spoon-core/7.5.0-beta-2/spoon-core-7.5.0-beta-2.pom
2/7 KB   
3/7 KB   
5/7 KB   
6/7 KB   
7/7 KB   
         
Downloaded: https://repo.maven.apache.org/maven2/fr/inria/gforge/spoon/spoon-core/7.5.0-beta-2/spoon-core-7.5.0-beta-2.pom (7 KB at 379.0 KB/sec)
Downloading: https://repo.maven.apache.org/maven2/fr/inria/gforge/spoon/spoon-core/7.5.0-beta-3/spoon-core-7.5.0-beta-3.pom
2/7 KB   
3/7 KB   
5/7 KB   
6/7 KB   
7/7 KB   
         
Downloaded: https://repo.maven.apache.org/maven2/fr/inria/gforge/spoon/spoon-core/7.5.0-beta-3/spoon-core-7.5.0-beta-3.pom (7 KB at 585.7 KB/sec)
Downloading: https://repo.maven.apache.org/maven2/fr/inria/gforge/spoon/spoon-core/7.5.0-beta-4/spoon-core-7.5.0-beta-4.pom
2/7 KB   
3/7 KB   
5/7 KB   
6/7 KB   
7/7 KB   
         
Downloaded: https://repo.maven.apache.org/maven2/fr/inria/gforge/spoon/spoon-core/7.5.0-beta-4/spoon-core-7.5.0-beta-4.pom (7 KB at 495.6 KB/sec)
Downloading: https://repo.maven.apache.org/maven2/fr/inria/gforge/spoon/spoon-core/7.5.0-beta-5/spoon-core-7.5.0-beta-5.pom
2/7 KB   
3/7 KB   
5/7 KB   
6/7 KB   
7/7 KB   
         
Downloaded: https://repo.maven.apache.org/maven2/fr/inria/gforge/spoon/spoon-core/7.5.0-beta-5/spoon-core-7.5.0-beta-5.pom (7 KB at 536.9 KB/sec)
Downloading: https://repo.maven.apache.org/maven2/fr/inria/gforge/spoon/spoon-core/7.5.0-beta-6/spoon-core-7.5.0-beta-6.pom
2/7 KB   
3/7 KB   
5/7 KB   
6/7 KB   
7/7 KB   
         
Downloaded: https://repo.maven.apache.org/maven2/fr/inria/gforge/spoon/spoon-core/7.5.0-beta-6/spoon-core-7.5.0-beta-6.pom (7 KB at 460.2 KB/sec)
Downloading: https://repo.maven.apache.org/maven2/fr/inria/gforge/spoon/spoon-core/7.5.0-beta-7/spoon-core-7.5.0-beta-7.pom
4/7 KB   
7/7 KB   
         
Downloaded: https://repo.maven.apache.org/maven2/fr/inria/gforge/spoon/spoon-core/7.5.0-beta-7/spoon-core-7.5.0-beta-7.pom (7 KB at 536.9 KB/sec)
Downloading: https://repo.maven.apache.org/maven2/fr/inria/gforge/spoon/spoon-core/7.5.0-beta-8/spoon-core-7.5.0-beta-8.pom
4/7 KB   
7/7 KB   
         
Downloaded: https://repo.maven.apache.org/maven2/fr/inria/gforge/spoon/spoon-core/7.5.0-beta-8/spoon-core-7.5.0-beta-8.pom (7 KB at 536.9 KB/sec)
Downloading: https://repo.maven.apache.org/maven2/fr/inria/gforge/spoon/spoon-core/7.5.0-beta-9/spoon-core-7.5.0-beta-9.pom
4/7 KB   
7/7 KB   
         
Downloaded: https://repo.maven.apache.org/maven2/fr/inria/gforge/spoon/spoon-core/7.5.0-beta-9/spoon-core-7.5.0-beta-9.pom (7 KB at 585.7 KB/sec)
Downloading: https://repo.maven.apache.org/maven2/fr/inria/gforge/spoon/spoon-core/7.5.0-beta-20/spoon-core-7.5.0-beta-20.pom
4/7 KB   
7/7 KB   
         
Downloaded: https://repo.maven.apache.org/maven2/fr/inria/gforge/spoon/spoon-core/7.5.0-beta-20/spoon-core-7.5.0-beta-20.pom (7 KB at 495.6 KB/sec)
Downloading: https://repo.maven.apache.org/maven2/fr/inria/gforge/spoon/spoon-core/7.5.0-beta-21/spoon-core-7.5.0-beta-21.pom
4/7 KB   
7/7 KB   
         
Downloaded: https://repo.maven.apache.org/maven2/fr/inria/gforge/spoon/spoon-core/7.5.0-beta-21/spoon-core-7.5.0-beta-21.pom (7 KB at 536.9 KB/sec)
Downloading: http://maven.inria.fr/artifactory/spoon-public-snapshot/fr/inria/gforge/spoon/spoon-core/7.5.0-SNAPSHOT/maven-metadata.xml
Downloading: https://oss.sonatype.org/content/repositories/snapshots/fr/inria/gforge/spoon/spoon-core/7.5.0-SNAPSHOT/maven-metadata.xml
1017/1017 B   
              
Downloaded: http://maven.inria.fr/artifactory/spoon-public-snapshot/fr/inria/gforge/spoon/spoon-core/7.5.0-SNAPSHOT/maven-metadata.xml (1017 B at 34.2 KB/sec)
              
Downloading: http://maven.inria.fr/artifactory/spoon-public-snapshot/fr/inria/gforge/spoon/spoon-core/7.5.0-SNAPSHOT/spoon-core-7.5.0-20190727.224133-116.pom
4/7 KB        
7/7 KB   
         
Downloaded: http://maven.inria.fr/artifactory/spoon-public-snapshot/fr/inria/gforge/spoon/spoon-core/7.5.0-SNAPSHOT/spoon-core-7.5.0-20190727.224133-116.pom (7 KB at 178.2 KB/sec)
Downloading: https://repo.maven.apache.org/maven2/fr/inria/gforge/spoon/spoon-core/7.5.0/spoon-core-7.5.0.pom
4/7 KB   
7/7 KB   
         
Downloaded: https://repo.maven.apache.org/maven2/fr/inria/gforge/spoon/spoon-core/7.5.0/spoon-core-7.5.0.pom (7 KB at 495.0 KB/sec)
Downloading: https://repo.maven.apache.org/maven2/fr/inria/gforge/spoon/spoon-core/7.6.0-beta-1/spoon-core-7.6.0-beta-1.pom
4/7 KB   
7/7 KB   
         
Downloaded: https://repo.maven.apache.org/maven2/fr/inria/gforge/spoon/spoon-core/7.6.0-beta-1/spoon-core-7.6.0-beta-1.pom (7 KB at 339.1 KB/sec)
Downloading: https://repo.maven.apache.org/maven2/fr/inria/gforge/spoon/spoon-core/7.6.0-beta-2/spoon-core-7.6.0-beta-2.pom
4/7 KB   
7/7 KB   
         
Downloaded: https://repo.maven.apache.org/maven2/fr/inria/gforge/spoon/spoon-core/7.6.0-beta-2/spoon-core-7.6.0-beta-2.pom (7 KB at 402.6 KB/sec)
Downloading: https://repo.maven.apache.org/maven2/fr/inria/gforge/spoon/spoon-core/7.6.0-beta-3/spoon-core-7.6.0-beta-3.pom
4/7 KB   
7/7 KB   
         
Downloaded: https://repo.maven.apache.org/maven2/fr/inria/gforge/spoon/spoon-core/7.6.0-beta-3/spoon-core-7.6.0-beta-3.pom (7 KB at 402.6 KB/sec)
Downloading: https://repo.maven.apache.org/maven2/fr/inria/gforge/spoon/spoon-core/7.6.0-beta-4/spoon-core-7.6.0-beta-4.pom
4/7 KB   
7/7 KB   
         
Downloaded: https://repo.maven.apache.org/maven2/fr/inria/gforge/spoon/spoon-core/7.6.0-beta-4/spoon-core-7.6.0-beta-4.pom (7 KB at 644.2 KB/sec)
Downloading: https://repo.maven.apache.org/maven2/fr/inria/gforge/spoon/spoon-core/7.6.0-beta-5/spoon-core-7.6.0-beta-5.pom
4/6 KB   
6/6 KB   
         
Downloaded: https://repo.maven.apache.org/maven2/fr/inria/gforge/spoon/spoon-core/7.6.0-beta-5/spoon-core-7.6.0-beta-5.pom (6 KB at 595.5 KB/sec)
Downloading: https://repo.maven.apache.org/maven2/fr/inria/gforge/spoon/spoon-core/7.6.0-beta-6/spoon-core-7.6.0-beta-6.pom
4/6 KB   
6/6 KB   
         
Downloaded: https://repo.maven.apache.org/maven2/fr/inria/gforge/spoon/spoon-core/7.6.0-beta-6/spoon-core-7.6.0-beta-6.pom (6 KB at 350.3 KB/sec)
Downloading: http://maven.inria.fr/artifactory/spoon-public-snapshot/fr/inria/gforge/spoon/spoon-core/7.6.0-SNAPSHOT/maven-metadata.xml
Downloading: https://oss.sonatype.org/content/repositories/snapshots/fr/inria/gforge/spoon/spoon-core/7.6.0-SNAPSHOT/maven-metadata.xml
1017/1017 B   
              
Downloaded: http://maven.inria.fr/artifactory/spoon-public-snapshot/fr/inria/gforge/spoon/spoon-core/7.6.0-SNAPSHOT/maven-metadata.xml (1017 B at 26.1 KB/sec)
              
Downloading: http://maven.inria.fr/artifactory/spoon-public-snapshot/fr/inria/gforge/spoon/spoon-core/7.6.0-SNAPSHOT/spoon-core-7.6.0-20191029.234139-152.pom
3/7 KB        
7/7 KB   
7/7 KB   
         
Downloaded: http://maven.inria.fr/artifactory/spoon-public-snapshot/fr/inria/gforge/spoon/spoon-core/7.6.0-SNAPSHOT/spoon-core-7.6.0-20191029.234139-152.pom (7 KB at 179.6 KB/sec)
Downloading: https://repo.maven.apache.org/maven2/fr/inria/gforge/spoon/spoon-core/7.6.0/spoon-core-7.6.0.pom
4/6 KB   
6/6 KB   
         
Downloaded: https://repo.maven.apache.org/maven2/fr/inria/gforge/spoon/spoon-core/7.6.0/spoon-core-7.6.0.pom (6 KB at 396.5 KB/sec)
Downloading: https://repo.maven.apache.org/maven2/fr/inria/gforge/spoon/spoon-core/8.0.0-beta-1/spoon-core-8.0.0-beta-1.pom
4/6 KB   
6/6 KB   
         
Downloaded: https://repo.maven.apache.org/maven2/fr/inria/gforge/spoon/spoon-core/8.0.0-beta-1/spoon-core-8.0.0-beta-1.pom (6 KB at 397.0 KB/sec)
Downloading: http://maven.inria.fr/artifactory/spoon-public-snapshot/fr/inria/gforge/spoon/spoon-core/8.0.0-SNAPSHOT/maven-metadata.xml
Downloading: https://oss.sonatype.org/content/repositories/snapshots/fr/inria/gforge/spoon/spoon-core/8.0.0-SNAPSHOT/maven-metadata.xml
1013/1013 B   
              
Downloaded: http://maven.inria.fr/artifactory/spoon-public-snapshot/fr/inria/gforge/spoon/spoon-core/8.0.0-SNAPSHOT/maven-metadata.xml (1013 B at 20.6 KB/sec)
              
Downloading: http://maven.inria.fr/artifactory/spoon-public-snapshot/fr/inria/gforge/spoon/spoon-core/8.0.0-SNAPSHOT/spoon-core-8.0.0-20191105.234144-12.pom
4/7 KB        
7/7 KB   
         
Downloaded: http://maven.inria.fr/artifactory/spoon-public-snapshot/fr/inria/gforge/spoon/spoon-core/8.0.0-SNAPSHOT/spoon-core-8.0.0-20191105.234144-12.pom (7 KB at 197.0 KB/sec)
Downloading: https://repo.maven.apache.org/maven2/fr/inria/gforge/spoon/spoon-core/8.0.0/spoon-core-8.0.0.pom
4/6 KB   
6/6 KB   
         
Downloaded: https://repo.maven.apache.org/maven2/fr/inria/gforge/spoon/spoon-core/8.0.0/spoon-core-8.0.0.pom (6 KB at 349.9 KB/sec)
Downloading: https://repo.maven.apache.org/maven2/fr/inria/gforge/spoon/spoon-core/8.1.0-beta-1/spoon-core-8.1.0-beta-1.pom
4/6 KB   
6/6 KB   
         
Downloaded: https://repo.maven.apache.org/maven2/fr/inria/gforge/spoon/spoon-core/8.1.0-beta-1/spoon-core-8.1.0-beta-1.pom (6 KB at 372.2 KB/sec)
Downloading: https://repo.maven.apache.org/maven2/fr/inria/gforge/spoon/spoon-core/8.1.0-beta-2/spoon-core-8.1.0-beta-2.pom
4/6 KB   
6/6 KB   
         
Downloaded: https://repo.maven.apache.org/maven2/fr/inria/gforge/spoon/spoon-core/8.1.0-beta-2/spoon-core-8.1.0-beta-2.pom (6 KB at 425.4 KB/sec)
Downloading: https://repo.maven.apache.org/maven2/fr/inria/gforge/spoon/spoon-core/8.1.0-beta-3/spoon-core-8.1.0-beta-3.pom
4/7 KB   
7/7 KB   
         
Downloaded: https://repo.maven.apache.org/maven2/fr/inria/gforge/spoon/spoon-core/8.1.0-beta-3/spoon-core-8.1.0-beta-3.pom (7 KB at 395.6 KB/sec)
Downloading: https://repo.maven.apache.org/maven2/fr/inria/gforge/spoon/spoon-core/8.1.0-beta-4/spoon-core-8.1.0-beta-4.pom
4/7 KB   
7/7 KB   
         
Downloaded: https://repo.maven.apache.org/maven2/fr/inria/gforge/spoon/spoon-core/8.1.0-beta-4/spoon-core-8.1.0-beta-4.pom (7 KB at 448.3 KB/sec)
Downloading: https://repo.maven.apache.org/maven2/fr/inria/gforge/spoon/spoon-core/8.1.0-beta-5/spoon-core-8.1.0-beta-5.pom
4/7 KB   
7/7 KB   
         
Downloaded: https://repo.maven.apache.org/maven2/fr/inria/gforge/spoon/spoon-core/8.1.0-beta-5/spoon-core-8.1.0-beta-5.pom (7 KB at 480.3 KB/sec)
Downloading: https://repo.maven.apache.org/maven2/fr/inria/gforge/spoon/spoon-core/8.1.0-beta-6/spoon-core-8.1.0-beta-6.pom
4/7 KB   
7/7 KB   
         
Downloaded: https://repo.maven.apache.org/maven2/fr/inria/gforge/spoon/spoon-core/8.1.0-beta-6/spoon-core-8.1.0-beta-6.pom (7 KB at 448.3 KB/sec)
Downloading: https://repo.maven.apache.org/maven2/fr/inria/gforge/spoon/spoon-core/8.1.0-beta-7/spoon-core-8.1.0-beta-7.pom
4/7 KB   
7/7 KB   
         
Downloaded: https://repo.maven.apache.org/maven2/fr/inria/gforge/spoon/spoon-core/8.1.0-beta-7/spoon-core-8.1.0-beta-7.pom (7 KB at 353.9 KB/sec)
Downloading: https://repo.maven.apache.org/maven2/fr/inria/gforge/spoon/spoon-core/8.1.0-beta-8/spoon-core-8.1.0-beta-8.pom
4/7 KB   
7/7 KB   
         
Downloaded: https://repo.maven.apache.org/maven2/fr/inria/gforge/spoon/spoon-core/8.1.0-beta-8/spoon-core-8.1.0-beta-8.pom (7 KB at 480.3 KB/sec)
Downloading: https://repo.maven.apache.org/maven2/fr/inria/gforge/spoon/spoon-core/8.1.0-beta-9/spoon-core-8.1.0-beta-9.pom
4/7 KB   
7/7 KB   
         
Downloaded: https://repo.maven.apache.org/maven2/fr/inria/gforge/spoon/spoon-core/8.1.0-beta-9/spoon-core-8.1.0-beta-9.pom (7 KB at 480.3 KB/sec)
Downloading: https://repo.maven.apache.org/maven2/fr/inria/gforge/spoon/spoon-core/8.1.0-beta-10/spoon-core-8.1.0-beta-10.pom
4/7 KB   
7/7 KB   
         
Downloaded: https://repo.maven.apache.org/maven2/fr/inria/gforge/spoon/spoon-core/8.1.0-beta-10/spoon-core-8.1.0-beta-10.pom (7 KB at 482.2 KB/sec)
Downloading: https://repo.maven.apache.org/maven2/fr/inria/gforge/spoon/spoon-core/8.1.0-beta-11/spoon-core-8.1.0-beta-11.pom
4/7 KB   
7/7 KB   
         
Downloaded: https://repo.maven.apache.org/maven2/fr/inria/gforge/spoon/spoon-core/8.1.0-beta-11/spoon-core-8.1.0-beta-11.pom (7 KB at 482.2 KB/sec)
Downloading: https://repo.maven.apache.org/maven2/fr/inria/gforge/spoon/spoon-core/8.1.0-beta-12/spoon-core-8.1.0-beta-12.pom
4/7 KB   
7/7 KB   
         
Downloaded: https://repo.maven.apache.org/maven2/fr/inria/gforge/spoon/spoon-core/8.1.0-beta-12/spoon-core-8.1.0-beta-12.pom (7 KB at 410.2 KB/sec)
Downloading: https://repo.maven.apache.org/maven2/fr/inria/gforge/spoon/spoon-core/8.1.0-beta-13/spoon-core-8.1.0-beta-13.pom
4/8 KB   
8/8 KB   
         
Downloaded: https://repo.maven.apache.org/maven2/fr/inria/gforge/spoon/spoon-core/8.1.0-beta-13/spoon-core-8.1.0-beta-13.pom (8 KB at 595.7 KB/sec)
Downloading: https://repo.maven.apache.org/maven2/fr/inria/gforge/spoon/spoon-core/8.1.0-beta-14/spoon-core-8.1.0-beta-14.pom
4/8 KB   
8/8 KB   
         
Downloaded: https://repo.maven.apache.org/maven2/fr/inria/gforge/spoon/spoon-core/8.1.0-beta-14/spoon-core-8.1.0-beta-14.pom (8 KB at 595.7 KB/sec)
Downloading: https://repo.maven.apache.org/maven2/fr/inria/gforge/spoon/spoon-core/8.1.0-beta-15/spoon-core-8.1.0-beta-15.pom
4/8 KB   
8/8 KB   
         
Downloaded: https://repo.maven.apache.org/maven2/fr/inria/gforge/spoon/spoon-core/8.1.0-beta-15/spoon-core-8.1.0-beta-15.pom (8 KB at 595.7 KB/sec)
Downloading: https://repo.maven.apache.org/maven2/fr/inria/gforge/spoon/spoon-core/8.1.0-beta-16/spoon-core-8.1.0-beta-16.pom
4/8 KB   
8/8 KB   
         
Downloaded: https://repo.maven.apache.org/maven2/fr/inria/gforge/spoon/spoon-core/8.1.0-beta-16/spoon-core-8.1.0-beta-16.pom (8 KB at 649.9 KB/sec)
Downloading: https://repo.maven.apache.org/maven2/fr/inria/gforge/spoon/spoon-core/8.1.0-beta-17/spoon-core-8.1.0-beta-17.pom
4/8 KB   
8/8 KB   
         
Downloaded: https://repo.maven.apache.org/maven2/fr/inria/gforge/spoon/spoon-core/8.1.0-beta-17/spoon-core-8.1.0-beta-17.pom (8 KB at 446.8 KB/sec)
Downloading: https://repo.maven.apache.org/maven2/fr/inria/gforge/spoon/spoon-core/8.1.0-beta-18/spoon-core-8.1.0-beta-18.pom
4/8 KB   
8/8 KB   
         
Downloaded: https://repo.maven.apache.org/maven2/fr/inria/gforge/spoon/spoon-core/8.1.0-beta-18/spoon-core-8.1.0-beta-18.pom (8 KB at 563.0 KB/sec)
Downloading: https://repo.maven.apache.org/maven2/fr/inria/gforge/spoon/spoon-core/8.1.0-beta-19/spoon-core-8.1.0-beta-19.pom
4/8 KB   
8/8 KB   
         
Downloaded: https://repo.maven.apache.org/maven2/fr/inria/gforge/spoon/spoon-core/8.1.0-beta-19/spoon-core-8.1.0-beta-19.pom (8 KB at 522.7 KB/sec)
Downloading: http://maven.inria.fr/artifactory/spoon-public-snapshot/fr/inria/gforge/spoon/spoon-core/8.1.0-SNAPSHOT/maven-metadata.xml
Downloading: https://oss.sonatype.org/content/repositories/snapshots/fr/inria/gforge/spoon/spoon-core/8.1.0-SNAPSHOT/maven-metadata.xml
1017/1017 B   
              
Downloaded: http://maven.inria.fr/artifactory/spoon-public-snapshot/fr/inria/gforge/spoon/spoon-core/8.1.0-SNAPSHOT/maven-metadata.xml (1017 B at 26.1 KB/sec)
              
Downloading: http://maven.inria.fr/artifactory/spoon-public-snapshot/fr/inria/gforge/spoon/spoon-core/8.1.0-SNAPSHOT/spoon-core-8.1.0-20200323.060424-201.pom
4/8 KB        
8/8 KB   
8/8 KB   
         
Downloaded: http://maven.inria.fr/artifactory/spoon-public-snapshot/fr/inria/gforge/spoon/spoon-core/8.1.0-SNAPSHOT/spoon-core-8.1.0-20200323.060424-201.pom (8 KB at 213.9 KB/sec)
Downloading: https://repo.maven.apache.org/maven2/fr/inria/gforge/spoon/spoon-core/8.1.0/spoon-core-8.1.0.pom
4/8 KB   
8/8 KB   
         
Downloaded: https://repo.maven.apache.org/maven2/fr/inria/gforge/spoon/spoon-core/8.1.0/spoon-core-8.1.0.pom (8 KB at 664.6 KB/sec)
Downloading: https://repo.maven.apache.org/maven2/fr/inria/gforge/spoon/spoon-core/8.2.0-beta-1/spoon-core-8.2.0-beta-1.pom
4/8 KB   
8/8 KB   
         
Downloaded: https://repo.maven.apache.org/maven2/fr/inria/gforge/spoon/spoon-core/8.2.0-beta-1/spoon-core-8.2.0-beta-1.pom (8 KB at 365.9 KB/sec)
Downloading: https://repo.maven.apache.org/maven2/fr/inria/gforge/spoon/spoon-core/8.2.0-beta-2/spoon-core-8.2.0-beta-2.pom
4/8 KB   
8/8 KB   
         
Downloaded: https://repo.maven.apache.org/maven2/fr/inria/gforge/spoon/spoon-core/8.2.0-beta-2/spoon-core-8.2.0-beta-2.pom (8 KB at 487.8 KB/sec)
Downloading: https://repo.maven.apache.org/maven2/fr/inria/gforge/spoon/spoon-core/8.2.0-beta-3/spoon-core-8.2.0-beta-3.pom
4/8 KB   
8/8 KB   
         
Downloaded: https://repo.maven.apache.org/maven2/fr/inria/gforge/spoon/spoon-core/8.2.0-beta-3/spoon-core-8.2.0-beta-3.pom (8 KB at 522.7 KB/sec)
Downloading: https://repo.maven.apache.org/maven2/fr/inria/gforge/spoon/spoon-core/8.2.0-beta-4/spoon-core-8.2.0-beta-4.pom
4/8 KB   
8/8 KB   
         
Downloaded: https://repo.maven.apache.org/maven2/fr/inria/gforge/spoon/spoon-core/8.2.0-beta-4/spoon-core-8.2.0-beta-4.pom (8 KB at 665.2 KB/sec)
Downloading: https://oss.sonatype.org/content/repositories/snapshots/fr/inria/gforge/spoon/spoon-core/8.2.0-SNAPSHOT/maven-metadata.xml
Downloading: http://maven.inria.fr/artifactory/spoon-public-snapshot/fr/inria/gforge/spoon/spoon-core/8.2.0-SNAPSHOT/maven-metadata.xml
1013/1013 B   
              
Downloaded: http://maven.inria.fr/artifactory/spoon-public-snapshot/fr/inria/gforge/spoon/spoon-core/8.2.0-SNAPSHOT/maven-metadata.xml (1013 B at 31.9 KB/sec)
              
Downloading: http://maven.inria.fr/artifactory/spoon-public-snapshot/fr/inria/gforge/spoon/spoon-core/8.2.0-SNAPSHOT/spoon-core-8.2.0-20200419.224145-32.pom
4/8 KB        
8/8 KB   
8/8 KB   
         
Downloaded: http://maven.inria.fr/artifactory/spoon-public-snapshot/fr/inria/gforge/spoon/spoon-core/8.2.0-SNAPSHOT/spoon-core-8.2.0-20200419.224145-32.pom (8 KB at 213.9 KB/sec)
Downloading: http://maven.inria.fr/artifactory/spoon-public-snapshot/fr/inria/gforge/spoon/spoon-core/8.2.0-SNAPSHOT/spoon-core-8.2.0-20200419.224145-32.jar
4/1735 KB   
8/1735 KB   
12/1735 KB   
16/1735 KB   
20/1735 KB   
21/1735 KB   
25/1735 KB   
29/1735 KB   
33/1735 KB   
37/1735 KB   
41/1735 KB   
44/1735 KB   
48/1735 KB   
50/1735 KB   
53/1735 KB   
57/1735 KB   
58/1735 KB   
62/1735 KB   
65/1735 KB   
67/1735 KB   
71/1735 KB   
75/1735 KB   
79/1735 KB   
83/1735 KB   
87/1735 KB   
91/1735 KB   
95/1735 KB   
99/1735 KB   
103/1735 KB   
107/1735 KB   
111/1735 KB   
115/1735 KB   
119/1735 KB   
123/1735 KB   
127/1735 KB   
131/1735 KB   
135/1735 KB   
139/1735 KB   
143/1735 KB   
147/1735 KB   
151/1735 KB   
155/1735 KB   
157/1735 KB   
161/1735 KB   
165/1735 KB   
169/1735 KB   
173/1735 KB   
177/1735 KB   
181/1735 KB   
185/1735 KB   
189/1735 KB   
193/1735 KB   
197/1735 KB   
201/1735 KB   
205/1735 KB   
209/1735 KB   
213/1735 KB   
217/1735 KB   
221/1735 KB   
225/1735 KB   
229/1735 KB   
233/1735 KB   
237/1735 KB   
241/1735 KB   
245/1735 KB   
249/1735 KB   
253/1735 KB   
257/1735 KB   
261/1735 KB   
265/1735 KB   
269/1735 KB   
273/1735 KB   
277/1735 KB   
281/1735 KB   
285/1735 KB   
289/1735 KB   
293/1735 KB   
297/1735 KB   
301/1735 KB   
305/1735 KB   
309/1735 KB   
313/1735 KB   
317/1735 KB   
321/1735 KB   
325/1735 KB   
329/1735 KB   
333/1735 KB   
337/1735 KB   
341/1735 KB   
345/1735 KB   
349/1735 KB   
353/1735 KB   
357/1735 KB   
361/1735 KB   
365/1735 KB   
369/1735 KB   
373/1735 KB   
377/1735 KB   
381/1735 KB   
385/1735 KB   
389/1735 KB   
393/1735 KB   
397/1735 KB   
401/1735 KB   
405/1735 KB   
409/1735 KB   
413/1735 KB   
417/1735 KB   
421/1735 KB   
425/1735 KB   
429/1735 KB   
433/1735 KB   
437/1735 KB   
441/1735 KB   
445/1735 KB   
449/1735 KB   
453/1735 KB   
457/1735 KB   
461/1735 KB   
465/1735 KB   
469/1735 KB   
473/1735 KB   
477/1735 KB   
481/1735 KB   
485/1735 KB   
489/1735 KB   
493/1735 KB   
497/1735 KB   
501/1735 KB   
505/1735 KB   
509/1735 KB   
513/1735 KB   
517/1735 KB   
521/1735 KB   
525/1735 KB   
529/1735 KB   
533/1735 KB   
537/1735 KB   
541/1735 KB   
545/1735 KB   
549/1735 KB   
553/1735 KB   
557/1735 KB   
561/1735 KB   
565/1735 KB   
569/1735 KB   
573/1735 KB   
577/1735 KB   
581/1735 KB   
585/1735 KB   
589/1735 KB   
593/1735 KB   
597/1735 KB   
601/1735 KB   
605/1735 KB   
609/1735 KB   
613/1735 KB   
617/1735 KB   
621/1735 KB   
625/1735 KB   
629/1735 KB   
633/1735 KB   
637/1735 KB   
641/1735 KB   
645/1735 KB   
649/1735 KB   
653/1735 KB   
657/1735 KB   
661/1735 KB   
665/1735 KB   
669/1735 KB   
673/1735 KB   
677/1735 KB   
681/1735 KB   
685/1735 KB   
689/1735 KB   
693/1735 KB   
697/1735 KB   
701/1735 KB   
705/1735 KB   
709/1735 KB   
713/1735 KB   
717/1735 KB   
721/1735 KB   
725/1735 KB   
729/1735 KB   
733/1735 KB   
737/1735 KB   
741/1735 KB   
745/1735 KB   
749/1735 KB   
753/1735 KB   
757/1735 KB   
761/1735 KB   
765/1735 KB   
769/1735 KB   
773/1735 KB   
777/1735 KB   
781/1735 KB   
785/1735 KB   
789/1735 KB   
793/1735 KB   
797/1735 KB   
801/1735 KB   
805/1735 KB   
809/1735 KB   
813/1735 KB   
817/1735 KB   
821/1735 KB   
825/1735 KB   
829/1735 KB   
833/1735 KB   
837/1735 KB   
841/1735 KB   
845/1735 KB   
849/1735 KB   
853/1735 KB   
857/1735 KB   
861/1735 KB   
865/1735 KB   
869/1735 KB   
873/1735 KB   
877/1735 KB   
881/1735 KB   
885/1735 KB   
889/1735 KB   
893/1735 KB   
897/1735 KB   
901/1735 KB   
905/1735 KB   
909/1735 KB   
913/1735 KB   
917/1735 KB   
921/1735 KB   
925/1735 KB   
929/1735 KB   
933/1735 KB   
937/1735 KB   
941/1735 KB   
945/1735 KB   
949/1735 KB   
953/1735 KB   
957/1735 KB   
961/1735 KB   
965/1735 KB   
969/1735 KB   
973/1735 KB   
977/1735 KB   
981/1735 KB   
985/1735 KB   
989/1735 KB   
993/1735 KB   
997/1735 KB   
1001/1735 KB   
1005/1735 KB   
1009/1735 KB   
1013/1735 KB   
1017/1735 KB   
1021/1735 KB   
1025/1735 KB   
1029/1735 KB   
1033/1735 KB   
1037/1735 KB   
1041/1735 KB   
1045/1735 KB   
1049/1735 KB   
1053/1735 KB   
1057/1735 KB   
1061/1735 KB   
1065/1735 KB   
1069/1735 KB   
1073/1735 KB   
1077/1735 KB   
1081/1735 KB   
1085/1735 KB   
1089/1735 KB   
1093/1735 KB   
1097/1735 KB   
1101/1735 KB   
1105/1735 KB   
1109/1735 KB   
1113/1735 KB   
1117/1735 KB   
1121/1735 KB   
1125/1735 KB   
1129/1735 KB   
1133/1735 KB   
1137/1735 KB   
1141/1735 KB   
1145/1735 KB   
1149/1735 KB   
1153/1735 KB   
1157/1735 KB   
1161/1735 KB   
1165/1735 KB   
1169/1735 KB   
1173/1735 KB   
1177/1735 KB   
1181/1735 KB   
1185/1735 KB   
1189/1735 KB   
1193/1735 KB   
1197/1735 KB   
1201/1735 KB   
1205/1735 KB   
1209/1735 KB   
1213/1735 KB   
1217/1735 KB   
1221/1735 KB   
1225/1735 KB   
1229/1735 KB   
1233/1735 KB   
1237/1735 KB   
1241/1735 KB   
1245/1735 KB   
1249/1735 KB   
1253/1735 KB   
1257/1735 KB   
1261/1735 KB   
1265/1735 KB   
1269/1735 KB   
1273/1735 KB   
1277/1735 KB   
1281/1735 KB   
1285/1735 KB   
1289/1735 KB   
1293/1735 KB   
1297/1735 KB   
1301/1735 KB   
1305/1735 KB   
1309/1735 KB   
1313/1735 KB   
1317/1735 KB   
1321/1735 KB   
1325/1735 KB   
1329/1735 KB   
1333/1735 KB   
1337/1735 KB   
1341/1735 KB   
1345/1735 KB   
1349/1735 KB   
1353/1735 KB   
1357/1735 KB   
1361/1735 KB   
1365/1735 KB   
1369/1735 KB   
1373/1735 KB   
1377/1735 KB   
1381/1735 KB   
1385/1735 KB   
1389/1735 KB   
1393/1735 KB   
1397/1735 KB   
1401/1735 KB   
1405/1735 KB   
1406/1735 KB   
1407/1735 KB   
1411/1735 KB   
1415/1735 KB   
1419/1735 KB   
1423/1735 KB   
1427/1735 KB   
1431/1735 KB   
1435/1735 KB   
1439/1735 KB   
1443/1735 KB   
1447/1735 KB   
1450/1735 KB   
1454/1735 KB   
1455/1735 KB   
1459/1735 KB   
1463/1735 KB   
1465/1735 KB   
1469/1735 KB   
1469/1735 KB   
1473/1735 KB   
1477/1735 KB   
1481/1735 KB   
1485/1735 KB   
1489/1735 KB   
1493/1735 KB   
1497/1735 KB   
1501/1735 KB   
1505/1735 KB   
1509/1735 KB   
1513/1735 KB   
1517/1735 KB   
1521/1735 KB   
1525/1735 KB   
1529/1735 KB   
1533/1735 KB   
1537/1735 KB   
1541/1735 KB   
1545/1735 KB   
1549/1735 KB   
1553/1735 KB   
1557/1735 KB   
1561/1735 KB   
1565/1735 KB   
1569/1735 KB   
1573/1735 KB   
1577/1735 KB   
1581/1735 KB   
1585/1735 KB   
1589/1735 KB   
1593/1735 KB   
1597/1735 KB   
1601/1735 KB   
1605/1735 KB   
1609/1735 KB   
1613/1735 KB   
1617/1735 KB   
1621/1735 KB   
1625/1735 KB   
1629/1735 KB   
1633/1735 KB   
1637/1735 KB   
1641/1735 KB   
1645/1735 KB   
1649/1735 KB   
1653/1735 KB   
1657/1735 KB   
1661/1735 KB   
1665/1735 KB   
1669/1735 KB   
1673/1735 KB   
1677/1735 KB   
1681/1735 KB   
1685/1735 KB   
1689/1735 KB   
1693/1735 KB   
1697/1735 KB   
1701/1735 KB   
1705/1735 KB   
1709/1735 KB   
1713/1735 KB   
1717/1735 KB   
1721/1735 KB   
1725/1735 KB   
1729/1735 KB   
1733/1735 KB   
1735/1735 KB   
               
Downloaded: http://maven.inria.fr/artifactory/spoon-public-snapshot/fr/inria/gforge/spoon/spoon-core/8.2.0-SNAPSHOT/spoon-core-8.2.0-20200419.224145-32.jar (1735 KB at 7778.6 KB/sec)
[INFO] Running in NOCLASSPATH mode (doc: http://spoon.gforge.inria.fr/launcher.html).
[INFO] Running in NOCLASSPATH mode (doc: http://spoon.gforge.inria.fr/launcher.html).
[INFO] Spoon version 8.2.0-SNAPSHOT
[INFO] running Spoon...
[INFO] start processing...
[INFO] spoon.processing.SpoonTagger
[INFO] spoon.support.JavaOutputProcessor
[INFO] end of processing: 
[INFO] no errors, no warnings
[INFO] 
[INFO] --- maven-resources-plugin:3.0.1:resources (default-resources) @ jsoup ---
[INFO] Using 'UTF-8' encoding to copy filtered resources.
[INFO] Copying 3 resources to META-INF/
[INFO] 
[INFO] --- maven-compiler-plugin:3.8.0:compile (default-compile) @ jsoup ---
[INFO] Compiling 68 source files to /builds/workspace/Jsoup/target/classes
[INFO] -------------------------------------------------------------
[ERROR] COMPILATION ERROR : 
[INFO] -------------------------------------------------------------
[ERROR] /builds/workspace/Jsoup/target/generated-sources/spoon/org/jsoup/nodes/Entities.java:[60,69] non-static variable nameVals cannot be referenced from a static context
[ERROR] /builds/workspace/Jsoup/target/generated-sources/spoon/org/jsoup/nodes/Entities.java:[66,55] non-static variable nameKeys cannot be referenced from a static context
[INFO] 2 errors 
[INFO] -------------------------------------------------------------
[INFO] ------------------------------------------------------------------------
[INFO] BUILD FAILURE
[INFO] ------------------------------------------------------------------------
[INFO] Total time: 16.321 s
[INFO] Finished at: 2020-04-20T03:24:54+02:00
[INFO] Final Memory: 33M/223M
[INFO] ------------------------------------------------------------------------
[ERROR] Failed to execute goal org.apache.maven.plugins:maven-compiler-plugin:3.8.0:compile (default-compile) on project jsoup: Compilation failure: Compilation failure:
[ERROR] /builds/workspace/Jsoup/target/generated-sources/spoon/org/jsoup/nodes/Entities.java:[60,69] non-static variable nameVals cannot be referenced from a static context
[ERROR] /builds/workspace/Jsoup/target/generated-sources/spoon/org/jsoup/nodes/Entities.java:[66,55] non-static variable nameKeys cannot be referenced from a static context
[ERROR] -> [Help 1]
[ERROR] 
[ERROR] To see the full stack trace of the errors, re-run Maven with the -e switch.
[ERROR] Re-run Maven using the -X switch to enable full debug logging.
[ERROR] 
[ERROR] For more information about the errors and possible solutions, please read the following articles:
[ERROR] [Help 1] http://cwiki.apache.org/confluence/display/MAVEN/MojoFailureException
Error: Maven compile with spoon unsuccessful!
Build step 'Execute shell' marked build as failure
Archiving artifacts
/net/www/ci/sos/jobs/Jsoup/builds/1291/archive does not exist.
ERROR: Step ‘Publish XML Summary Reports’ failed: /net/www/ci/sos/jobs/Jsoup/builds/1291/archive does not exist.
Sending e-mails to: spoon-devel@lists.gforge.inria.fr
Finished: FAILURE